(view as text)
make release-test
 in dir C:\msys32\home\buildbot\slave\monero-tests-windows-10-i686\build
 watching logfiles {'LastTest.log': 'build/release/Testing/Temporary/LastTest.log', 'CTestCostData.txt': 'build/release/Testing/Temporary/CTestCostData.txt'}
 argv: ['make', 'release-test']
 environment:
  ALLUSERSPROFILE=C:\ProgramData
  APPDATA=C:\Windows\system32\config\systemprofile\AppData\Roaming
  CHOCOLATEYINSTALL=C:\ProgramData\chocolatey
  COMMONPROGRAMFILES=C:\Program Files\Common Files
  COMPUTERNAME=DESKTOP-7NB6IPI
  COMSPEC=C:\Windows\system32\cmd.exe
  HOME=C:\msys32\home\SYSTEM
  LOCALAPPDATA=C:\Windows\system32\config\systemprofile\AppData\Local
  NUMBER_OF_PROCESSORS=1
  OS=Windows_NT
  PATH=C:\msys32\usr\bin;C:\Python27;C:\Python27\Scripts;C:\Windows\system32;C:\Windows;C:\Windows\System32\Wbem;C:\Windows\System32\WindowsPowerShell\v1.0;C:\ProgramData\chocolatey\bin;C:\msys32\mingw32\bin;C:\Windows\system32\config\systemprofile\AppData\Local\Microsoft\WindowsApps;C:\python27\lib\site-packages\pywin32_system32
  PATHEXT=.COM;.EXE;.BAT;.CMD;.VBS;.VBE;.JS;.JSE;.WSF;.WSH;.MSC
  PROCESSOR_ARCHITECTURE=x86
  PROCESSOR_IDENTIFIER=x86 Family 6 Model 62 Stepping 4, GenuineIntel
  PROCESSOR_LEVEL=6
  PROCESSOR_REVISION=3e04
  PROGRAMDATA=C:\ProgramData
  PROGRAMFILES=C:\Program Files
  PSMODULEPATH=C:\Program Files\WindowsPowerShell\Modules;C:\Windows\system32\WindowsPowerShell\v1.0\Modules
  PUBLIC=C:\Users\Public
  PWD=C:\msys32\home\buildbot\slave\monero-tests-windows-10-i686\build
  SYSTEMDRIVE=C:
  SYSTEMROOT=C:\Windows
  TEMP=C:\Windows\TEMP
  TERM=cygwin
  TMP=C:\Windows\TEMP
  USERDOMAIN=WORKGROUP
  USERNAME=DESKTOP-7NB6IPI$
  USERPROFILE=C:\Windows\system32\config\systemprofile
  WINDIR=C:\Windows
 using PTY: False
mkdir -p build/release
cd build/release && cmake -D BUILD_TESTS=ON -D CMAKE_BUILD_TYPE=release ../.. && make && make test
-- Could not find DEVELOPER_LOCAL_TOOLS in env (not required)
-- BOOST_IGNORE_SYSTEM_PATHS defaults to OFF
-- Could not find DEVELOPER_LIBUNBOUND_OLD in env (not required)
-- Building for a 32-bit system
-- Building internal libraries as static
-- MSYS location: C:/msys32
-- Could not find DATABASE in env (not required unless you want to change database type from default: lmdb)
-- Using LMDB as default DB type
-- Could not find libunwind (missing:  LIBUNWIND_INCLUDE_DIR LIBUNWIND_LIBRARIES) 
-- Stack trace on exception disabled
-- Detecting version of miniupnpc in path: C:/msys32/mingw32/include/miniupnpc
-- Found miniupnpc version is v1.7 or higher
-- Using miniupnpc from local source tree for static build
-- Looking for libunbound
-- Using 32-bit LMDB from source tree
-- Building on  for i686
-- AES support enabled
-- Found Boost Version: 106000
-- Found Git: C:/msys32/usr/bin/git.exe
-- Found GTest: C:/msys32/mingw32/lib/libgtest.dll.a  
Doxygen: graphviz not found - graphs disabled
-- Configuring done
-- Generating done
-- Build files have been written to: C:/msys32/home/buildbot/slave/monero-tests-windows-10-i686/build/build/release
make[1]: Entering directory '/home/buildbot/slave/monero-tests-windows-10-i686/build/build/release'
make[2]: Entering directory '/home/buildbot/slave/monero-tests-windows-10-i686/build/build/release'
make[3]: Entering directory '/home/buildbot/slave/monero-tests-windows-10-i686/build/build/release'
make[3]: Leaving directory '/home/buildbot/slave/monero-tests-windows-10-i686/build/build/release'
[  0%] Built target version
make[3]: Entering directory '/home/buildbot/slave/monero-tests-windows-10-i686/build/build/release'
make[3]: Leaving directory '/home/buildbot/slave/monero-tests-windows-10-i686/build/build/release'
[  6%] Built target libminiupnpc-static
make[3]: Entering directory '/home/buildbot/slave/monero-tests-windows-10-i686/build/build/release'
make[3]: Leaving directory '/home/buildbot/slave/monero-tests-windows-10-i686/build/build/release'
[ 37%] Built target unbound
make[3]: Entering directory '/home/buildbot/slave/monero-tests-windows-10-i686/build/build/release'
make[3]: Leaving directory '/home/buildbot/slave/monero-tests-windows-10-i686/build/build/release'
[ 38%] Built target lmdb
make[3]: Entering directory '/home/buildbot/slave/monero-tests-windows-10-i686/build/build/release'
make[3]: Leaving directory '/home/buildbot/slave/monero-tests-windows-10-i686/build/build/release'
[ 40%] Built target otshell_utils
make[3]: Entering directory '/home/buildbot/slave/monero-tests-windows-10-i686/build/build/release'
make[3]: Leaving directory '/home/buildbot/slave/monero-tests-windows-10-i686/build/build/release'
[ 42%] Built target obj_common
make[3]: Entering directory '/home/buildbot/slave/monero-tests-windows-10-i686/build/build/release'
make[3]: Leaving directory '/home/buildbot/slave/monero-tests-windows-10-i686/build/build/release'
[ 49%] Built target obj_crypto
make[3]: Entering directory '/home/buildbot/slave/monero-tests-windows-10-i686/build/build/release'
make[3]: Leaving directory '/home/buildbot/slave/monero-tests-windows-10-i686/build/build/release'
[ 49%] Built target crypto
make[3]: Entering directory '/home/buildbot/slave/monero-tests-windows-10-i686/build/build/release'
make[3]: Leaving directory '/home/buildbot/slave/monero-tests-windows-10-i686/build/build/release'
[ 49%] Built target common
make[3]: Entering directory '/home/buildbot/slave/monero-tests-windows-10-i686/build/build/release'
make[3]: Leaving directory '/home/buildbot/slave/monero-tests-windows-10-i686/build/build/release'
[ 50%] Built target obj_ringct
make[3]: Entering directory '/home/buildbot/slave/monero-tests-windows-10-i686/build/build/release'
make[3]: Leaving directory '/home/buildbot/slave/monero-tests-windows-10-i686/build/build/release'
[ 50%] Built target ringct
make[3]: Entering directory '/home/buildbot/slave/monero-tests-windows-10-i686/build/build/release'
make[3]: Leaving directory '/home/buildbot/slave/monero-tests-windows-10-i686/build/build/release'
[ 54%] Built target obj_cryptonote_core
make[3]: Entering directory '/home/buildbot/slave/monero-tests-windows-10-i686/build/build/release'
make[3]: Leaving directory '/home/buildbot/slave/monero-tests-windows-10-i686/build/build/release'
[ 55%] Built target blocks
make[3]: Entering directory '/home/buildbot/slave/monero-tests-windows-10-i686/build/build/release'
make[3]: Leaving directory '/home/buildbot/slave/monero-tests-windows-10-i686/build/build/release'
[ 56%] Built target obj_blockchain_db
make[3]: Entering directory '/home/buildbot/slave/monero-tests-windows-10-i686/build/build/release'
make[3]: Leaving directory '/home/buildbot/slave/monero-tests-windows-10-i686/build/build/release'
[ 56%] Built target blockchain_db
make[3]: Entering directory '/home/buildbot/slave/monero-tests-windows-10-i686/build/build/release'
make[3]: Leaving directory '/home/buildbot/slave/monero-tests-windows-10-i686/build/build/release'
[ 57%] Built target cryptonote_core
make[3]: Entering directory '/home/buildbot/slave/monero-tests-windows-10-i686/build/build/release'
make[3]: Leaving directory '/home/buildbot/slave/monero-tests-windows-10-i686/build/build/release'
[ 57%] Built target obj_mnemonics
make[3]: Entering directory '/home/buildbot/slave/monero-tests-windows-10-i686/build/build/release'
make[3]: Leaving directory '/home/buildbot/slave/monero-tests-windows-10-i686/build/build/release'
[ 58%] Built target mnemonics
make[3]: Entering directory '/home/buildbot/slave/monero-tests-windows-10-i686/build/build/release'
make[3]: Leaving directory '/home/buildbot/slave/monero-tests-windows-10-i686/build/build/release'
[ 58%] Built target obj_rpc
make[3]: Entering directory '/home/buildbot/slave/monero-tests-windows-10-i686/build/build/release'
make[3]: Leaving directory '/home/buildbot/slave/monero-tests-windows-10-i686/build/build/release'
[ 58%] Built target obj_cryptonote_protocol
make[3]: Entering directory '/home/buildbot/slave/monero-tests-windows-10-i686/build/build/release'
make[3]: Leaving directory '/home/buildbot/slave/monero-tests-windows-10-i686/build/build/release'
[ 58%] Built target cryptonote_protocol
make[3]: Entering directory '/home/buildbot/slave/monero-tests-windows-10-i686/build/build/release'
make[3]: Leaving directory '/home/buildbot/slave/monero-tests-windows-10-i686/build/build/release'
[ 59%] Built target rpc
make[3]: Entering directory '/home/buildbot/slave/monero-tests-windows-10-i686/build/build/release'
make[3]: Leaving directory '/home/buildbot/slave/monero-tests-windows-10-i686/build/build/release'
[ 63%] Built target obj_wallet
make[3]: Entering directory '/home/buildbot/slave/monero-tests-windows-10-i686/build/build/release'
make[3]: Leaving directory '/home/buildbot/slave/monero-tests-windows-10-i686/build/build/release'
[ 65%] Built target obj_p2p
make[3]: Entering directory '/home/buildbot/slave/monero-tests-windows-10-i686/build/build/release'
make[3]: Leaving directory '/home/buildbot/slave/monero-tests-windows-10-i686/build/build/release'
[ 65%] Built target p2p
make[3]: Entering directory '/home/buildbot/slave/monero-tests-windows-10-i686/build/build/release'
make[3]: Leaving directory '/home/buildbot/slave/monero-tests-windows-10-i686/build/build/release'
[ 66%] Built target wallet
make[3]: Entering directory '/home/buildbot/slave/monero-tests-windows-10-i686/build/build/release'
make[3]: Leaving directory '/home/buildbot/slave/monero-tests-windows-10-i686/build/build/release'
[ 67%] Built target wallet_rpc_server
make[3]: Entering directory '/home/buildbot/slave/monero-tests-windows-10-i686/build/build/release'
make[3]: Leaving directory '/home/buildbot/slave/monero-tests-windows-10-i686/build/build/release'
[ 67%] Built target simplewallet
make[3]: Entering directory '/home/buildbot/slave/monero-tests-windows-10-i686/build/build/release'
make[3]: Leaving directory '/home/buildbot/slave/monero-tests-windows-10-i686/build/build/release'
[ 68%] Built target obj_daemonizer
make[3]: Entering directory '/home/buildbot/slave/monero-tests-windows-10-i686/build/build/release'
make[3]: Leaving directory '/home/buildbot/slave/monero-tests-windows-10-i686/build/build/release'
[ 68%] Built target daemonizer
make[3]: Entering directory '/home/buildbot/slave/monero-tests-windows-10-i686/build/build/release'
make[3]: Leaving directory '/home/buildbot/slave/monero-tests-windows-10-i686/build/build/release'
[ 71%] Built target daemon
make[3]: Entering directory '/home/buildbot/slave/monero-tests-windows-10-i686/build/build/release'
make[3]: Leaving directory '/home/buildbot/slave/monero-tests-windows-10-i686/build/build/release'
[ 73%] Built target blockchain_import
make[3]: Entering directory '/home/buildbot/slave/monero-tests-windows-10-i686/build/build/release'
make[3]: Leaving directory '/home/buildbot/slave/monero-tests-windows-10-i686/build/build/release'
[ 74%] Built target blockchain_export
make[3]: Entering directory '/home/buildbot/slave/monero-tests-windows-10-i686/build/build/release'
make[3]: Leaving directory '/home/buildbot/slave/monero-tests-windows-10-i686/build/build/release'
[ 75%] Built target cn_deserialize
make[3]: Entering directory '/home/buildbot/slave/monero-tests-windows-10-i686/build/build/release'
Scanning dependencies of target hash-target-tests
make[3]: Leaving directory '/home/buildbot/slave/monero-tests-windows-10-i686/build/build/release'
make[3]: Entering directory '/home/buildbot/slave/monero-tests-windows-10-i686/build/build/release'
[ 75%] Building CXX object tests/CMakeFiles/hash-target-tests.dir/hash-target.cpp.obj
[ 76%] Linking CXX executable hash-target-tests.exe
make[3]: Leaving directory '/home/buildbot/slave/monero-tests-windows-10-i686/build/build/release'
[ 76%] Built target hash-target-tests
make[3]: Entering directory '/home/buildbot/slave/monero-tests-windows-10-i686/build/build/release'
Scanning dependencies of target coretests
make[3]: Leaving directory '/home/buildbot/slave/monero-tests-windows-10-i686/build/build/release'
make[3]: Entering directory '/home/buildbot/slave/monero-tests-windows-10-i686/build/build/release'
[ 76%] Building CXX object tests/core_tests/CMakeFiles/coretests.dir/block_reward.cpp.obj
[ 77%] Building CXX object tests/core_tests/CMakeFiles/coretests.dir/block_validation.cpp.obj
[ 77%] Building CXX object tests/core_tests/CMakeFiles/coretests.dir/chain_split_1.cpp.obj
[ 78%] Building CXX object tests/core_tests/CMakeFiles/coretests.dir/chain_switch_1.cpp.obj
[ 78%] Building CXX object tests/core_tests/CMakeFiles/coretests.dir/chaingen.cpp.obj
[ 78%] Building CXX object tests/core_tests/CMakeFiles/coretests.dir/chaingen001.cpp.obj
[ 79%] Building CXX object tests/core_tests/CMakeFiles/coretests.dir/chaingen_main.cpp.obj
[ 79%] Building CXX object tests/core_tests/CMakeFiles/coretests.dir/double_spend.cpp.obj
[ 79%] Building CXX object tests/core_tests/CMakeFiles/coretests.dir/integer_overflow.cpp.obj
[ 80%] Building CXX object tests/core_tests/CMakeFiles/coretests.dir/ring_signature_1.cpp.obj
[ 80%] Building CXX object tests/core_tests/CMakeFiles/coretests.dir/transaction_tests.cpp.obj
[ 80%] Building CXX object tests/core_tests/CMakeFiles/coretests.dir/tx_validation.cpp.obj
[ 81%] Building CXX object tests/core_tests/CMakeFiles/coretests.dir/v2_tests.cpp.obj
[ 81%] Building CXX object tests/core_tests/CMakeFiles/coretests.dir/rct.cpp.obj
[ 82%] Linking CXX executable coretests.exe
make[3]: Leaving directory '/home/buildbot/slave/monero-tests-windows-10-i686/build/build/release'
[ 82%] Built target coretests
make[3]: Entering directory '/home/buildbot/slave/monero-tests-windows-10-i686/build/build/release'
Scanning dependencies of target crypto-tests
make[3]: Leaving directory '/home/buildbot/slave/monero-tests-windows-10-i686/build/build/release'
make[3]: Entering directory '/home/buildbot/slave/monero-tests-windows-10-i686/build/build/release'
[ 82%] Building C object tests/crypto/CMakeFiles/crypto-tests.dir/crypto-ops-data.c.obj
[ 83%] Building C object tests/crypto/CMakeFiles/crypto-tests.dir/crypto-ops.c.obj
[ 83%] Building CXX object tests/crypto/CMakeFiles/crypto-tests.dir/crypto.cpp.obj
[ 83%] Building C object tests/crypto/CMakeFiles/crypto-tests.dir/hash.c.obj
[ 84%] Building CXX object tests/crypto/CMakeFiles/crypto-tests.dir/main.cpp.obj
[ 84%] Building C object tests/crypto/CMakeFiles/crypto-tests.dir/random.c.obj
[ 84%] Linking CXX executable crypto-tests.exe
make[3]: Leaving directory '/home/buildbot/slave/monero-tests-windows-10-i686/build/build/release'
[ 84%] Built target crypto-tests
make[3]: Entering directory '/home/buildbot/slave/monero-tests-windows-10-i686/build/build/release'
Scanning dependencies of target functional_tests
make[3]: Leaving directory '/home/buildbot/slave/monero-tests-windows-10-i686/build/build/release'
make[3]: Entering directory '/home/buildbot/slave/monero-tests-windows-10-i686/build/build/release'
[ 84%] Building CXX object tests/functional_tests/CMakeFiles/functional_tests.dir/main.cpp.obj
[ 84%] Building CXX object tests/functional_tests/CMakeFiles/functional_tests.dir/transactions_flow_test.cpp.obj
[ 85%] Building CXX object tests/functional_tests/CMakeFiles/functional_tests.dir/transactions_generation_from_blockchain.cpp.obj
[ 85%] Linking CXX executable functional_tests.exe
make[3]: Leaving directory '/home/buildbot/slave/monero-tests-windows-10-i686/build/build/release'
[ 85%] Built target functional_tests
make[3]: Entering directory '/home/buildbot/slave/monero-tests-windows-10-i686/build/build/release'
Scanning dependencies of target performance_tests
make[3]: Leaving directory '/home/buildbot/slave/monero-tests-windows-10-i686/build/build/release'
make[3]: Entering directory '/home/buildbot/slave/monero-tests-windows-10-i686/build/build/release'
[ 86%] Building CXX object tests/performance_tests/CMakeFiles/performance_tests.dir/main.cpp.obj
[ 86%] Linking CXX executable performance_tests.exe
make[3]: Leaving directory '/home/buildbot/slave/monero-tests-windows-10-i686/build/build/release'
[ 86%] Built target performance_tests
make[3]: Entering directory '/home/buildbot/slave/monero-tests-windows-10-i686/build/build/release'
Scanning dependencies of target core_proxy
make[3]: Leaving directory '/home/buildbot/slave/monero-tests-windows-10-i686/build/build/release'
make[3]: Entering directory '/home/buildbot/slave/monero-tests-windows-10-i686/build/build/release'
[ 87%] Building CXX object tests/core_proxy/CMakeFiles/core_proxy.dir/core_proxy.cpp.obj
In file included from C:/msys32/home/buildbot/slave/monero-tests-windows-10-i686/build/src/cryptonote_protocol/cryptonote_protocol_handler.h:169:0,
                 from C:/msys32/home/buildbot/slave/monero-tests-windows-10-i686/build/tests/core_proxy/core_proxy.cpp:50:
C:/msys32/home/buildbot/slave/monero-tests-windows-10-i686/build/src/cryptonote_protocol/cryptonote_protocol_handler.inl: In instantiation of 'cryptonote::t_cryptonote_protocol_handler<t_core>::relay_block(cryptonote::NOTIFY_NEW_BLOCK::request&, cryptonote::cryptonote_connection_context&)::<lambda(cryptonote::t_cryptonote_protocol_handler<t_core>::connection_context&, nodetool::peerid_type, uint32_t)> [with t_core = tests::proxy_core; cryptonote::t_cryptonote_protocol_handler<t_core>::connection_context = cryptonote::cryptonote_connection_context; nodetool::peerid_type = long long unsigned int; uint32_t = unsigned int]':
C:/msys32/home/buildbot/slave/monero-tests-windows-10-i686/build/src/cryptonote_protocol/cryptonote_protocol_handler.inl:1096:46:   required from 'struct cryptonote::t_cryptonote_protocol_handler<t_core>::relay_block(cryptonote::NOTIFY_NEW_BLOCK::request&, cryptonote::cryptonote_connection_context&) [with t_core = tests::proxy_core]::<lambda(cryptonote::t_cryptonote_protocol_handler<tests::proxy_core>::connection_context&, nodetool::peerid_type, uint32_t)>'
C:/msys32/home/buildbot/slave/monero-tests-windows-10-i686/build/src/cryptonote_protocol/cryptonote_protocol_handler.inl:1096:5:   required from 'bool cryptonote::t_cryptonote_protocol_handler<t_core>::relay_block(cryptonote::NOTIFY_NEW_BLOCK::request&, cryptonote::cryptonote_connection_context&) [with t_core = tests::proxy_core]'
C:/msys32/home/buildbot/slave/monero-tests-windows-10-i686/build/tests/core_proxy/core_proxy.cpp:278:1:   required from here
C:/msys32/home/buildbot/slave/monero-tests-windows-10-i686/build/src/cryptonote_protocol/cryptonote_protocol_handler.inl:1098:17: error: 'class tests::proxy_core' has no member named 'get_testnet'
       if(m_core.get_testnet() && support_flags & P2P_SUPPORT_FLAG_FLUFFY_BLOCKS)
          ~~~~~~~^~~~~~~~~~~
C:/msys32/home/buildbot/slave/monero-tests-windows-10-i686/build/src/cryptonote_protocol/cryptonote_protocol_handler.inl: In instantiation of 'int cryptonote::t_cryptonote_protocol_handler<t_core>::handle_notify_new_fluffy_block(int, cryptonote::NOTIFY_NEW_FLUFFY_BLOCK::request&, cryptonote::cryptonote_connection_context&) [with t_core = tests::proxy_core]':
C:/msys32/home/buildbot/slave/monero-tests-windows-10-i686/build/src/cryptonote_protocol/cryptonote_protocol_handler.h:94:7:   required from 'int cryptonote::t_cryptonote_protocol_handler<t_core>::handle_invoke_map(bool, int, const string&, std::__cxx11::string&, t_context&, bool&) [with t_context = cryptonote::cryptonote_connection_context; t_core = tests::proxy_core; std::__cxx11::string = std::__cxx11::basic_string<char>]'
C:/msys32/home/buildbot/slave/monero-tests-windows-10-i686/build/src/p2p/net_node.h:151:7:   required from 'int nodetool::node_server<t_payload_net_handler>::handle_invoke_map(bool, int, const string&, std::__cxx11::string&, t_context&, bool&) [with t_context = nodetool::p2p_connection_context_t<cryptonote::cryptonote_connection_context>; t_payload_net_handler = cryptonote::t_cryptonote_protocol_handler<tests::proxy_core>; std::__cxx11::string = std::__cxx11::basic_string<char>]'
C:/msys32/home/buildbot/slave/monero-tests-windows-10-i686/build/src/p2p/net_node.h:138:5:   required from 'int nodetool::node_server<t_payload_net_handler>::invoke(int, const string&, std::__cxx11::string&, nodetool::node_server<t_payload_net_handler>::p2p_connection_context&) [with t_payload_net_handler = cryptonote::t_cryptonote_protocol_handler<tests::proxy_core>; std::__cxx11::string = std::__cxx11::basic_string<char>; nodetool::node_server<t_payload_net_handler>::p2p_connection_context = nodetool::p2p_connection_context_t<cryptonote::cryptonote_connection_context>; typename t_payload_net_handler::connection_context = cryptonote::cryptonote_connection_context]'
C:/msys32/home/buildbot/slave/monero-tests-windows-10-i686/build/tests/core_proxy/core_proxy.cpp:278:1:   required from here
C:/msys32/home/buildbot/slave/monero-tests-windows-10-i686/build/src/cryptonote_protocol/cryptonote_protocol_handler.inl:477:22: error: 'class tests::proxy_core' has no member named 'get_pool_transaction'
           if(!m_core.get_pool_transaction(tx_hash, tx))
               ~~~~~~~^~~~~~~~~~~~~~~~~~~~
C:/msys32/home/buildbot/slave/monero-tests-windows-10-i686/build/src/cryptonote_protocol/cryptonote_protocol_handler.inl:533:19: error: 'class tests::proxy_core' has no member named 'get_pool_transaction'
         if(m_core.get_pool_transaction(tx_hash, tx))
            ~~~~~~~^~~~~~~~~~~~~~~~~~~~
C:/msys32/home/buildbot/slave/monero-tests-windows-10-i686/build/src/cryptonote_protocol/cryptonote_protocol_handler.inl: In instantiation of 'int cryptonote::t_cryptonote_protocol_handler<t_core>::handle_request_fluffy_missing_tx(int, cryptonote::NOTIFY_REQUEST_FLUFFY_MISSING_TX::request&, cryptonote::cryptonote_connection_context&) [with t_core = tests::proxy_core]':
C:/msys32/home/buildbot/slave/monero-tests-windows-10-i686/build/src/cryptonote_protocol/cryptonote_protocol_handler.h:95:7:   required from 'int cryptonote::t_cryptonote_protocol_handler<t_core>::handle_invoke_map(bool, int, const string&, std::__cxx11::string&, t_context&, bool&) [with t_context = cryptonote::cryptonote_connection_context; t_core = tests::proxy_core; std::__cxx11::string = std::__cxx11::basic_string<char>]'
C:/msys32/home/buildbot/slave/monero-tests-windows-10-i686/build/src/p2p/net_node.h:151:7:   required from 'int nodetool::node_server<t_payload_net_handler>::handle_invoke_map(bool, int, const string&, std::__cxx11::string&, t_context&, bool&) [with t_context = nodetool::p2p_connection_context_t<cryptonote::cryptonote_connection_context>; t_payload_net_handler = cryptonote::t_cryptonote_protocol_handler<tests::proxy_core>; std::__cxx11::string = std::__cxx11::basic_string<char>]'
C:/msys32/home/buildbot/slave/monero-tests-windows-10-i686/build/src/p2p/net_node.h:138:5:   required from 'int nodetool::node_server<t_payload_net_handler>::invoke(int, const string&, std::__cxx11::string&, nodetool::node_server<t_payload_net_handler>::p2p_connection_context&) [with t_payload_net_handler = cryptonote::t_cryptonote_protocol_handler<tests::proxy_core>; std::__cxx11::string = std::__cxx11::basic_string<char>; nodetool::node_server<t_payload_net_handler>::p2p_connection_context = nodetool::p2p_connection_context_t<cryptonote::cryptonote_connection_context>; typename t_payload_net_handler::connection_context = cryptonote::cryptonote_connection_context]'
C:/msys32/home/buildbot/slave/monero-tests-windows-10-i686/build/tests/core_proxy/core_proxy.cpp:278:1:   required from here
C:/msys32/home/buildbot/slave/monero-tests-windows-10-i686/build/src/cryptonote_protocol/cryptonote_protocol_handler.inl:623:16: error: 'class tests::proxy_core' has no member named 'get_blocks'; did you mean 'add_block'?
     if(!m_core.get_blocks(arg.current_blockchain_height - 1, 1, local_blocks, local_txs))
         ~~~~~~~^~~~~~~~~~
In file included from C:/msys32/mingw32/include/c++/6.2.0/memory:79:0,
                 from C:/msys32/mingw32/include/boost/config/no_tr1/memory.hpp:21,
                 from C:/msys32/mingw32/include/boost/smart_ptr/shared_ptr.hpp:23,
                 from C:/msys32/mingw32/include/boost/shared_ptr.hpp:17,
                 from C:/msys32/mingw32/include/boost/date_time/time_clock.hpp:17,
                 from C:/msys32/mingw32/include/boost/thread/thread_time.hpp:9,
                 from C:/msys32/mingw32/include/boost/thread/win32/thread_data.hpp:10,
                 from C:/msys32/mingw32/include/boost/thread/thread_only.hpp:15,
                 from C:/msys32/mingw32/include/boost/thread/thread.hpp:12,
                 from C:/msys32/mingw32/include/boost/thread.hpp:13,
                 from C:/msys32/home/buildbot/slave/monero-tests-windows-10-i686/build/contrib/epee/include/misc_log_ex.h:43,
                 from C:/msys32/home/buildbot/slave/monero-tests-windows-10-i686/build/contrib/epee/include/include_base_utils.h:32,
                 from C:/msys32/home/buildbot/slave/monero-tests-windows-10-i686/build/tests/core_proxy/core_proxy.cpp:35:
C:/msys32/mingw32/include/c++/6.2.0/functional:2115:7: error: 'std::function<_Res(_ArgTypes ...)>::function(_Functor) [with _Functor = cryptonote::t_cryptonote_protocol_handler<t_core>::relay_block(cryptonote::NOTIFY_NEW_BLOCK::request&, cryptonote::cryptonote_connection_context&) [with t_core = tests::proxy_core]::<lambda(cryptonote::t_cryptonote_protocol_handler<tests::proxy_core>::connection_context&, nodetool::peerid_type, uint32_t)>; <template-parameter-2-2> = void; <template-parameter-2-3> = void; _Res = bool; _ArgTypes = {cryptonote::cryptonote_connection_context&, long long unsigned int, unsigned int}]', declared using local type 'cryptonote::t_cryptonote_protocol_handler<t_core>::relay_block(cryptonote::NOTIFY_NEW_BLOCK::request&, cryptonote::cryptonote_connection_context&) [with t_core = tests::proxy_core]::<lambda(cryptonote::t_cryptonote_protocol_handler<tests::proxy_core>::connection_context&, nodetool::peerid_type, uint32_t)>', is used but never defined [-fpermissive]
       function<_Res(_ArgTypes...)>::
       ^~~~~~~~~~~~~~~~~~~~~~~~~~~~
make[3]: Leaving directory '/home/buildbot/slave/monero-tests-windows-10-i686/build/build/release'
make[2]: Leaving directory '/home/buildbot/slave/monero-tests-windows-10-i686/build/build/release'
make[1]: Leaving directory '/home/buildbot/slave/monero-tests-windows-10-i686/build/build/release'
make[3]: *** [tests/core_proxy/CMakeFiles/core_proxy.dir/build.make:63: tests/core_proxy/CMakeFiles/core_proxy.dir/core_proxy.cpp.obj] Error 1
make[2]: *** [CMakeFiles/Makefile2:2375: tests/core_proxy/CMakeFiles/core_proxy.dir/all] Error 2
make[1]: *** [Makefile:128: all] Error 2
make: *** [Makefile:55: release-test] Error 2
program finished with exit code 2
elapsedTime=408.431000