(view as text)
make release-test
 in dir C:/msys64/home/vagrant/slave\monero-tests-windows-10-amd64\build
 watching logfiles {'LastTest.log': 'build/release/Testing/Temporary/LastTest.log', 'CTestCostData.txt': 'build/release/Testing/Temporary/CTestCostData.txt'}
 argv: ['make', 'release-test']
 environment:
  ALLUSERSPROFILE=C:\ProgramData
  APPDATA=C:\Windows\system32\config\systemprofile\AppData\Roaming
  CHOCOLATEYINSTALL=C:\ProgramData\chocolatey
  COMMONPROGRAMFILES=C:\Program Files\Common Files
  COMMONPROGRAMFILES(X86)=C:\Program Files (x86)\Common Files
  COMMONPROGRAMW6432=C:\Program Files\Common Files
  COMPUTERNAME=VAGRANT-10
  COMSPEC=C:\Windows\system32\cmd.exe
  CYGWIN=mintty
  DXSDK_DIR=C:\Program Files (x86)\Microsoft DirectX SDK (June 2010)\
  HOME=C:\msys64\home\SYSTEM
  LOCALAPPDATA=C:\Windows\system32\config\systemprofile\AppData\Local
  NUMBER_OF_PROCESSORS=2
  OS=Windows_NT
  PATH=C:\msys64\usr\bin;C:\Windows\system32;C:\Windows;C:\Windows\System32\Wbem;C:\Windows\System32\WindowsPowerShell\v1.0;C:\Program Files\OpenSSH\bin;C:\ProgramData\chocolatey\bin;C:\msys64\mingw64\bin;C:\Windows\system32\config\systemprofile\AppData\Local\Microsoft\WindowsApps;C:\tools\python2\lib\site-packages\pywin32_system32
  PATHEXT=.COM;.EXE;.BAT;.CMD;.VBS;.VBE;.JS;.JSE;.WSF;.WSH;.MSC
  PROCESSOR_ARCHITECTURE=AMD64
  PROCESSOR_IDENTIFIER=Intel64 Family 6 Model 62 Stepping 4, GenuineIntel
  PROCESSOR_LEVEL=6
  PROCESSOR_REVISION=3e04
  PROGRAMDATA=C:\ProgramData
  PROGRAMFILES=C:\Program Files
  PROGRAMFILES(X86)=C:\Program Files (x86)
  PROGRAMW6432=C:\Program Files
  PSMODULEPATH=C:\Program Files (x86)\PowerShell Community Extensions\Pscx3\;C:\Program Files\WindowsPowerShell\Modules;C:\Windows\system32\WindowsPowerShell\v1.0\Modules
  PUBLIC=C:\Users\Public
  PWD=C:\msys64\home\vagrant\slave\monero-tests-windows-10-amd64\build
  PYTHONPATH=c:\tools\Python2
  SYSTEMDRIVE=C:
  SYSTEMROOT=C:\Windows
  TEMP=C:\Windows\TEMP
  TERM=cygwin
  TMP=C:\Windows\TEMP
  USERDOMAIN=WORKGROUP
  USERNAME=VAGRANT-10$
  USERPROFILE=C:\Windows\system32\config\systemprofile
  VS140COMNTOOLS=C:\Program Files (x86)\Microsoft Visual Studio 14.0\Common7\Tools\
  WINDIR=C:\Windows
 using PTY: False
mkdir -p build/release
cd build/release && cmake -D BUILD_TESTS=ON -D CMAKE_BUILD_TYPE=release ../.. && make && make test
-- Building build tag win-x64
-- Could not find DEVELOPER_LOCAL_TOOLS in env (not required)
-- BOOST_IGNORE_SYSTEM_PATHS defaults to OFF
-- Could not find DEVELOPER_LIBUNBOUND_OLD in env (not required)
-- Building for a 64-bit system
-- Building internal libraries as static
-- MSYS location: C:/msys64
-- Could not find DATABASE in env (not required unless you want to change database type from default: lmdb)
-- Using LMDB as default DB type
-- looking for liblzma
-- liblzma found
-- Could not find libunwind (missing:  LIBUNWIND_INCLUDE_DIR) 
-- Stack trace on exception disabled
-- Detecting version of miniupnpc in path: C:/msys64/mingw64/include/miniupnpc
-- Found miniupnpc version is v1.7 or higher
-- Using miniupnpc from local source tree for static build
-- Looking for libunbound
-- Using 64-bit LMDB from source tree
-- Building on  for x86-64
-- AES support enabled
-- Found Boost Version: 106000
-- Found Git: C:/msys64/usr/bin/git.exe
-- Found GTest: C:/msys64/mingw64/lib/libgtest.dll.a  
-- Could NOT find Doxygen (missing:  DOXYGEN_EXECUTABLE) 
Doxygen: graphviz not found - graphs disabled
-- Configuring done
-- Generating done
-- Build files have been written to: C:/msys64/home/vagrant/slave/monero-tests-windows-10-amd64/build/build/release
make[1]: Entering directory '/home/vagrant/slave/monero-tests-windows-10-amd64/build/build/release'
make[2]: Entering directory '/home/vagrant/slave/monero-tests-windows-10-amd64/build/build/release'
make[3]: Entering directory '/home/vagrant/slave/monero-tests-windows-10-amd64/build/build/release'
make[3]: Leaving directory '/home/vagrant/slave/monero-tests-windows-10-amd64/build/build/release'
[  0%] Built target version
make[3]: Entering directory '/home/vagrant/slave/monero-tests-windows-10-amd64/build/build/release'
make[3]: Leaving directory '/home/vagrant/slave/monero-tests-windows-10-amd64/build/build/release'
[  5%] Built target libminiupnpc-static
make[3]: Entering directory '/home/vagrant/slave/monero-tests-windows-10-amd64/build/build/release'
make[3]: Leaving directory '/home/vagrant/slave/monero-tests-windows-10-amd64/build/build/release'
[ 34%] Built target unbound
make[3]: Entering directory '/home/vagrant/slave/monero-tests-windows-10-amd64/build/build/release'
make[3]: Leaving directory '/home/vagrant/slave/monero-tests-windows-10-amd64/build/build/release'
[ 35%] Built target lmdb
make[3]: Entering directory '/home/vagrant/slave/monero-tests-windows-10-amd64/build/build/release'
make[3]: Leaving directory '/home/vagrant/slave/monero-tests-windows-10-amd64/build/build/release'
[ 42%] Built target obj_crypto
make[3]: Entering directory '/home/vagrant/slave/monero-tests-windows-10-amd64/build/build/release'
make[3]: Leaving directory '/home/vagrant/slave/monero-tests-windows-10-amd64/build/build/release'
[ 42%] Built target crypto
make[3]: Entering directory '/home/vagrant/slave/monero-tests-windows-10-amd64/build/build/release'
make[3]: Leaving directory '/home/vagrant/slave/monero-tests-windows-10-amd64/build/build/release'
[ 43%] Built target epee
make[3]: Entering directory '/home/vagrant/slave/monero-tests-windows-10-amd64/build/build/release'
make[3]: Leaving directory '/home/vagrant/slave/monero-tests-windows-10-amd64/build/build/release'
[ 47%] Built target obj_common
make[3]: Entering directory '/home/vagrant/slave/monero-tests-windows-10-amd64/build/build/release'
make[3]: Leaving directory '/home/vagrant/slave/monero-tests-windows-10-amd64/build/build/release'
[ 47%] Built target common
make[3]: Entering directory '/home/vagrant/slave/monero-tests-windows-10-amd64/build/build/release'
make[3]: Leaving directory '/home/vagrant/slave/monero-tests-windows-10-amd64/build/build/release'
[ 48%] Built target obj_ringct
make[3]: Entering directory '/home/vagrant/slave/monero-tests-windows-10-amd64/build/build/release'
make[3]: Leaving directory '/home/vagrant/slave/monero-tests-windows-10-amd64/build/build/release'
[ 50%] Built target obj_cryptonote_basic
make[3]: Entering directory '/home/vagrant/slave/monero-tests-windows-10-amd64/build/build/release'
make[3]: Leaving directory '/home/vagrant/slave/monero-tests-windows-10-amd64/build/build/release'
[ 50%] Built target cryptonote_basic
make[3]: Entering directory '/home/vagrant/slave/monero-tests-windows-10-amd64/build/build/release'
make[3]: Leaving directory '/home/vagrant/slave/monero-tests-windows-10-amd64/build/build/release'
[ 50%] Built target ringct
make[3]: Entering directory '/home/vagrant/slave/monero-tests-windows-10-amd64/build/build/release'
make[3]: Leaving directory '/home/vagrant/slave/monero-tests-windows-10-amd64/build/build/release'
[ 51%] Built target blocks
make[3]: Entering directory '/home/vagrant/slave/monero-tests-windows-10-amd64/build/build/release'
make[3]: Leaving directory '/home/vagrant/slave/monero-tests-windows-10-amd64/build/build/release'
[ 53%] Built target obj_cryptonote_core
make[3]: Entering directory '/home/vagrant/slave/monero-tests-windows-10-amd64/build/build/release'
make[3]: Leaving directory '/home/vagrant/slave/monero-tests-windows-10-amd64/build/build/release'
[ 53%] Built target obj_blockchain_db
make[3]: Entering directory '/home/vagrant/slave/monero-tests-windows-10-amd64/build/build/release'
make[3]: Leaving directory '/home/vagrant/slave/monero-tests-windows-10-amd64/build/build/release'
[ 53%] Built target blockchain_db
make[3]: Entering directory '/home/vagrant/slave/monero-tests-windows-10-amd64/build/build/release'
make[3]: Leaving directory '/home/vagrant/slave/monero-tests-windows-10-amd64/build/build/release'
[ 54%] Built target cryptonote_core
make[3]: Entering directory '/home/vagrant/slave/monero-tests-windows-10-amd64/build/build/release'
make[3]: Leaving directory '/home/vagrant/slave/monero-tests-windows-10-amd64/build/build/release'
[ 55%] Built target obj_mnemonics
make[3]: Entering directory '/home/vagrant/slave/monero-tests-windows-10-amd64/build/build/release'
make[3]: Leaving directory '/home/vagrant/slave/monero-tests-windows-10-amd64/build/build/release'
[ 55%] Built target mnemonics
make[3]: Entering directory '/home/vagrant/slave/monero-tests-windows-10-amd64/build/build/release'
make[3]: Leaving directory '/home/vagrant/slave/monero-tests-windows-10-amd64/build/build/release'
[ 56%] Built target obj_rpc
make[3]: Entering directory '/home/vagrant/slave/monero-tests-windows-10-amd64/build/build/release'
make[3]: Leaving directory '/home/vagrant/slave/monero-tests-windows-10-amd64/build/build/release'
[ 57%] Built target obj_p2p
make[3]: Entering directory '/home/vagrant/slave/monero-tests-windows-10-amd64/build/build/release'
make[3]: Leaving directory '/home/vagrant/slave/monero-tests-windows-10-amd64/build/build/release'
[ 57%] Built target p2p
make[3]: Entering directory '/home/vagrant/slave/monero-tests-windows-10-amd64/build/build/release'
make[3]: Leaving directory '/home/vagrant/slave/monero-tests-windows-10-amd64/build/build/release'
[ 57%] Built target obj_cryptonote_protocol
make[3]: Entering directory '/home/vagrant/slave/monero-tests-windows-10-amd64/build/build/release'
make[3]: Leaving directory '/home/vagrant/slave/monero-tests-windows-10-amd64/build/build/release'
[ 57%] Built target cryptonote_protocol
make[3]: Entering directory '/home/vagrant/slave/monero-tests-windows-10-amd64/build/build/release'
make[3]: Leaving directory '/home/vagrant/slave/monero-tests-windows-10-amd64/build/build/release'
[ 58%] Built target rpc
make[3]: Entering directory '/home/vagrant/slave/monero-tests-windows-10-amd64/build/build/release'
make[3]: Leaving directory '/home/vagrant/slave/monero-tests-windows-10-amd64/build/build/release'
[ 62%] Built target obj_wallet
make[3]: Entering directory '/home/vagrant/slave/monero-tests-windows-10-amd64/build/build/release'
make[3]: Leaving directory '/home/vagrant/slave/monero-tests-windows-10-amd64/build/build/release'
[ 63%] Built target wallet
make[3]: Entering directory '/home/vagrant/slave/monero-tests-windows-10-amd64/build/build/release'
make[3]: Leaving directory '/home/vagrant/slave/monero-tests-windows-10-amd64/build/build/release'
[ 64%] Built target wallet_rpc_server
make[3]: Entering directory '/home/vagrant/slave/monero-tests-windows-10-amd64/build/build/release'
make[3]: Leaving directory '/home/vagrant/slave/monero-tests-windows-10-amd64/build/build/release'
[ 64%] Built target simplewallet
make[3]: Entering directory '/home/vagrant/slave/monero-tests-windows-10-amd64/build/build/release'
make[3]: Leaving directory '/home/vagrant/slave/monero-tests-windows-10-amd64/build/build/release'
[ 64%] Built target obj_daemonizer
make[3]: Entering directory '/home/vagrant/slave/monero-tests-windows-10-amd64/build/build/release'
make[3]: Leaving directory '/home/vagrant/slave/monero-tests-windows-10-amd64/build/build/release'
[ 64%] Built target daemonizer
make[3]: Entering directory '/home/vagrant/slave/monero-tests-windows-10-amd64/build/build/release'
make[3]: Leaving directory '/home/vagrant/slave/monero-tests-windows-10-amd64/build/build/release'
[ 67%] Built target daemon
make[3]: Entering directory '/home/vagrant/slave/monero-tests-windows-10-amd64/build/build/release'
make[3]: Leaving directory '/home/vagrant/slave/monero-tests-windows-10-amd64/build/build/release'
[ 69%] Built target blockchain_import
make[3]: Entering directory '/home/vagrant/slave/monero-tests-windows-10-amd64/build/build/release'
make[3]: Leaving directory '/home/vagrant/slave/monero-tests-windows-10-amd64/build/build/release'
[ 70%] Built target cn_deserialize
make[3]: Entering directory '/home/vagrant/slave/monero-tests-windows-10-amd64/build/build/release'
make[3]: Leaving directory '/home/vagrant/slave/monero-tests-windows-10-amd64/build/build/release'
[ 71%] Built target blockchain_export
make[3]: Entering directory '/home/vagrant/slave/monero-tests-windows-10-amd64/build/build/release'
Scanning dependencies of target hash-target-tests
make[3]: Leaving directory '/home/vagrant/slave/monero-tests-windows-10-amd64/build/build/release'
make[3]: Entering directory '/home/vagrant/slave/monero-tests-windows-10-amd64/build/build/release'
[ 71%] Building CXX object tests/CMakeFiles/hash-target-tests.dir/hash-target.cpp.obj
[ 71%] Linking CXX executable hash-target-tests.exe
make[3]: Leaving directory '/home/vagrant/slave/monero-tests-windows-10-amd64/build/build/release'
[ 71%] Built target hash-target-tests
make[3]: Entering directory '/home/vagrant/slave/monero-tests-windows-10-amd64/build/build/release'
Scanning dependencies of target coretests
make[3]: Leaving directory '/home/vagrant/slave/monero-tests-windows-10-amd64/build/build/release'
make[3]: Entering directory '/home/vagrant/slave/monero-tests-windows-10-amd64/build/build/release'
[ 71%] Building CXX object tests/core_tests/CMakeFiles/coretests.dir/block_reward.cpp.obj
[ 72%] Building CXX object tests/core_tests/CMakeFiles/coretests.dir/block_validation.cpp.obj
[ 72%] Building CXX object tests/core_tests/CMakeFiles/coretests.dir/chain_split_1.cpp.obj
[ 72%] Building CXX object tests/core_tests/CMakeFiles/coretests.dir/chain_switch_1.cpp.obj
[ 73%] Building CXX object tests/core_tests/CMakeFiles/coretests.dir/chaingen.cpp.obj
[ 73%] Building CXX object tests/core_tests/CMakeFiles/coretests.dir/chaingen001.cpp.obj
[ 73%] Building CXX object tests/core_tests/CMakeFiles/coretests.dir/chaingen_main.cpp.obj
[ 74%] Building CXX object tests/core_tests/CMakeFiles/coretests.dir/double_spend.cpp.obj
[ 74%] Building CXX object tests/core_tests/CMakeFiles/coretests.dir/integer_overflow.cpp.obj
[ 74%] Building CXX object tests/core_tests/CMakeFiles/coretests.dir/ring_signature_1.cpp.obj
[ 75%] Building CXX object tests/core_tests/CMakeFiles/coretests.dir/transaction_tests.cpp.obj
[ 75%] Building CXX object tests/core_tests/CMakeFiles/coretests.dir/tx_validation.cpp.obj
[ 75%] Building CXX object tests/core_tests/CMakeFiles/coretests.dir/v2_tests.cpp.obj
[ 76%] Building CXX object tests/core_tests/CMakeFiles/coretests.dir/rct.cpp.obj
[ 76%] Linking CXX executable coretests.exe
make[3]: Leaving directory '/home/vagrant/slave/monero-tests-windows-10-amd64/build/build/release'
[ 76%] Built target coretests
make[3]: Entering directory '/home/vagrant/slave/monero-tests-windows-10-amd64/build/build/release'
Scanning dependencies of target crypto-tests
make[3]: Leaving directory '/home/vagrant/slave/monero-tests-windows-10-amd64/build/build/release'
make[3]: Entering directory '/home/vagrant/slave/monero-tests-windows-10-amd64/build/build/release'
[ 77%] Building C object tests/crypto/CMakeFiles/crypto-tests.dir/crypto-ops-data.c.obj
[ 77%] Building C object tests/crypto/CMakeFiles/crypto-tests.dir/crypto-ops.c.obj
[ 78%] Building CXX object tests/crypto/CMakeFiles/crypto-tests.dir/crypto.cpp.obj
[ 78%] Building C object tests/crypto/CMakeFiles/crypto-tests.dir/hash.c.obj
[ 78%] Building CXX object tests/crypto/CMakeFiles/crypto-tests.dir/main.cpp.obj
[ 79%] Building C object tests/crypto/CMakeFiles/crypto-tests.dir/random.c.obj
[ 79%] Linking CXX executable crypto-tests.exe
make[3]: Leaving directory '/home/vagrant/slave/monero-tests-windows-10-amd64/build/build/release'
[ 79%] Built target crypto-tests
make[3]: Entering directory '/home/vagrant/slave/monero-tests-windows-10-amd64/build/build/release'
Scanning dependencies of target functional_tests
make[3]: Leaving directory '/home/vagrant/slave/monero-tests-windows-10-amd64/build/build/release'
make[3]: Entering directory '/home/vagrant/slave/monero-tests-windows-10-amd64/build/build/release'
[ 80%] Building CXX object tests/functional_tests/CMakeFiles/functional_tests.dir/main.cpp.obj
[ 80%] Building CXX object tests/functional_tests/CMakeFiles/functional_tests.dir/transactions_flow_test.cpp.obj
[ 80%] Building CXX object tests/functional_tests/CMakeFiles/functional_tests.dir/transactions_generation_from_blockchain.cpp.obj
[ 81%] Linking CXX executable functional_tests.exe
make[3]: Leaving directory '/home/vagrant/slave/monero-tests-windows-10-amd64/build/build/release'
[ 81%] Built target functional_tests
make[3]: Entering directory '/home/vagrant/slave/monero-tests-windows-10-amd64/build/build/release'
Scanning dependencies of target performance_tests
make[3]: Leaving directory '/home/vagrant/slave/monero-tests-windows-10-amd64/build/build/release'
make[3]: Entering directory '/home/vagrant/slave/monero-tests-windows-10-amd64/build/build/release'
[ 81%] Building CXX object tests/performance_tests/CMakeFiles/performance_tests.dir/main.cpp.obj
[ 82%] Linking CXX executable performance_tests.exe
make[3]: Leaving directory '/home/vagrant/slave/monero-tests-windows-10-amd64/build/build/release'
[ 82%] Built target performance_tests
make[3]: Entering directory '/home/vagrant/slave/monero-tests-windows-10-amd64/build/build/release'
Scanning dependencies of target core_proxy
make[3]: Leaving directory '/home/vagrant/slave/monero-tests-windows-10-amd64/build/build/release'
make[3]: Entering directory '/home/vagrant/slave/monero-tests-windows-10-amd64/build/build/release'
[ 82%] Building CXX object tests/core_proxy/CMakeFiles/core_proxy.dir/core_proxy.cpp.obj
[ 83%] Linking CXX executable core_proxy.exe
make[3]: Leaving directory '/home/vagrant/slave/monero-tests-windows-10-amd64/build/build/release'
[ 83%] Built target core_proxy
make[3]: Entering directory '/home/vagrant/slave/monero-tests-windows-10-amd64/build/build/release'
Scanning dependencies of target unit_tests
make[3]: Leaving directory '/home/vagrant/slave/monero-tests-windows-10-amd64/build/build/release'
make[3]: Entering directory '/home/vagrant/slave/monero-tests-windows-10-amd64/build/build/release'
[ 83%] Building CXX object tests/unit_tests/CMakeFiles/unit_tests.dir/address_from_url.cpp.obj
[ 83%] Building CXX object tests/unit_tests/CMakeFiles/unit_tests.dir/ban.cpp.obj
[ 84%] Building CXX object tests/unit_tests/CMakeFiles/unit_tests.dir/base58.cpp.obj
[ 84%] Building CXX object tests/unit_tests/CMakeFiles/unit_tests.dir/blockchain_db.cpp.obj
[ 85%] Building CXX object tests/unit_tests/CMakeFiles/unit_tests.dir/block_reward.cpp.obj
[ 85%] Building CXX object tests/unit_tests/CMakeFiles/unit_tests.dir/canonical_amounts.cpp.obj
[ 85%] Building CXX object tests/unit_tests/CMakeFiles/unit_tests.dir/chacha8.cpp.obj
[ 86%] Building CXX object tests/unit_tests/CMakeFiles/unit_tests.dir/checkpoints.cpp.obj
[ 86%] Building CXX object tests/unit_tests/CMakeFiles/unit_tests.dir/command_line.cpp.obj
[ 86%] Building CXX object tests/unit_tests/CMakeFiles/unit_tests.dir/decompose_amount_into_digits.cpp.obj
[ 87%] Building CXX object tests/unit_tests/CMakeFiles/unit_tests.dir/dns_resolver.cpp.obj
[ 87%] Building CXX object tests/unit_tests/CMakeFiles/unit_tests.dir/epee_boosted_tcp_server.cpp.obj
[ 87%] Building CXX object tests/unit_tests/CMakeFiles/unit_tests.dir/epee_levin_protocol_handler_async.cpp.obj
[ 88%] Building CXX object tests/unit_tests/CMakeFiles/unit_tests.dir/epee_utils.cpp.obj
In file included from C:/msys64/home/vagrant/slave/monero-tests-windows-10-amd64/build/contrib/epee/include/string_tools.h:34:0,
                 from C:/msys64/home/vagrant/slave/monero-tests-windows-10-amd64/build/tests/unit_tests/epee_utils.cpp:40:
C:/msys64/mingw64/x86_64-w64-mingw32/include/winsock2.h:15:2: warning: #warning Please include winsock2.h before windows.h [-Wcpp]
 #warning Please include winsock2.h before windows.h
  ^~~~~~~
[ 88%] Building CXX object tests/unit_tests/CMakeFiles/unit_tests.dir/fee.cpp.obj
[ 88%] Building CXX object tests/unit_tests/CMakeFiles/unit_tests.dir/get_xtype_from_string.cpp.obj
[ 89%] Building CXX object tests/unit_tests/CMakeFiles/unit_tests.dir/http.cpp.obj
[ 89%] Building CXX object tests/unit_tests/CMakeFiles/unit_tests.dir/main.cpp.obj
[ 89%] Building CXX object tests/unit_tests/CMakeFiles/unit_tests.dir/mnemonics.cpp.obj
[ 90%] Building CXX object tests/unit_tests/CMakeFiles/unit_tests.dir/mul_div.cpp.obj
[ 90%] Building CXX object tests/unit_tests/CMakeFiles/unit_tests.dir/parse_amount.cpp.obj
[ 91%] Building CXX object tests/unit_tests/CMakeFiles/unit_tests.dir/serialization.cpp.obj
[ 91%] Building CXX object tests/unit_tests/CMakeFiles/unit_tests.dir/slow_memmem.cpp.obj
[ 91%] Building CXX object tests/unit_tests/CMakeFiles/unit_tests.dir/test_tx_utils.cpp.obj
[ 92%] Building CXX object tests/unit_tests/CMakeFiles/unit_tests.dir/test_peerlist.cpp.obj
[ 92%] Building CXX object tests/unit_tests/CMakeFiles/unit_tests.dir/test_protocol_pack.cpp.obj
[ 92%] Building CXX object tests/unit_tests/CMakeFiles/unit_tests.dir/thread_group.cpp.obj
[ 93%] Building CXX object tests/unit_tests/CMakeFiles/unit_tests.dir/hardfork.cpp.obj
[ 93%] Building CXX object tests/unit_tests/CMakeFiles/unit_tests.dir/unbound.cpp.obj
[ 93%] Building CXX object tests/unit_tests/CMakeFiles/unit_tests.dir/uri.cpp.obj
[ 94%] Building CXX object tests/unit_tests/CMakeFiles/unit_tests.dir/varint.cpp.obj
[ 94%] Building CXX object tests/unit_tests/CMakeFiles/unit_tests.dir/ringct.cpp.obj
[ 94%] Building CXX object tests/unit_tests/CMakeFiles/unit_tests.dir/output_selection.cpp.obj
[ 95%] Building CXX object tests/unit_tests/CMakeFiles/unit_tests.dir/vercmp.cpp.obj
[ 95%] Linking CXX executable unit_tests.exe
make[3]: Leaving directory '/home/vagrant/slave/monero-tests-windows-10-amd64/build/build/release'
[ 95%] Built target unit_tests
make[3]: Entering directory '/home/vagrant/slave/monero-tests-windows-10-amd64/build/build/release'
Scanning dependencies of target difficulty-tests
make[3]: Leaving directory '/home/vagrant/slave/monero-tests-windows-10-amd64/build/build/release'
make[3]: Entering directory '/home/vagrant/slave/monero-tests-windows-10-amd64/build/build/release'
[ 96%] Building CXX object tests/difficulty/CMakeFiles/difficulty-tests.dir/difficulty.cpp.obj
[ 96%] Linking CXX executable difficulty-tests.exe
make[3]: Leaving directory '/home/vagrant/slave/monero-tests-windows-10-amd64/build/build/release'
[ 96%] Built target difficulty-tests
make[3]: Entering directory '/home/vagrant/slave/monero-tests-windows-10-amd64/build/build/release'
Scanning dependencies of target hash-tests
make[3]: Leaving directory '/home/vagrant/slave/monero-tests-windows-10-amd64/build/build/release'
make[3]: Entering directory '/home/vagrant/slave/monero-tests-windows-10-amd64/build/build/release'
[ 97%] Building CXX object tests/hash/CMakeFiles/hash-tests.dir/main.cpp.obj
[ 97%] Linking CXX executable hash-tests.exe
make[3]: Leaving directory '/home/vagrant/slave/monero-tests-windows-10-amd64/build/build/release'
[ 97%] Built target hash-tests
make[3]: Entering directory '/home/vagrant/slave/monero-tests-windows-10-amd64/build/build/release'
Scanning dependencies of target net_load_tests_clt
make[3]: Leaving directory '/home/vagrant/slave/monero-tests-windows-10-amd64/build/build/release'
make[3]: Entering directory '/home/vagrant/slave/monero-tests-windows-10-amd64/build/build/release'
[ 97%] Building CXX object tests/net_load_tests/CMakeFiles/net_load_tests_clt.dir/clt.cpp.obj
[ 98%] Linking CXX executable net_load_tests_clt.exe
make[3]: Leaving directory '/home/vagrant/slave/monero-tests-windows-10-amd64/build/build/release'
[ 98%] Built target net_load_tests_clt
make[3]: Entering directory '/home/vagrant/slave/monero-tests-windows-10-amd64/build/build/release'
Scanning dependencies of target net_load_tests_srv
make[3]: Leaving directory '/home/vagrant/slave/monero-tests-windows-10-amd64/build/build/release'
make[3]: Entering directory '/home/vagrant/slave/monero-tests-windows-10-amd64/build/build/release'
[ 98%] Building CXX object tests/net_load_tests/CMakeFiles/net_load_tests_srv.dir/srv.cpp.obj
[ 99%] Linking CXX executable net_load_tests_srv.exe
make[3]: Leaving directory '/home/vagrant/slave/monero-tests-windows-10-amd64/build/build/release'
[ 99%] Built target net_load_tests_srv
make[3]: Entering directory '/home/vagrant/slave/monero-tests-windows-10-amd64/build/build/release'
Scanning dependencies of target libwallet_api_tests
make[3]: Leaving directory '/home/vagrant/slave/monero-tests-windows-10-amd64/build/build/release'
make[3]: Entering directory '/home/vagrant/slave/monero-tests-windows-10-amd64/build/build/release'
[ 99%] Building CXX object tests/libwallet_api_tests/CMakeFiles/libwallet_api_tests.dir/main.cpp.obj
[100%] Linking CXX executable libwallet_api_tests.exe
make[3]: Leaving directory '/home/vagrant/slave/monero-tests-windows-10-amd64/build/build/release'
[100%] Built target libwallet_api_tests
make[2]: Leaving directory '/home/vagrant/slave/monero-tests-windows-10-amd64/build/build/release'
make[1]: Leaving directory '/home/vagrant/slave/monero-tests-windows-10-amd64/build/build/release'
make[1]: Entering directory '/home/vagrant/slave/monero-tests-windows-10-amd64/build/build/release'
Running tests...
Test project C:/msys64/home/vagrant/slave/monero-tests-windows-10-amd64/build/build/release
      Start  1: hash-target
 1/13 Test  #1: hash-target ......................   Passed    0.17 sec
      Start  2: coretests
 2/13 Test  #2: coretests ........................***Failed  2896.06 sec
      Start  3: crypto
 3/13 Test  #3: crypto ...........................   Passed   10.73 sec
      Start  4: unit_tests
 4/13 Test  #4: unit_tests .......................   Passed   10.44 sec
      Start  5: difficulty
 5/13 Test  #5: difficulty .......................   Passed    0.05 sec
      Start  6: hash-fast
 6/13 Test  #6: hash-fast ........................   Passed    0.06 sec
      Start  7: hash-slow
 7/13 Test  #7: hash-slow ........................   Passed    0.09 sec
      Start  8: hash-tree
 8/13 Test  #8: hash-tree ........................   Passed    0.02 sec
      Start  9: hash-extra-blake
 9/13 Test  #9: hash-extra-blake .................   Passed    0.02 sec
      Start 10: hash-extra-groestl
10/13 Test #10: hash-extra-groestl ...............   Passed    0.02 sec
      Start 11: hash-extra-jh
11/13 Test #11: hash-extra-jh ....................   Passed    0.02 sec
      Start 12: hash-extra-skein
12/13 Test #12: hash-extra-skein .................   Passed    0.02 sec
      Start 13: libwallet_api_tests
13/13 Test #13: libwallet_api_tests ..............***Failed  280.19 sec

85% tests passed, 2 tests failed out of 13

Total Test time (real) = 3198.12 sec

The following tests FAILED:
	  2 - coretests (Failed)
	 13 - libwallet_api_tests (Failed)
make[1]: Leaving directory '/home/vagrant/slave/monero-tests-windows-10-amd64/build/build/release'
Errors while running CTest
make[1]: *** [Makefile:106: test] Error 8
make: *** [Makefile:55: release-test] Error 2
program finished with exit code 2
elapsedTime=4348.234000