(view as text)
make debug-test
 in dir /home/vagrant/slave/monero-tests-ubuntu-16_04-i686/build
 watching logfiles {'LastTest.log': 'build/debug/Testing/Temporary/LastTest.log', 'coretests.log': 'build/debug/tests/core_tests/coretests.log', 'CTestCostData.txt': 'build/debug/Testing/Temporary/CTestCostData.txt'}
 argv: ['make', 'debug-test']
 environment:
  HOME=/home/vagrant
  LANG=en_US
  LANGUAGE=en_US:
  LESSCLOSE=/usr/bin/lesspipe %s %s
  LESSOPEN=| /usr/bin/lesspipe %s
  LOGNAME=vagrant
  LS_COLORS=rs=0:di=01;34:ln=01;36:mh=00:pi=40;33:so=01;35:do=01;35:bd=40;33;01:cd=40;33;01:or=40;31;01:mi=00:su=37;41:sg=30;43:ca=30;41:tw=30;42:ow=34;42:st=37;44:ex=01;32:*.tar=01;31:*.tgz=01;31:*.arc=01;31:*.arj=01;31:*.taz=01;31:*.lha=01;31:*.lz4=01;31:*.lzh=01;31:*.lzma=01;31:*.tlz=01;31:*.txz=01;31:*.tzo=01;31:*.t7z=01;31:*.zip=01;31:*.z=01;31:*.Z=01;31:*.dz=01;31:*.gz=01;31:*.lrz=01;31:*.lz=01;31:*.lzo=01;31:*.xz=01;31:*.bz2=01;31:*.bz=01;31:*.tbz=01;31:*.tbz2=01;31:*.tz=01;31:*.deb=01;31:*.rpm=01;31:*.jar=01;31:*.war=01;31:*.ear=01;31:*.sar=01;31:*.rar=01;31:*.alz=01;31:*.ace=01;31:*.zoo=01;31:*.cpio=01;31:*.7z=01;31:*.rz=01;31:*.cab=01;31:*.jpg=01;35:*.jpeg=01;35:*.gif=01;35:*.bmp=01;35:*.pbm=01;35:*.pgm=01;35:*.ppm=01;35:*.tga=01;35:*.xbm=01;35:*.xpm=01;35:*.tif=01;35:*.tiff=01;35:*.png=01;35:*.svg=01;35:*.svgz=01;35:*.mng=01;35:*.pcx=01;35:*.mov=01;35:*.mpg=01;35:*.mpeg=01;35:*.m2v=01;35:*.mkv=01;35:*.webm=01;35:*.ogm=01;35:*.mp4=01;35:*.m4v=01;35:*.mp4v=01;35:*.vob=01;35:*.qt=01;35:*.nuv=01;35:*.wmv=01;35:*.asf=01;35:*.rm=01;35:*.rmvb=01;35:*.flc=01;35:*.avi=01;35:*.fli=01;35:*.flv=01;35:*.gl=01;35:*.dl=01;35:*.xcf=01;35:*.xwd=01;35:*.yuv=01;35:*.cgm=01;35:*.emf=01;35:*.ogv=01;35:*.ogx=01;35:*.aac=00;36:*.au=00;36:*.flac=00;36:*.m4a=00;36:*.mid=00;36:*.midi=00;36:*.mka=00;36:*.mp3=00;36:*.mpc=00;36:*.ogg=00;36:*.ra=00;36:*.wav=00;36:*.oga=00;36:*.opus=00;36:*.spx=00;36:*.xspf=00;36:
  MAIL=/var/mail/vagrant
  PATH=/home/vagrant/bin:/home/vagrant/.local/bin:/usr/local/sbin:/usr/local/bin:/usr/sbin:/usr/bin:/sbin:/bin:/usr/games:/usr/local/games
  PWD=/home/vagrant/slave/monero-tests-ubuntu-16_04-i686/build
  SHELL=/bin/bash
  SHLVL=1
  SSH_CLIENT=10.0.2.2 58134 22
  SSH_CONNECTION=10.0.2.2 58134 10.0.2.15 22
  SSH_TTY=/dev/pts/0
  TERM=xterm
  USER=vagrant
  XDG_RUNTIME_DIR=/run/user/900
  XDG_SESSION_ID=2
  _=/usr/local/bin/buildslave
 using PTY: False
mkdir -p build/debug
cd build/debug && cmake -D BUILD_TESTS=ON -D CMAKE_BUILD_TYPE=Debug ../.. && make && make test
-- Building without build tag
-- Could not find DEVELOPER_LOCAL_TOOLS in env (not required)
-- BOOST_IGNORE_SYSTEM_PATHS defaults to OFF
-- Could not find DEVELOPER_LIBUNBOUND_OLD in env (not required)
-- Building for a 32-bit system
-- Building internal libraries with position independent code
-- Could not find DATABASE in env (not required unless you want to change database type from default: lmdb)
-- Using LMDB as default DB type
-- Stack trace on exception enabled
-- Found miniupnpc API version 10
-- Using shared miniupnpc found at /usr/include/miniupnpc
-- Looking for libunbound
-- Found libunbound include (unbound.h) in /usr/include
-- Found libunbound shared library
-- Using 32-bit LMDB from source tree
-- Building on i686 for native
-- AES support enabled
-- Found Boost Version: 105800
-- Found readline library at: /usr
-- Found Git: /usr/bin/git
-- Could NOT find GTest (missing:  GTEST_LIBRARY GTEST_MAIN_LIBRARY) 
-- GTest not found on the system: will use GTest bundled with this source
-- Configuring done
-- Generating done
-- Build files have been written to: /home/vagrant/slave/monero-tests-ubuntu-16_04-i686/build/build/debug
make[1]: Entering directory '/home/vagrant/slave/monero-tests-ubuntu-16_04-i686/build/build/debug'
make[2]: Entering directory '/home/vagrant/slave/monero-tests-ubuntu-16_04-i686/build/build/debug'
make[3]: Entering directory '/home/vagrant/slave/monero-tests-ubuntu-16_04-i686/build/build/debug'
make[3]: Leaving directory '/home/vagrant/slave/monero-tests-ubuntu-16_04-i686/build/build/debug'
[  0%] Built target version
make[3]: Entering directory '/home/vagrant/slave/monero-tests-ubuntu-16_04-i686/build/build/debug'
make[3]: Leaving directory '/home/vagrant/slave/monero-tests-ubuntu-16_04-i686/build/build/debug'
[  1%] Built target lmdb
make[3]: Entering directory '/home/vagrant/slave/monero-tests-ubuntu-16_04-i686/build/build/debug'
make[3]: Leaving directory '/home/vagrant/slave/monero-tests-ubuntu-16_04-i686/build/build/debug'
[  2%] Built target easylogging
make[3]: Entering directory '/home/vagrant/slave/monero-tests-ubuntu-16_04-i686/build/build/debug'
make[3]: Leaving directory '/home/vagrant/slave/monero-tests-ubuntu-16_04-i686/build/build/debug'
[ 11%] Built target obj_cncrypto
make[3]: Entering directory '/home/vagrant/slave/monero-tests-ubuntu-16_04-i686/build/build/debug'
make[3]: Leaving directory '/home/vagrant/slave/monero-tests-ubuntu-16_04-i686/build/build/debug'
[ 12%] Built target cncrypto
make[3]: Entering directory '/home/vagrant/slave/monero-tests-ubuntu-16_04-i686/build/build/debug'
make[3]: Leaving directory '/home/vagrant/slave/monero-tests-ubuntu-16_04-i686/build/build/debug'
[ 15%] Built target epee
make[3]: Entering directory '/home/vagrant/slave/monero-tests-ubuntu-16_04-i686/build/build/debug'
make[3]: Leaving directory '/home/vagrant/slave/monero-tests-ubuntu-16_04-i686/build/build/debug'
[ 20%] Built target obj_common
make[3]: Entering directory '/home/vagrant/slave/monero-tests-ubuntu-16_04-i686/build/build/debug'
make[3]: Leaving directory '/home/vagrant/slave/monero-tests-ubuntu-16_04-i686/build/build/debug'
[ 21%] Built target common
make[3]: Entering directory '/home/vagrant/slave/monero-tests-ubuntu-16_04-i686/build/build/debug'
make[3]: Leaving directory '/home/vagrant/slave/monero-tests-ubuntu-16_04-i686/build/build/debug'
[ 22%] Built target obj_ringct
make[3]: Entering directory '/home/vagrant/slave/monero-tests-ubuntu-16_04-i686/build/build/debug'
make[3]: Leaving directory '/home/vagrant/slave/monero-tests-ubuntu-16_04-i686/build/build/debug'
[ 26%] Built target obj_cryptonote_basic
make[3]: Entering directory '/home/vagrant/slave/monero-tests-ubuntu-16_04-i686/build/build/debug'
make[3]: Leaving directory '/home/vagrant/slave/monero-tests-ubuntu-16_04-i686/build/build/debug'
[ 27%] Built target cryptonote_basic
make[3]: Entering directory '/home/vagrant/slave/monero-tests-ubuntu-16_04-i686/build/build/debug'
make[3]: Leaving directory '/home/vagrant/slave/monero-tests-ubuntu-16_04-i686/build/build/debug'
[ 27%] Built target ringct
make[3]: Entering directory '/home/vagrant/slave/monero-tests-ubuntu-16_04-i686/build/build/debug'
make[3]: Leaving directory '/home/vagrant/slave/monero-tests-ubuntu-16_04-i686/build/build/debug'
[ 28%] Built target obj_cryptonote_core
make[3]: Entering directory '/home/vagrant/slave/monero-tests-ubuntu-16_04-i686/build/build/debug'
make[3]: Leaving directory '/home/vagrant/slave/monero-tests-ubuntu-16_04-i686/build/build/debug'
[ 30%] Built target blocks
make[3]: Entering directory '/home/vagrant/slave/monero-tests-ubuntu-16_04-i686/build/build/debug'
make[3]: Leaving directory '/home/vagrant/slave/monero-tests-ubuntu-16_04-i686/build/build/debug'
[ 30%] Built target obj_blockchain_db
make[3]: Entering directory '/home/vagrant/slave/monero-tests-ubuntu-16_04-i686/build/build/debug'
make[3]: Leaving directory '/home/vagrant/slave/monero-tests-ubuntu-16_04-i686/build/build/debug'
[ 30%] Built target blockchain_db
make[3]: Entering directory '/home/vagrant/slave/monero-tests-ubuntu-16_04-i686/build/build/debug'
make[3]: Leaving directory '/home/vagrant/slave/monero-tests-ubuntu-16_04-i686/build/build/debug'
[ 30%] Built target cryptonote_core
make[3]: Entering directory '/home/vagrant/slave/monero-tests-ubuntu-16_04-i686/build/build/debug'
make[3]: Leaving directory '/home/vagrant/slave/monero-tests-ubuntu-16_04-i686/build/build/debug'
[ 30%] Built target obj_mnemonics
make[3]: Entering directory '/home/vagrant/slave/monero-tests-ubuntu-16_04-i686/build/build/debug'
make[3]: Leaving directory '/home/vagrant/slave/monero-tests-ubuntu-16_04-i686/build/build/debug'
[ 31%] Built target mnemonics
make[3]: Entering directory '/home/vagrant/slave/monero-tests-ubuntu-16_04-i686/build/build/debug'
make[3]: Leaving directory '/home/vagrant/slave/monero-tests-ubuntu-16_04-i686/build/build/debug'
[ 32%] Built target obj_rpc
make[3]: Entering directory '/home/vagrant/slave/monero-tests-ubuntu-16_04-i686/build/build/debug'
make[3]: Leaving directory '/home/vagrant/slave/monero-tests-ubuntu-16_04-i686/build/build/debug'
[ 33%] Built target obj_cryptonote_protocol
make[3]: Entering directory '/home/vagrant/slave/monero-tests-ubuntu-16_04-i686/build/build/debug'
make[3]: Leaving directory '/home/vagrant/slave/monero-tests-ubuntu-16_04-i686/build/build/debug'
[ 35%] Built target obj_p2p
make[3]: Entering directory '/home/vagrant/slave/monero-tests-ubuntu-16_04-i686/build/build/debug'
make[3]: Leaving directory '/home/vagrant/slave/monero-tests-ubuntu-16_04-i686/build/build/debug'
[ 36%] Built target p2p
make[3]: Entering directory '/home/vagrant/slave/monero-tests-ubuntu-16_04-i686/build/build/debug'
make[3]: Leaving directory '/home/vagrant/slave/monero-tests-ubuntu-16_04-i686/build/build/debug'
[ 37%] Built target cryptonote_protocol
make[3]: Entering directory '/home/vagrant/slave/monero-tests-ubuntu-16_04-i686/build/build/debug'
make[3]: Leaving directory '/home/vagrant/slave/monero-tests-ubuntu-16_04-i686/build/build/debug'
[ 37%] Built target rpc
make[3]: Entering directory '/home/vagrant/slave/monero-tests-ubuntu-16_04-i686/build/build/debug'
make[3]: Leaving directory '/home/vagrant/slave/monero-tests-ubuntu-16_04-i686/build/build/debug'
[ 42%] Built target obj_wallet
make[3]: Entering directory '/home/vagrant/slave/monero-tests-ubuntu-16_04-i686/build/build/debug'
make[3]: Leaving directory '/home/vagrant/slave/monero-tests-ubuntu-16_04-i686/build/build/debug'
[ 43%] Built target wallet
make[3]: Entering directory '/home/vagrant/slave/monero-tests-ubuntu-16_04-i686/build/build/debug'
make[3]: Leaving directory '/home/vagrant/slave/monero-tests-ubuntu-16_04-i686/build/build/debug'
[ 44%] Built target wallet_rpc_server
make[3]: Entering directory '/home/vagrant/slave/monero-tests-ubuntu-16_04-i686/build/build/debug'
make[3]: Leaving directory '/home/vagrant/slave/monero-tests-ubuntu-16_04-i686/build/build/debug'
[ 45%] Built target simplewallet
make[3]: Entering directory '/home/vagrant/slave/monero-tests-ubuntu-16_04-i686/build/build/debug'
make[3]: Leaving directory '/home/vagrant/slave/monero-tests-ubuntu-16_04-i686/build/build/debug'
[ 46%] Built target obj_daemonizer
make[3]: Entering directory '/home/vagrant/slave/monero-tests-ubuntu-16_04-i686/build/build/debug'
make[3]: Leaving directory '/home/vagrant/slave/monero-tests-ubuntu-16_04-i686/build/build/debug'
[ 47%] Built target daemonizer
make[3]: Entering directory '/home/vagrant/slave/monero-tests-ubuntu-16_04-i686/build/build/debug'
make[3]: Leaving directory '/home/vagrant/slave/monero-tests-ubuntu-16_04-i686/build/build/debug'
[ 50%] Built target daemon
make[3]: Entering directory '/home/vagrant/slave/monero-tests-ubuntu-16_04-i686/build/build/debug'
make[3]: Leaving directory '/home/vagrant/slave/monero-tests-ubuntu-16_04-i686/build/build/debug'
[ 52%] Built target blockchain_import
make[3]: Entering directory '/home/vagrant/slave/monero-tests-ubuntu-16_04-i686/build/build/debug'
make[3]: Leaving directory '/home/vagrant/slave/monero-tests-ubuntu-16_04-i686/build/build/debug'
[ 54%] Built target blockchain_export
make[3]: Entering directory '/home/vagrant/slave/monero-tests-ubuntu-16_04-i686/build/build/debug'
make[3]: Leaving directory '/home/vagrant/slave/monero-tests-ubuntu-16_04-i686/build/build/debug'
[ 55%] Built target cn_deserialize
make[3]: Entering directory '/home/vagrant/slave/monero-tests-ubuntu-16_04-i686/build/build/debug'
Scanning dependencies of target googletest
make[3]: Leaving directory '/home/vagrant/slave/monero-tests-ubuntu-16_04-i686/build/build/debug'
make[3]: Entering directory '/home/vagrant/slave/monero-tests-ubuntu-16_04-i686/build/build/debug'
[ 55%] Creating directories for 'googletest'
[ 55%] No download step for 'googletest'
[ 55%] No patch step for 'googletest'
[ 56%] No update step for 'googletest'
[ 57%] Performing configure step for 'googletest'
-- The CXX compiler identification is GNU 5.4.0
-- The C compiler identification is GNU 5.4.0
-- Check for working CXX compiler: /usr/bin/c++
-- Check for working CXX compiler: /usr/bin/c++ -- works
-- Detecting CXX compiler ABI info
-- Detecting CXX compiler ABI info - done
-- Detecting CXX compile features
-- Detecting CXX compile features - done
-- Check for working C compiler: /usr/bin/cc
-- Check for working C compiler: /usr/bin/cc -- works
-- Detecting C compiler ABI info
-- Detecting C compiler ABI info - done
-- Detecting C compile features
-- Detecting C compile features - done
-- Found PythonInterp: /usr/bin/python (found version "2.7.12") 
-- Looking for pthread.h
-- Looking for pthread.h - found
-- Looking for pthread_create
-- Looking for pthread_create - not found
-- Looking for pthread_create in pthreads
-- Looking for pthread_create in pthreads - not found
-- Looking for pthread_create in pthread
-- Looking for pthread_create in pthread - found
-- Found Threads: TRUE  
-- Configuring done
-- Generating done
-- Build files have been written to: /home/vagrant/slave/monero-tests-ubuntu-16_04-i686/build/build/debug/tests/gtest
[ 57%] Performing build step for 'googletest'
make[4]: Entering directory '/home/vagrant/slave/monero-tests-ubuntu-16_04-i686/build/build/debug/tests/gtest'
make[5]: Entering directory '/home/vagrant/slave/monero-tests-ubuntu-16_04-i686/build/build/debug/tests/gtest'
make[6]: Entering directory '/home/vagrant/slave/monero-tests-ubuntu-16_04-i686/build/build/debug/tests/gtest'
Scanning dependencies of target gtest
make[6]: Leaving directory '/home/vagrant/slave/monero-tests-ubuntu-16_04-i686/build/build/debug/tests/gtest'
make[6]: Entering directory '/home/vagrant/slave/monero-tests-ubuntu-16_04-i686/build/build/debug/tests/gtest'
[ 25%] Building CXX object CMakeFiles/gtest.dir/src/gtest-all.cc.o
[ 50%] Linking CXX static library libgtest.a
make[6]: Leaving directory '/home/vagrant/slave/monero-tests-ubuntu-16_04-i686/build/build/debug/tests/gtest'
[ 50%] Built target gtest
make[6]: Entering directory '/home/vagrant/slave/monero-tests-ubuntu-16_04-i686/build/build/debug/tests/gtest'
Scanning dependencies of target gtest_main
make[6]: Leaving directory '/home/vagrant/slave/monero-tests-ubuntu-16_04-i686/build/build/debug/tests/gtest'
make[6]: Entering directory '/home/vagrant/slave/monero-tests-ubuntu-16_04-i686/build/build/debug/tests/gtest'
[ 75%] Building CXX object CMakeFiles/gtest_main.dir/src/gtest_main.cc.o
[100%] Linking CXX static library libgtest_main.a
make[6]: Leaving directory '/home/vagrant/slave/monero-tests-ubuntu-16_04-i686/build/build/debug/tests/gtest'
[100%] Built target gtest_main
make[5]: Leaving directory '/home/vagrant/slave/monero-tests-ubuntu-16_04-i686/build/build/debug/tests/gtest'
make[4]: Leaving directory '/home/vagrant/slave/monero-tests-ubuntu-16_04-i686/build/build/debug/tests/gtest'
[ 58%] No install step for 'googletest'
[ 58%] Completed 'googletest'
make[3]: Leaving directory '/home/vagrant/slave/monero-tests-ubuntu-16_04-i686/build/build/debug'
[ 58%] Built target googletest
make[3]: Entering directory '/home/vagrant/slave/monero-tests-ubuntu-16_04-i686/build/build/debug'
Scanning dependencies of target hash-target-tests
make[3]: Leaving directory '/home/vagrant/slave/monero-tests-ubuntu-16_04-i686/build/build/debug'
make[3]: Entering directory '/home/vagrant/slave/monero-tests-ubuntu-16_04-i686/build/build/debug'
[ 59%] Building CXX object tests/CMakeFiles/hash-target-tests.dir/hash-target.cpp.o
[ 59%] Linking CXX executable hash-target-tests
make[3]: Leaving directory '/home/vagrant/slave/monero-tests-ubuntu-16_04-i686/build/build/debug'
[ 59%] Built target hash-target-tests
make[3]: Entering directory '/home/vagrant/slave/monero-tests-ubuntu-16_04-i686/build/build/debug'
Scanning dependencies of target coretests
make[3]: Leaving directory '/home/vagrant/slave/monero-tests-ubuntu-16_04-i686/build/build/debug'
make[3]: Entering directory '/home/vagrant/slave/monero-tests-ubuntu-16_04-i686/build/build/debug'
[ 59%] Building CXX object tests/core_tests/CMakeFiles/coretests.dir/block_reward.cpp.o
[ 60%] Building CXX object tests/core_tests/CMakeFiles/coretests.dir/block_validation.cpp.o
[ 60%] Building CXX object tests/core_tests/CMakeFiles/coretests.dir/chain_split_1.cpp.o
[ 61%] Building CXX object tests/core_tests/CMakeFiles/coretests.dir/chain_switch_1.cpp.o
[ 61%] Building CXX object tests/core_tests/CMakeFiles/coretests.dir/chaingen.cpp.o
[ 61%] Building CXX object tests/core_tests/CMakeFiles/coretests.dir/chaingen001.cpp.o
[ 62%] Building CXX object tests/core_tests/CMakeFiles/coretests.dir/chaingen_main.cpp.o
[ 62%] Building CXX object tests/core_tests/CMakeFiles/coretests.dir/double_spend.cpp.o
[ 63%] Building CXX object tests/core_tests/CMakeFiles/coretests.dir/integer_overflow.cpp.o
[ 63%] Building CXX object tests/core_tests/CMakeFiles/coretests.dir/ring_signature_1.cpp.o
[ 64%] Building CXX object tests/core_tests/CMakeFiles/coretests.dir/transaction_tests.cpp.o
[ 64%] Building CXX object tests/core_tests/CMakeFiles/coretests.dir/tx_validation.cpp.o
[ 65%] Building CXX object tests/core_tests/CMakeFiles/coretests.dir/v2_tests.cpp.o
[ 65%] Building CXX object tests/core_tests/CMakeFiles/coretests.dir/rct.cpp.o
[ 65%] Linking CXX executable coretests
make[3]: Leaving directory '/home/vagrant/slave/monero-tests-ubuntu-16_04-i686/build/build/debug'
[ 65%] Built target coretests
make[3]: Entering directory '/home/vagrant/slave/monero-tests-ubuntu-16_04-i686/build/build/debug'
Scanning dependencies of target signature_fuzz_tests
make[3]: Leaving directory '/home/vagrant/slave/monero-tests-ubuntu-16_04-i686/build/build/debug'
make[3]: Entering directory '/home/vagrant/slave/monero-tests-ubuntu-16_04-i686/build/build/debug'
[ 66%] Building CXX object tests/fuzz/CMakeFiles/signature_fuzz_tests.dir/signature.cpp.o
[ 66%] Building CXX object tests/fuzz/CMakeFiles/signature_fuzz_tests.dir/fuzzer.cpp.o
[ 67%] Linking CXX executable signature_fuzz_tests
make[3]: Leaving directory '/home/vagrant/slave/monero-tests-ubuntu-16_04-i686/build/build/debug'
[ 67%] Built target signature_fuzz_tests
make[3]: Entering directory '/home/vagrant/slave/monero-tests-ubuntu-16_04-i686/build/build/debug'
Scanning dependencies of target cold-outputs_fuzz_tests
make[3]: Leaving directory '/home/vagrant/slave/monero-tests-ubuntu-16_04-i686/build/build/debug'
make[3]: Entering directory '/home/vagrant/slave/monero-tests-ubuntu-16_04-i686/build/build/debug'
[ 67%] Building CXX object tests/fuzz/CMakeFiles/cold-outputs_fuzz_tests.dir/cold-outputs.cpp.o
[ 68%] Building CXX object tests/fuzz/CMakeFiles/cold-outputs_fuzz_tests.dir/fuzzer.cpp.o
[ 68%] Linking CXX executable cold-outputs_fuzz_tests
make[3]: Leaving directory '/home/vagrant/slave/monero-tests-ubuntu-16_04-i686/build/build/debug'
[ 68%] Built target cold-outputs_fuzz_tests
make[3]: Entering directory '/home/vagrant/slave/monero-tests-ubuntu-16_04-i686/build/build/debug'
Scanning dependencies of target block_fuzz_tests
make[3]: Leaving directory '/home/vagrant/slave/monero-tests-ubuntu-16_04-i686/build/build/debug'
make[3]: Entering directory '/home/vagrant/slave/monero-tests-ubuntu-16_04-i686/build/build/debug'
[ 68%] Building CXX object tests/fuzz/CMakeFiles/block_fuzz_tests.dir/block.cpp.o
[ 68%] Building CXX object tests/fuzz/CMakeFiles/block_fuzz_tests.dir/fuzzer.cpp.o
[ 69%] Linking CXX executable block_fuzz_tests
make[3]: Leaving directory '/home/vagrant/slave/monero-tests-ubuntu-16_04-i686/build/build/debug'
[ 69%] Built target block_fuzz_tests
make[3]: Entering directory '/home/vagrant/slave/monero-tests-ubuntu-16_04-i686/build/build/debug'
Scanning dependencies of target transaction_fuzz_tests
make[3]: Leaving directory '/home/vagrant/slave/monero-tests-ubuntu-16_04-i686/build/build/debug'
make[3]: Entering directory '/home/vagrant/slave/monero-tests-ubuntu-16_04-i686/build/build/debug'
[ 69%] Building CXX object tests/fuzz/CMakeFiles/transaction_fuzz_tests.dir/transaction.cpp.o
[ 70%] Building CXX object tests/fuzz/CMakeFiles/transaction_fuzz_tests.dir/fuzzer.cpp.o
[ 70%] Linking CXX executable transaction_fuzz_tests
make[3]: Leaving directory '/home/vagrant/slave/monero-tests-ubuntu-16_04-i686/build/build/debug'
[ 70%] Built target transaction_fuzz_tests
make[3]: Entering directory '/home/vagrant/slave/monero-tests-ubuntu-16_04-i686/build/build/debug'
Scanning dependencies of target cold-transaction_fuzz_tests
make[3]: Leaving directory '/home/vagrant/slave/monero-tests-ubuntu-16_04-i686/build/build/debug'
make[3]: Entering directory '/home/vagrant/slave/monero-tests-ubuntu-16_04-i686/build/build/debug'
[ 70%] Building CXX object tests/fuzz/CMakeFiles/cold-transaction_fuzz_tests.dir/cold-transaction.cpp.o
[ 71%] Building CXX object tests/fuzz/CMakeFiles/cold-transaction_fuzz_tests.dir/fuzzer.cpp.o
[ 71%] Linking CXX executable cold-transaction_fuzz_tests
make[3]: Leaving directory '/home/vagrant/slave/monero-tests-ubuntu-16_04-i686/build/build/debug'
[ 71%] Built target cold-transaction_fuzz_tests
make[3]: Entering directory '/home/vagrant/slave/monero-tests-ubuntu-16_04-i686/build/build/debug'
Scanning dependencies of target cncrypto-tests
make[3]: Leaving directory '/home/vagrant/slave/monero-tests-ubuntu-16_04-i686/build/build/debug'
make[3]: Entering directory '/home/vagrant/slave/monero-tests-ubuntu-16_04-i686/build/build/debug'
[ 71%] Building C object tests/crypto/CMakeFiles/cncrypto-tests.dir/crypto-ops-data.c.o
[ 71%] Building C object tests/crypto/CMakeFiles/cncrypto-tests.dir/crypto-ops.c.o
[ 72%] Building CXX object tests/crypto/CMakeFiles/cncrypto-tests.dir/crypto.cpp.o
[ 72%] Building C object tests/crypto/CMakeFiles/cncrypto-tests.dir/hash.c.o
[ 73%] Building CXX object tests/crypto/CMakeFiles/cncrypto-tests.dir/main.cpp.o
[ 73%] Building C object tests/crypto/CMakeFiles/cncrypto-tests.dir/random.c.o
[ 74%] Linking CXX executable cncrypto-tests
make[3]: Leaving directory '/home/vagrant/slave/monero-tests-ubuntu-16_04-i686/build/build/debug'
[ 74%] Built target cncrypto-tests
make[3]: Entering directory '/home/vagrant/slave/monero-tests-ubuntu-16_04-i686/build/build/debug'
Scanning dependencies of target functional_tests
make[3]: Leaving directory '/home/vagrant/slave/monero-tests-ubuntu-16_04-i686/build/build/debug'
make[3]: Entering directory '/home/vagrant/slave/monero-tests-ubuntu-16_04-i686/build/build/debug'
[ 74%] Building CXX object tests/functional_tests/CMakeFiles/functional_tests.dir/main.cpp.o
[ 75%] Building CXX object tests/functional_tests/CMakeFiles/functional_tests.dir/transactions_flow_test.cpp.o
[ 75%] Building CXX object tests/functional_tests/CMakeFiles/functional_tests.dir/transactions_generation_from_blockchain.cpp.o
[ 76%] Linking CXX executable functional_tests
make[3]: Leaving directory '/home/vagrant/slave/monero-tests-ubuntu-16_04-i686/build/build/debug'
[ 76%] Built target functional_tests
make[3]: Entering directory '/home/vagrant/slave/monero-tests-ubuntu-16_04-i686/build/build/debug'
Scanning dependencies of target performance_tests
make[3]: Leaving directory '/home/vagrant/slave/monero-tests-ubuntu-16_04-i686/build/build/debug'
make[3]: Entering directory '/home/vagrant/slave/monero-tests-ubuntu-16_04-i686/build/build/debug'
[ 76%] Building CXX object tests/performance_tests/CMakeFiles/performance_tests.dir/main.cpp.o
[ 77%] Linking CXX executable performance_tests
make[3]: Leaving directory '/home/vagrant/slave/monero-tests-ubuntu-16_04-i686/build/build/debug'
[ 77%] Built target performance_tests
make[3]: Entering directory '/home/vagrant/slave/monero-tests-ubuntu-16_04-i686/build/build/debug'
Scanning dependencies of target core_proxy
make[3]: Leaving directory '/home/vagrant/slave/monero-tests-ubuntu-16_04-i686/build/build/debug'
make[3]: Entering directory '/home/vagrant/slave/monero-tests-ubuntu-16_04-i686/build/build/debug'
[ 77%] Building CXX object tests/core_proxy/CMakeFiles/core_proxy.dir/core_proxy.cpp.o
[ 78%] Linking CXX executable core_proxy
make[3]: Leaving directory '/home/vagrant/slave/monero-tests-ubuntu-16_04-i686/build/build/debug'
[ 78%] Built target core_proxy
make[3]: Entering directory '/home/vagrant/slave/monero-tests-ubuntu-16_04-i686/build/build/debug'
Scanning dependencies of target unit_tests
make[3]: Leaving directory '/home/vagrant/slave/monero-tests-ubuntu-16_04-i686/build/build/debug'
make[3]: Entering directory '/home/vagrant/slave/monero-tests-ubuntu-16_04-i686/build/build/debug'
[ 78%] Building CXX object tests/unit_tests/CMakeFiles/unit_tests.dir/address_from_url.cpp.o
[ 79%] Building CXX object tests/unit_tests/CMakeFiles/unit_tests.dir/ban.cpp.o
[ 79%] Building CXX object tests/unit_tests/CMakeFiles/unit_tests.dir/base58.cpp.o
[ 80%] Building CXX object tests/unit_tests/CMakeFiles/unit_tests.dir/blockchain_db.cpp.o
[ 80%] Building CXX object tests/unit_tests/CMakeFiles/unit_tests.dir/block_queue.cpp.o
[ 81%] Building CXX object tests/unit_tests/CMakeFiles/unit_tests.dir/block_reward.cpp.o
[ 81%] Building CXX object tests/unit_tests/CMakeFiles/unit_tests.dir/canonical_amounts.cpp.o
[ 82%] Building CXX object tests/unit_tests/CMakeFiles/unit_tests.dir/chacha8.cpp.o
[ 82%] Building CXX object tests/unit_tests/CMakeFiles/unit_tests.dir/checkpoints.cpp.o
In file included from /home/vagrant/slave/monero-tests-ubuntu-16_04-i686/build/contrib/epee/include/storages/portable_storage.h:36:0,
                 from /home/vagrant/slave/monero-tests-ubuntu-16_04-i686/build/contrib/epee/include/storages/portable_storage_template_helper.h:32,
                 from /home/vagrant/slave/monero-tests-ubuntu-16_04-i686/build/src/cryptonote_basic/checkpoints.h:36,
                 from /home/vagrant/slave/monero-tests-ubuntu-16_04-i686/build/src/cryptonote_basic/checkpoints.cpp:35,
                 from /home/vagrant/slave/monero-tests-ubuntu-16_04-i686/build/tests/unit_tests/checkpoints.cpp:33:
/home/vagrant/slave/monero-tests-ubuntu-16_04-i686/build/contrib/epee/include/storages/portable_storage_from_json.h: In function 'void epee::serialization::json::run_handler(typename t_storage::hsection, std::__cxx11::basic_string<char>::const_iterator&, std::__cxx11::basic_string<char>::const_iterator, t_storage&) [with t_storage = epee::serialization::portable_storage; typename t_storage::hsection = epee::serialization::section*; std::__cxx11::basic_string<char>::const_iterator = __gnu_cxx::__normal_iterator<const char*, std::__cxx11::basic_string<char> >]':
/home/vagrant/slave/monero-tests-ubuntu-16_04-i686/build/contrib/epee/include/storages/portable_storage_from_json.h:284:66: warning: 'result' may be used uninitialized in this function [-Wmaybe-uninitialized]
                   int64_t nval = boost::lexical_cast<int64_t>(val);  //bool res = string_tools::string_to_num_fast(val, nval);
                                                                  ^
/home/vagrant/slave/monero-tests-ubuntu-16_04-i686/build/contrib/epee/include/storages/portable_storage_from_json.h:206:64: warning: 'result' may be used uninitialized in this function [-Wmaybe-uninitialized]
                 int64_t nval = boost::lexical_cast<int64_t>(val);//bool res = string_tools::string_to_num_fast(val, nval);
                                                                ^
/home/vagrant/slave/monero-tests-ubuntu-16_04-i686/build/contrib/epee/include/storages/portable_storage_from_json.h:123:66: warning: 'result' may be used uninitialized in this function [-Wmaybe-uninitialized]
                   int64_t nval = boost::lexical_cast<int64_t>(val);
                                                                  ^
[ 83%] Building CXX object tests/unit_tests/CMakeFiles/unit_tests.dir/command_line.cpp.o
[ 83%] Building CXX object tests/unit_tests/CMakeFiles/unit_tests.dir/crypto.cpp.o
[ 83%] Building CXX object tests/unit_tests/CMakeFiles/unit_tests.dir/decompose_amount_into_digits.cpp.o
[ 84%] Building CXX object tests/unit_tests/CMakeFiles/unit_tests.dir/dns_resolver.cpp.o
[ 84%] Building CXX object tests/unit_tests/CMakeFiles/unit_tests.dir/epee_boosted_tcp_server.cpp.o
[ 85%] Building CXX object tests/unit_tests/CMakeFiles/unit_tests.dir/epee_levin_protocol_handler_async.cpp.o
[ 85%] Building CXX object tests/unit_tests/CMakeFiles/unit_tests.dir/epee_utils.cpp.o
[ 86%] Building CXX object tests/unit_tests/CMakeFiles/unit_tests.dir/fee.cpp.o
[ 86%] Building CXX object tests/unit_tests/CMakeFiles/unit_tests.dir/get_xtype_from_string.cpp.o
[ 87%] Building CXX object tests/unit_tests/CMakeFiles/unit_tests.dir/http.cpp.o
[ 87%] Building CXX object tests/unit_tests/CMakeFiles/unit_tests.dir/main.cpp.o
[ 87%] Building CXX object tests/unit_tests/CMakeFiles/unit_tests.dir/mnemonics.cpp.o
[ 88%] Building CXX object tests/unit_tests/CMakeFiles/unit_tests.dir/mul_div.cpp.o
[ 88%] Building CXX object tests/unit_tests/CMakeFiles/unit_tests.dir/parse_amount.cpp.o
[ 89%] Building CXX object tests/unit_tests/CMakeFiles/unit_tests.dir/serialization.cpp.o
[ 89%] Building CXX object tests/unit_tests/CMakeFiles/unit_tests.dir/slow_memmem.cpp.o
[ 90%] Building CXX object tests/unit_tests/CMakeFiles/unit_tests.dir/test_tx_utils.cpp.o
[ 90%] Building CXX object tests/unit_tests/CMakeFiles/unit_tests.dir/test_peerlist.cpp.o
[ 91%] Building CXX object tests/unit_tests/CMakeFiles/unit_tests.dir/test_protocol_pack.cpp.o
[ 91%] Building CXX object tests/unit_tests/CMakeFiles/unit_tests.dir/thread_group.cpp.o
[ 92%] Building CXX object tests/unit_tests/CMakeFiles/unit_tests.dir/hardfork.cpp.o
[ 92%] Building CXX object tests/unit_tests/CMakeFiles/unit_tests.dir/unbound.cpp.o
[ 92%] Building CXX object tests/unit_tests/CMakeFiles/unit_tests.dir/uri.cpp.o
[ 93%] Building CXX object tests/unit_tests/CMakeFiles/unit_tests.dir/varint.cpp.o
[ 93%] Building CXX object tests/unit_tests/CMakeFiles/unit_tests.dir/ringct.cpp.o
[ 94%] Building CXX object tests/unit_tests/CMakeFiles/unit_tests.dir/output_selection.cpp.o
[ 94%] Building CXX object tests/unit_tests/CMakeFiles/unit_tests.dir/vercmp.cpp.o
[ 95%] Linking CXX executable unit_tests
make[3]: Leaving directory '/home/vagrant/slave/monero-tests-ubuntu-16_04-i686/build/build/debug'
[ 95%] Built target unit_tests
make[3]: Entering directory '/home/vagrant/slave/monero-tests-ubuntu-16_04-i686/build/build/debug'
Scanning dependencies of target difficulty-tests
make[3]: Leaving directory '/home/vagrant/slave/monero-tests-ubuntu-16_04-i686/build/build/debug'
make[3]: Entering directory '/home/vagrant/slave/monero-tests-ubuntu-16_04-i686/build/build/debug'
[ 95%] Building CXX object tests/difficulty/CMakeFiles/difficulty-tests.dir/difficulty.cpp.o
[ 96%] Linking CXX executable difficulty-tests
make[3]: Leaving directory '/home/vagrant/slave/monero-tests-ubuntu-16_04-i686/build/build/debug'
[ 96%] Built target difficulty-tests
make[3]: Entering directory '/home/vagrant/slave/monero-tests-ubuntu-16_04-i686/build/build/debug'
Scanning dependencies of target hash-tests
make[3]: Leaving directory '/home/vagrant/slave/monero-tests-ubuntu-16_04-i686/build/build/debug'
make[3]: Entering directory '/home/vagrant/slave/monero-tests-ubuntu-16_04-i686/build/build/debug'
[ 97%] Building CXX object tests/hash/CMakeFiles/hash-tests.dir/main.cpp.o
[ 97%] Linking CXX executable hash-tests
make[3]: Leaving directory '/home/vagrant/slave/monero-tests-ubuntu-16_04-i686/build/build/debug'
[ 97%] Built target hash-tests
make[3]: Entering directory '/home/vagrant/slave/monero-tests-ubuntu-16_04-i686/build/build/debug'
Scanning dependencies of target net_load_tests_clt
make[3]: Leaving directory '/home/vagrant/slave/monero-tests-ubuntu-16_04-i686/build/build/debug'
make[3]: Entering directory '/home/vagrant/slave/monero-tests-ubuntu-16_04-i686/build/build/debug'
[ 97%] Building CXX object tests/net_load_tests/CMakeFiles/net_load_tests_clt.dir/clt.cpp.o
[ 98%] Linking CXX executable net_load_tests_clt
make[3]: Leaving directory '/home/vagrant/slave/monero-tests-ubuntu-16_04-i686/build/build/debug'
[ 98%] Built target net_load_tests_clt
make[3]: Entering directory '/home/vagrant/slave/monero-tests-ubuntu-16_04-i686/build/build/debug'
Scanning dependencies of target net_load_tests_srv
make[3]: Leaving directory '/home/vagrant/slave/monero-tests-ubuntu-16_04-i686/build/build/debug'
make[3]: Entering directory '/home/vagrant/slave/monero-tests-ubuntu-16_04-i686/build/build/debug'
[ 98%] Building CXX object tests/net_load_tests/CMakeFiles/net_load_tests_srv.dir/srv.cpp.o
[ 99%] Linking CXX executable net_load_tests_srv
make[3]: Leaving directory '/home/vagrant/slave/monero-tests-ubuntu-16_04-i686/build/build/debug'
[ 99%] Built target net_load_tests_srv
make[3]: Entering directory '/home/vagrant/slave/monero-tests-ubuntu-16_04-i686/build/build/debug'
Scanning dependencies of target libwallet_api_tests
make[3]: Leaving directory '/home/vagrant/slave/monero-tests-ubuntu-16_04-i686/build/build/debug'
make[3]: Entering directory '/home/vagrant/slave/monero-tests-ubuntu-16_04-i686/build/build/debug'
[ 99%] Building CXX object tests/libwallet_api_tests/CMakeFiles/libwallet_api_tests.dir/main.cpp.o
[100%] Linking CXX executable libwallet_api_tests
make[3]: Leaving directory '/home/vagrant/slave/monero-tests-ubuntu-16_04-i686/build/build/debug'
[100%] Built target libwallet_api_tests
make[2]: Leaving directory '/home/vagrant/slave/monero-tests-ubuntu-16_04-i686/build/build/debug'
make[1]: Leaving directory '/home/vagrant/slave/monero-tests-ubuntu-16_04-i686/build/build/debug'
make[1]: Entering directory '/home/vagrant/slave/monero-tests-ubuntu-16_04-i686/build/build/debug'
Running tests...
Test project /home/vagrant/slave/monero-tests-ubuntu-16_04-i686/build/build/debug
      Start  1: hash-target
 1/13 Test  #1: hash-target ......................   Passed    0.12 sec
      Start  2: coretests
 2/13 Test  #2: coretests ........................   Passed  9771.04 sec
      Start  3: cncrypto
 3/13 Test  #3: cncrypto .........................   Passed   40.80 sec
      Start  4: unit_tests
 4/13 Test  #4: unit_tests .......................   Passed   39.18 sec
      Start  5: difficulty
 5/13 Test  #5: difficulty .......................   Passed    0.02 sec
      Start  6: hash-fast
 6/13 Test  #6: hash-fast ........................   Passed    0.01 sec
      Start  7: hash-slow
 7/13 Test  #7: hash-slow ........................   Passed    0.31 sec
      Start  8: hash-tree
 8/13 Test  #8: hash-tree ........................   Passed    0.00 sec
      Start  9: hash-extra-blake
 9/13 Test  #9: hash-extra-blake .................   Passed    0.01 sec
      Start 10: hash-extra-groestl
10/13 Test #10: hash-extra-groestl ...............   Passed    0.01 sec
      Start 11: hash-extra-jh
11/13 Test #11: hash-extra-jh ....................   Passed    0.02 sec
      Start 12: hash-extra-skein
12/13 Test #12: hash-extra-skein .................   Passed    0.01 sec
      Start 13: libwallet_api_tests
13/13 Test #13: libwallet_api_tests ..............***Exception: SegFault280.89 sec

92% tests passed, 1 tests failed out of 13

Total Test time (real) = 10132.49 sec

The following tests FAILED:
	 13 - libwallet_api_tests (SEGFAULT)
Errors while running CTest
Makefile:104: recipe for target 'test' failed
make[1]: Leaving directory '/home/vagrant/slave/monero-tests-ubuntu-16_04-i686/build/build/debug'
make[1]: *** [test] Error 8
Makefile:39: recipe for target 'debug-test' failed
make: *** [debug-test] Error 2
program finished with exit code 2
elapsedTime=10836.191460