(view as text)
make debug-test
 in dir /home/buildbot/slave/monero-tests-ubuntu-16_04-armv7/build
 watching logfiles {'LastTest.log': 'build/debug/Testing/Temporary/LastTest.log', 'coretests.log': 'build/debug/tests/core_tests/coretests.log', 'CTestCostData.txt': 'build/debug/Testing/Temporary/CTestCostData.txt'}
 argv: ['make', 'debug-test']
 environment:
  HOME=/home/buildbot
  LANG=en_US.UTF-8
  LOGNAME=buildbot
  MAIL=/var/mail/buildbot
  PATH=/usr/local/bin:/usr/bin:/bin:/usr/local/games:/usr/games
  PWD=/home/buildbot/slave/monero-tests-ubuntu-16_04-armv7/build
  SHELL=/bin/bash
  SHLVL=1
  TERM=xterm
  USER=buildbot
  _=/usr/bin/buildslave
 using PTY: False
mkdir -p build/debug
cd build/debug && cmake -D BUILD_TESTS=ON -D CMAKE_BUILD_TYPE=Debug ../.. && make && make test
-- Could not find DEVELOPER_LOCAL_TOOLS in env (not required)
-- BOOST_IGNORE_SYSTEM_PATHS defaults to OFF
-- Could not find DEVELOPER_LIBUNBOUND_OLD in env (not required)
-- Building for a 32-bit system
-- Building internal libraries as static
-- Could not find DATABASE in env (not required unless you want to change database type from default: lmdb)
-- Using LMDB as default DB type
-- Stack trace on exception enabled
-- Detecting version of miniupnpc in path: /usr/include/miniupnpc
-- Found miniupnpc version is v1.7 or higher
-- Using shared miniupnpc found at /usr/include/miniupnpc
-- Looking for libunbound
-- Found libunbound include (unbound.h) in /usr/include
-- Found libunbound shared library
-- Using 32-bit LMDB from source tree
-- Building on armv7l for native
-- AES support not available on ARMv7
-- Setting FPU Flags for ARM Processors
-- Setting Hardware ABI for Floating Point
-- Found Boost Version: 105800
-- Found Git: /usr/bin/git
-- Could NOT find GTest (missing:  GTEST_LIBRARY GTEST_MAIN_LIBRARY) 
-- GTest not found on the system: will use GTest bundled with this source
-- Configuring done
-- Generating done
-- Build files have been written to: /home/buildbot/slave/monero-tests-ubuntu-16_04-armv7/build/build/debug
make[1]: Entering directory '/home/buildbot/slave/monero-tests-ubuntu-16_04-armv7/build/build/debug'
make[2]: Entering directory '/home/buildbot/slave/monero-tests-ubuntu-16_04-armv7/build/build/debug'
make[3]: Entering directory '/home/buildbot/slave/monero-tests-ubuntu-16_04-armv7/build/build/debug'
make[3]: Leaving directory '/home/buildbot/slave/monero-tests-ubuntu-16_04-armv7/build/build/debug'
[  1%] Built target version
make[3]: Entering directory '/home/buildbot/slave/monero-tests-ubuntu-16_04-armv7/build/build/debug'
make[3]: Leaving directory '/home/buildbot/slave/monero-tests-ubuntu-16_04-armv7/build/build/debug'
[  3%] Built target lmdb
make[3]: Entering directory '/home/buildbot/slave/monero-tests-ubuntu-16_04-armv7/build/build/debug'
make[3]: Leaving directory '/home/buildbot/slave/monero-tests-ubuntu-16_04-armv7/build/build/debug'
[  6%] Built target otshell_utils
make[3]: Entering directory '/home/buildbot/slave/monero-tests-ubuntu-16_04-armv7/build/build/debug'
make[3]: Leaving directory '/home/buildbot/slave/monero-tests-ubuntu-16_04-armv7/build/build/debug'
[ 10%] Built target obj_common
make[3]: Entering directory '/home/buildbot/slave/monero-tests-ubuntu-16_04-armv7/build/build/debug'
make[3]: Leaving directory '/home/buildbot/slave/monero-tests-ubuntu-16_04-armv7/build/build/debug'
[ 20%] Built target obj_crypto
make[3]: Entering directory '/home/buildbot/slave/monero-tests-ubuntu-16_04-armv7/build/build/debug'
make[3]: Leaving directory '/home/buildbot/slave/monero-tests-ubuntu-16_04-armv7/build/build/debug'
[ 21%] Built target crypto
make[3]: Entering directory '/home/buildbot/slave/monero-tests-ubuntu-16_04-armv7/build/build/debug'
make[3]: Leaving directory '/home/buildbot/slave/monero-tests-ubuntu-16_04-armv7/build/build/debug'
[ 22%] Built target common
make[3]: Entering directory '/home/buildbot/slave/monero-tests-ubuntu-16_04-armv7/build/build/debug'
make[3]: Leaving directory '/home/buildbot/slave/monero-tests-ubuntu-16_04-armv7/build/build/debug'
[ 25%] Built target obj_ringct
make[3]: Entering directory '/home/buildbot/slave/monero-tests-ubuntu-16_04-armv7/build/build/debug'
make[3]: Leaving directory '/home/buildbot/slave/monero-tests-ubuntu-16_04-armv7/build/build/debug'
[ 26%] Built target ringct
make[3]: Entering directory '/home/buildbot/slave/monero-tests-ubuntu-16_04-armv7/build/build/debug'
make[3]: Leaving directory '/home/buildbot/slave/monero-tests-ubuntu-16_04-armv7/build/build/debug'
[ 32%] Built target obj_cryptonote_core
make[3]: Entering directory '/home/buildbot/slave/monero-tests-ubuntu-16_04-armv7/build/build/debug'
make[3]: Leaving directory '/home/buildbot/slave/monero-tests-ubuntu-16_04-armv7/build/build/debug'
[ 34%] Built target blocks
make[3]: Entering directory '/home/buildbot/slave/monero-tests-ubuntu-16_04-armv7/build/build/debug'
make[3]: Leaving directory '/home/buildbot/slave/monero-tests-ubuntu-16_04-armv7/build/build/debug'
[ 36%] Built target obj_blockchain_db
make[3]: Entering directory '/home/buildbot/slave/monero-tests-ubuntu-16_04-armv7/build/build/debug'
make[3]: Leaving directory '/home/buildbot/slave/monero-tests-ubuntu-16_04-armv7/build/build/debug'
[ 36%] Built target blockchain_db
make[3]: Entering directory '/home/buildbot/slave/monero-tests-ubuntu-16_04-armv7/build/build/debug'
make[3]: Leaving directory '/home/buildbot/slave/monero-tests-ubuntu-16_04-armv7/build/build/debug'
[ 37%] Built target cryptonote_core
make[3]: Entering directory '/home/buildbot/slave/monero-tests-ubuntu-16_04-armv7/build/build/debug'
make[3]: Leaving directory '/home/buildbot/slave/monero-tests-ubuntu-16_04-armv7/build/build/debug'
[ 37%] Built target obj_mnemonics
make[3]: Entering directory '/home/buildbot/slave/monero-tests-ubuntu-16_04-armv7/build/build/debug'
make[3]: Leaving directory '/home/buildbot/slave/monero-tests-ubuntu-16_04-armv7/build/build/debug'
[ 37%] Built target mnemonics
make[3]: Entering directory '/home/buildbot/slave/monero-tests-ubuntu-16_04-armv7/build/build/debug'
make[3]: Leaving directory '/home/buildbot/slave/monero-tests-ubuntu-16_04-armv7/build/build/debug'
[ 37%] Built target obj_rpc
make[3]: Entering directory '/home/buildbot/slave/monero-tests-ubuntu-16_04-armv7/build/build/debug'
make[3]: Leaving directory '/home/buildbot/slave/monero-tests-ubuntu-16_04-armv7/build/build/debug'
[ 37%] Built target obj_cryptonote_protocol
make[3]: Entering directory '/home/buildbot/slave/monero-tests-ubuntu-16_04-armv7/build/build/debug'
make[3]: Leaving directory '/home/buildbot/slave/monero-tests-ubuntu-16_04-armv7/build/build/debug'
[ 37%] Built target cryptonote_protocol
make[3]: Entering directory '/home/buildbot/slave/monero-tests-ubuntu-16_04-armv7/build/build/debug'
make[3]: Leaving directory '/home/buildbot/slave/monero-tests-ubuntu-16_04-armv7/build/build/debug'
[ 37%] Built target rpc
make[3]: Entering directory '/home/buildbot/slave/monero-tests-ubuntu-16_04-armv7/build/build/debug'
make[3]: Leaving directory '/home/buildbot/slave/monero-tests-ubuntu-16_04-armv7/build/build/debug'
[ 43%] Built target obj_wallet
make[3]: Entering directory '/home/buildbot/slave/monero-tests-ubuntu-16_04-armv7/build/build/debug'
make[3]: Leaving directory '/home/buildbot/slave/monero-tests-ubuntu-16_04-armv7/build/build/debug'
[ 45%] Built target obj_p2p
make[3]: Entering directory '/home/buildbot/slave/monero-tests-ubuntu-16_04-armv7/build/build/debug'
make[3]: Leaving directory '/home/buildbot/slave/monero-tests-ubuntu-16_04-armv7/build/build/debug'
[ 45%] Built target p2p
make[3]: Entering directory '/home/buildbot/slave/monero-tests-ubuntu-16_04-armv7/build/build/debug'
make[3]: Leaving directory '/home/buildbot/slave/monero-tests-ubuntu-16_04-armv7/build/build/debug'
[ 45%] Built target wallet
make[3]: Entering directory '/home/buildbot/slave/monero-tests-ubuntu-16_04-armv7/build/build/debug'
make[3]: Leaving directory '/home/buildbot/slave/monero-tests-ubuntu-16_04-armv7/build/build/debug'
[ 47%] Built target wallet_rpc_server
make[3]: Entering directory '/home/buildbot/slave/monero-tests-ubuntu-16_04-armv7/build/build/debug'
make[3]: Leaving directory '/home/buildbot/slave/monero-tests-ubuntu-16_04-armv7/build/build/debug'
[ 48%] Built target simplewallet
make[3]: Entering directory '/home/buildbot/slave/monero-tests-ubuntu-16_04-armv7/build/build/debug'
make[3]: Leaving directory '/home/buildbot/slave/monero-tests-ubuntu-16_04-armv7/build/build/debug'
[ 49%] Built target obj_daemonizer
make[3]: Entering directory '/home/buildbot/slave/monero-tests-ubuntu-16_04-armv7/build/build/debug'
make[3]: Leaving directory '/home/buildbot/slave/monero-tests-ubuntu-16_04-armv7/build/build/debug'
[ 49%] Built target daemonizer
make[3]: Entering directory '/home/buildbot/slave/monero-tests-ubuntu-16_04-armv7/build/build/debug'
make[3]: Leaving directory '/home/buildbot/slave/monero-tests-ubuntu-16_04-armv7/build/build/debug'
[ 54%] Built target daemon
make[3]: Entering directory '/home/buildbot/slave/monero-tests-ubuntu-16_04-armv7/build/build/debug'
make[3]: Leaving directory '/home/buildbot/slave/monero-tests-ubuntu-16_04-armv7/build/build/debug'
[ 56%] Built target blockchain_import
make[3]: Entering directory '/home/buildbot/slave/monero-tests-ubuntu-16_04-armv7/build/build/debug'
make[3]: Leaving directory '/home/buildbot/slave/monero-tests-ubuntu-16_04-armv7/build/build/debug'
[ 58%] Built target blockchain_export
make[3]: Entering directory '/home/buildbot/slave/monero-tests-ubuntu-16_04-armv7/build/build/debug'
make[3]: Leaving directory '/home/buildbot/slave/monero-tests-ubuntu-16_04-armv7/build/build/debug'
[ 59%] Built target cn_deserialize
make[3]: Entering directory '/home/buildbot/slave/monero-tests-ubuntu-16_04-armv7/build/build/debug'
make[3]: Leaving directory '/home/buildbot/slave/monero-tests-ubuntu-16_04-armv7/build/build/debug'
[ 60%] Built target hash-target-tests
make[3]: Entering directory '/home/buildbot/slave/monero-tests-ubuntu-16_04-armv7/build/build/debug'
make[3]: Leaving directory '/home/buildbot/slave/monero-tests-ubuntu-16_04-armv7/build/build/debug'
[ 61%] Built target gtest
make[3]: Entering directory '/home/buildbot/slave/monero-tests-ubuntu-16_04-armv7/build/build/debug'
make[3]: Leaving directory '/home/buildbot/slave/monero-tests-ubuntu-16_04-armv7/build/build/debug'
[ 62%] Built target gtest_main
make[3]: Entering directory '/home/buildbot/slave/monero-tests-ubuntu-16_04-armv7/build/build/debug'
make[3]: Leaving directory '/home/buildbot/slave/monero-tests-ubuntu-16_04-armv7/build/build/debug'
[ 70%] Built target coretests
make[3]: Entering directory '/home/buildbot/slave/monero-tests-ubuntu-16_04-armv7/build/build/debug'
make[3]: Leaving directory '/home/buildbot/slave/monero-tests-ubuntu-16_04-armv7/build/build/debug'
[ 73%] Built target crypto-tests
make[3]: Entering directory '/home/buildbot/slave/monero-tests-ubuntu-16_04-armv7/build/build/debug'
make[3]: Leaving directory '/home/buildbot/slave/monero-tests-ubuntu-16_04-armv7/build/build/debug'
[ 75%] Built target functional_tests
make[3]: Entering directory '/home/buildbot/slave/monero-tests-ubuntu-16_04-armv7/build/build/debug'
make[3]: Leaving directory '/home/buildbot/slave/monero-tests-ubuntu-16_04-armv7/build/build/debug'
[ 76%] Built target performance_tests
make[3]: Entering directory '/home/buildbot/slave/monero-tests-ubuntu-16_04-armv7/build/build/debug'
make[3]: Leaving directory '/home/buildbot/slave/monero-tests-ubuntu-16_04-armv7/build/build/debug'
[ 77%] Built target core_proxy
make[3]: Entering directory '/home/buildbot/slave/monero-tests-ubuntu-16_04-armv7/build/build/debug'
make[3]: Leaving directory '/home/buildbot/slave/monero-tests-ubuntu-16_04-armv7/build/build/debug'
[ 94%] Built target unit_tests
make[3]: Entering directory '/home/buildbot/slave/monero-tests-ubuntu-16_04-armv7/build/build/debug'
make[3]: Leaving directory '/home/buildbot/slave/monero-tests-ubuntu-16_04-armv7/build/build/debug'
[ 95%] Built target difficulty-tests
make[3]: Entering directory '/home/buildbot/slave/monero-tests-ubuntu-16_04-armv7/build/build/debug'
make[3]: Leaving directory '/home/buildbot/slave/monero-tests-ubuntu-16_04-armv7/build/build/debug'
[ 96%] Built target hash-tests
make[3]: Entering directory '/home/buildbot/slave/monero-tests-ubuntu-16_04-armv7/build/build/debug'
make[3]: Leaving directory '/home/buildbot/slave/monero-tests-ubuntu-16_04-armv7/build/build/debug'
[ 97%] Built target net_load_tests_clt
make[3]: Entering directory '/home/buildbot/slave/monero-tests-ubuntu-16_04-armv7/build/build/debug'
make[3]: Leaving directory '/home/buildbot/slave/monero-tests-ubuntu-16_04-armv7/build/build/debug'
[ 98%] Built target net_load_tests_srv
make[3]: Entering directory '/home/buildbot/slave/monero-tests-ubuntu-16_04-armv7/build/build/debug'
make[3]: Leaving directory '/home/buildbot/slave/monero-tests-ubuntu-16_04-armv7/build/build/debug'
[100%] Built target libwallet_api_tests
make[2]: Leaving directory '/home/buildbot/slave/monero-tests-ubuntu-16_04-armv7/build/build/debug'
make[1]: Leaving directory '/home/buildbot/slave/monero-tests-ubuntu-16_04-armv7/build/build/debug'
make[1]: Entering directory '/home/buildbot/slave/monero-tests-ubuntu-16_04-armv7/build/build/debug'
Running tests...
Test project /home/buildbot/slave/monero-tests-ubuntu-16_04-armv7/build/build/debug
      Start  1: hash-target
 1/13 Test  #1: hash-target ......................   Passed    1.08 sec
      Start  2: coretests
 2/13 Test  #2: coretests ........................***Exception: Other154.50 sec
      Start  3: crypto
 3/13 Test  #3: crypto ...........................   Passed  342.28 sec
      Start  4: unit_tests
 4/13 Test  #4: unit_tests .......................***Exception: Other  0.52 sec
      Start  5: difficulty
 5/13 Test  #5: difficulty .......................   Passed    0.07 sec
      Start  6: hash-fast
 6/13 Test  #6: hash-fast ........................   Passed    0.10 sec
      Start  7: hash-slow
 7/13 Test  #7: hash-slow ........................   Passed    1.45 sec
      Start  8: hash-tree
 8/13 Test  #8: hash-tree ........................   Passed    0.03 sec
      Start  9: hash-extra-blake
 9/13 Test  #9: hash-extra-blake .................   Passed    0.04 sec
      Start 10: hash-extra-groestl
10/13 Test #10: hash-extra-groestl ...............   Passed    0.06 sec
      Start 11: hash-extra-jh
11/13 Test #11: hash-extra-jh ....................   Passed    0.12 sec
      Start 12: hash-extra-skein
12/13 Test #12: hash-extra-skein .................   Passed    0.07 sec
      Start 13: libwallet_api_tests
13/13 Test #13: libwallet_api_tests ..............***Exception: Other  4.42 sec

77% tests passed, 3 tests failed out of 13

Total Test time (real) = 504.85 sec

The following tests FAILED:
	  2 - coretests (OTHER_FAULT)
	  4 - unit_tests (OTHER_FAULT)
	 13 - libwallet_api_tests (OTHER_FAULT)
Errors while running CTest
Makefile:104: recipe for target 'test' failed
make[1]: Leaving directory '/home/buildbot/slave/monero-tests-ubuntu-16_04-armv7/build/build/debug'
make[1]: *** [test] Error 8
Makefile:39: recipe for target 'debug-test' failed
make: *** [debug-test] Error 2
program finished with exit code 2
elapsedTime=517.563217