(view as text)
Start testing: Dec 13 17:59 UTC
----------------------------------------------------------
1/13 Testing: hash-target
1/13 Test: hash-target
Command: "/home/buildbot/slave/monero-tests-ubuntu-16_04-armv7/build/build/debug/tests/hash-target-tests"
Directory: /home/buildbot/slave/monero-tests-ubuntu-16_04-armv7/build/build/debug/tests
"hash-target" start time: Dec 13 17:59 UTC
Output:
----------------------------------------------------------
<end of output>
Test time =   1.08 sec
----------------------------------------------------------
Test Passed.
"hash-target" end time: Dec 13 17:59 UTC
"hash-target" time elapsed: 00:00:01
----------------------------------------------------------

2/13 Testing: coretests
2/13 Test: coretests
Command: "/home/buildbot/slave/monero-tests-ubuntu-16_04-armv7/build/build/debug/tests/core_tests/coretests" "--generate_and_play_test_data"
Directory: /home/buildbot/slave/monero-tests-ubuntu-16_04-armv7/build/build/debug/tests/core_tests
"coretests" start time: Dec 13 17:59 UTC
Output:
----------------------------------------------------------
BALANCE = 52776507801615
2016-Dec-13 18:00:08.726892 failed to deserialize extra field. extra = 
2016-Dec-13 18:00:09.160967 failed to deserialize extra field. extra = 
2016-Dec-13 18:00:09.576139 failed to deserialize extra field. extra = 
2016-Dec-13 18:00:43.701159 failed to deserialize extra field. extra = 
2016-Dec-13 18:01:24.540987 failed to deserialize extra field. extra = 
2016-Dec-13 18:02:12.362039 failed to deserialize extra field. extra = 
2016-Dec-13 18:02:13.013884 Locking /home/buildbot/.bitmonero/fake/.daemon_lock
2016-Dec-13 18:02:13.014518 Loading blockchain from folder /home/buildbot/.bitmonero/fake/lmdb ...
2016-Dec-13 18:02:13.014753 option: fast
2016-Dec-13 18:02:13.014914 option: async
2016-Dec-13 18:02:13.015077 option: 1000
2016-Dec-13 18:02:13.040898 DB map size:     2147483648
2016-Dec-13 18:02:13.041080 Space used:      683278336
2016-Dec-13 18:02:13.041298 Space remaining: 1464205312
2016-Dec-13 18:02:13.041486 Size threshold:  0
2016-Dec-13 18:02:13.041672 Percent used: 0.3182  Percent threshold: 0.8000
2016-Dec-13 18:02:13.056659 Setting m_height to: 0
2016-Dec-13 18:02:13.058913 Error attempting to retrieve a hard fork version at height 0 from the db: MDB_NOTFOUND: No matching key/data pair found
2016-Dec-13 18:02:13.059174 Exception: cryptonote::DB_ERROR
2016-Dec-13 18:02:13.059343 Unwound call stack:
2016-Dec-13 18:02:13.115737      1                  0x356fc5 __cxa_throw + 0x60
2016-Dec-13 18:02:13.125588      2                  0x311153 void (anonymous namespace)::throw0<cryptonote::DB_ERROR>(cryptonote::DB_ERROR const&) + 0xae
2016-Dec-13 18:02:13.135168      3                  0x31b569 cryptonote::BlockchainLMDB::get_hard_fork_version(unsigned long long) const + 0x1fc
2016-Dec-13 18:02:13.145205      4                  0x2ea569 cryptonote::HardFork::init() + 0xdc
2016-Dec-13 18:02:13.154863      5                  0x30019f cryptonote::Blockchain::init(cryptonote::BlockchainDB*, bool, cryptonote::test_options const*) + 0x3f6
2016-Dec-13 18:02:13.164723      6                  0x2b5087 cryptonote::core::init(boost::program_options::variables_map const&, cryptonote::test_options const*) + 0xdfe
2016-Dec-13 18:02:13.174534      7                  0x28b2f5 bool do_replay_events<gen_simple_chain_001>(std::vector<boost::variant<cryptonote::block, cryptonote::transaction, cryptonote::account_base, callback_entry, serialized_object<cryptonote::block>, serialized_object<cryptonote::transaction>, event_visitor_settings>, std::allocator<boost::variant<cryptonote::block, cryptonote::transaction, cryptonote::account_base, callback_entry, serialized_object<cryptonote::block>, serialized_object<cryptonote::transaction>, event_visitor_settings> > >&) + 0xa0
2016-Dec-13 18:02:13.184312      8                  0x1d4619 main + 0x364
2016-Dec-13 18:02:13.185430      9                  0xb6a358ab __libc_start_main + 0x9e
2016-Dec-13 18:02:13.231184     10                  0x1a9509 _start + 0x20
terminate called after throwing an instance of 'cryptonote::DB_ERROR'
terminate called recursively
<end of output>
Test time = 154.50 sec
----------------------------------------------------------
Test Failed.
"coretests" end time: Dec 13 18:02 UTC
"coretests" time elapsed: 00:02:34
----------------------------------------------------------

3/13 Testing: crypto
3/13 Test: crypto
Command: "/home/buildbot/slave/monero-tests-ubuntu-16_04-armv7/build/build/debug/tests/crypto/crypto-tests" "/home/buildbot/slave/monero-tests-ubuntu-16_04-armv7/build/tests/crypto/tests.txt"
Directory: /home/buildbot/slave/monero-tests-ubuntu-16_04-armv7/build/build/debug/tests/crypto
"crypto" start time: Dec 13 18:02 UTC
Output:
----------------------------------------------------------
<end of output>
Test time = 342.28 sec
----------------------------------------------------------
Test Passed.
"crypto" end time: Dec 13 18:07 UTC
"crypto" time elapsed: 00:05:42
----------------------------------------------------------

4/13 Testing: unit_tests
4/13 Test: unit_tests
Command: "/home/buildbot/slave/monero-tests-ubuntu-16_04-armv7/build/build/debug/tests/unit_tests/unit_tests"
Directory: /home/buildbot/slave/monero-tests-ubuntu-16_04-armv7/build/build/debug/tests/unit_tests
"unit_tests" start time: Dec 13 18:07 UTC
Output:
----------------------------------------------------------
Creating the logger system
[==========] Running 661 tests from 61 test cases.
[----------] Global test environment set-up.
[----------] 2 tests from AddressFromTXT
[ RUN      ] AddressFromTXT.Success
[       OK ] AddressFromTXT.Success (0 ms)
[ RUN      ] AddressFromTXT.Failure
[       OK ] AddressFromTXT.Failure (0 ms)
[----------] 2 tests from AddressFromTXT (0 ms total)

[----------] 2 tests from AddressFromURL
[ RUN      ] AddressFromURL.Success
[       OK ] AddressFromURL.Success (117 ms)
[ RUN      ] AddressFromURL.Failure
[       OK ] AddressFromURL.Failure (12 ms)
[----------] 2 tests from AddressFromURL (129 ms total)

[----------] 1 test from ban
[ RUN      ] ban.add
[       OK ] ban.add (3 ms)
[----------] 1 test from ban (3 ms total)

[----------] 8 tests from base58_uint_8be_to_64
[ RUN      ] base58_uint_8be_to_64.handles_bytes_0x0000000000000001
[       OK ] base58_uint_8be_to_64.handles_bytes_0x0000000000000001 (0 ms)
[ RUN      ] base58_uint_8be_to_64.handles_bytes_0x0000000000000102
[       OK ] base58_uint_8be_to_64.handles_bytes_0x0000000000000102 (0 ms)
[ RUN      ] base58_uint_8be_to_64.handles_bytes_0x0000000000010203
[       OK ] base58_uint_8be_to_64.handles_bytes_0x0000000000010203 (0 ms)
[ RUN      ] base58_uint_8be_to_64.handles_bytes_0x0000000001020304
[       OK ] base58_uint_8be_to_64.handles_bytes_0x0000000001020304 (0 ms)
[ RUN      ] base58_uint_8be_to_64.handles_bytes_0x0000000102030405
[       OK ] base58_uint_8be_to_64.handles_bytes_0x0000000102030405 (0 ms)
[ RUN      ] base58_uint_8be_to_64.handles_bytes_0x0000010203040506
[       OK ] base58_uint_8be_to_64.handles_bytes_0x0000010203040506 (0 ms)
[ RUN      ] base58_uint_8be_to_64.handles_bytes_0x0001020304050607
[       OK ] base58_uint_8be_to_64.handles_bytes_0x0001020304050607 (0 ms)
[ RUN      ] base58_uint_8be_to_64.handles_bytes_0x0102030405060708
[       OK ] base58_uint_8be_to_64.handles_bytes_0x0102030405060708 (0 ms)
[----------] 8 tests from base58_uint_8be_to_64 (0 ms total)

[----------] 8 tests from base58_uint_64_to_8be
[ RUN      ] base58_uint_64_to_8be.handles_bytes_0x0000000000000001
[       OK ] base58_uint_64_to_8be.handles_bytes_0x0000000000000001 (0 ms)
[ RUN      ] base58_uint_64_to_8be.handles_bytes_0x0000000000000102
[       OK ] base58_uint_64_to_8be.handles_bytes_0x0000000000000102 (0 ms)
[ RUN      ] base58_uint_64_to_8be.handles_bytes_0x0000000000010203
[       OK ] base58_uint_64_to_8be.handles_bytes_0x0000000000010203 (0 ms)
[ RUN      ] base58_uint_64_to_8be.handles_bytes_0x0000000001020304
[       OK ] base58_uint_64_to_8be.handles_bytes_0x0000000001020304 (0 ms)
[ RUN      ] base58_uint_64_to_8be.handles_bytes_0x0000000102030405
[       OK ] base58_uint_64_to_8be.handles_bytes_0x0000000102030405 (0 ms)
[ RUN      ] base58_uint_64_to_8be.handles_bytes_0x0000010203040506
[       OK ] base58_uint_64_to_8be.handles_bytes_0x0000010203040506 (0 ms)
[ RUN      ] base58_uint_64_to_8be.handles_bytes_0x0001020304050607
[       OK ] base58_uint_64_to_8be.handles_bytes_0x0001020304050607 (0 ms)
[ RUN      ] base58_uint_64_to_8be.handles_bytes_0x0102030405060708
[       OK ] base58_uint_64_to_8be.handles_bytes_0x0102030405060708 (0 ms)
[----------] 8 tests from base58_uint_64_to_8be (1 ms total)

[----------] 1 test from reverse_alphabet
[ RUN      ] reverse_alphabet.is_correct
[       OK ] reverse_alphabet.is_correct (0 ms)
[----------] 1 test from reverse_alphabet (0 ms total)

[----------] 29 tests from base58_encode_block
[ RUN      ] base58_encode_block.handles_11
[       OK ] base58_encode_block.handles_11 (0 ms)
[ RUN      ] base58_encode_block.handles_1z
[       OK ] base58_encode_block.handles_1z (0 ms)
[ RUN      ] base58_encode_block.handles_5Q
[       OK ] base58_encode_block.handles_5Q (0 ms)
[ RUN      ] base58_encode_block.handles_111
[       OK ] base58_encode_block.handles_111 (0 ms)
[ RUN      ] base58_encode_block.handles_11z
[       OK ] base58_encode_block.handles_11z (0 ms)
[ RUN      ] base58_encode_block.handles_15R
[       OK ] base58_encode_block.handles_15R (0 ms)
[ RUN      ] base58_encode_block.handles_LUv
[       OK ] base58_encode_block.handles_LUv (0 ms)
[ RUN      ] base58_encode_block.handles_11111
[       OK ] base58_encode_block.handles_11111 (0 ms)
[ RUN      ] base58_encode_block.handles_1111z
[       OK ] base58_encode_block.handles_1111z (0 ms)
[ RUN      ] base58_encode_block.handles_11LUw
[       OK ] base58_encode_block.handles_11LUw (0 ms)
[ RUN      ] base58_encode_block.handles_2UzHL
[       OK ] base58_encode_block.handles_2UzHL (0 ms)
[ RUN      ] base58_encode_block.handles_11111z
[       OK ] base58_encode_block.handles_11111z (0 ms)
[ RUN      ] base58_encode_block.handles_7YXq9G
[       OK ] base58_encode_block.handles_7YXq9G (0 ms)
[ RUN      ] base58_encode_block.handles_111111z
[       OK ] base58_encode_block.handles_111111z (0 ms)
[ RUN      ] base58_encode_block.handles_VtB5VXc
[       OK ] base58_encode_block.handles_VtB5VXc (0 ms)
[ RUN      ] base58_encode_block.handles_11111111z
[       OK ] base58_encode_block.handles_11111111z (0 ms)
[ RUN      ] base58_encode_block.handles_3CUsUpv9t
[       OK ] base58_encode_block.handles_3CUsUpv9t (0 ms)
[ RUN      ] base58_encode_block.handles_111111111z
[       OK ] base58_encode_block.handles_111111111z (0 ms)
[ RUN      ] base58_encode_block.handles_Ahg1opVcGW
[       OK ] base58_encode_block.handles_Ahg1opVcGW (0 ms)
[ RUN      ] base58_encode_block.handles_1111111111z
[       OK ] base58_encode_block.handles_1111111111z (0 ms)
[ RUN      ] base58_encode_block.handles_jpXCZedGfVQ
[       OK ] base58_encode_block.handles_jpXCZedGfVQ (0 ms)
[ RUN      ] base58_encode_block.handles_11111111111
[       OK ] base58_encode_block.handles_11111111111 (0 ms)
[ RUN      ] base58_encode_block.handles_11111111112
[       OK ] base58_encode_block.handles_11111111112 (0 ms)
[ RUN      ] base58_encode_block.handles_11111111119
[       OK ] base58_encode_block.handles_11111111119 (0 ms)
[ RUN      ] base58_encode_block.handles_1111111111A
[       OK ] base58_encode_block.handles_1111111111A (0 ms)
[ RUN      ] base58_encode_block.handles_11111111121
[       OK ] base58_encode_block.handles_11111111121 (0 ms)
[ RUN      ] base58_encode_block.handles_1Ahg1opVcGW
[       OK ] base58_encode_block.handles_1Ahg1opVcGW (0 ms)
[ RUN      ] base58_encode_block.handles_22222222222
[       OK ] base58_encode_block.handles_22222222222 (0 ms)
[ RUN      ] base58_encode_block.handles_1z111111111
[       OK ] base58_encode_block.handles_1z111111111 (0 ms)
[----------] 29 tests from base58_encode_block (2 ms total)

[----------] 45 tests from base58_decode_block
[ RUN      ] base58_decode_block.handles_neg_1
[       OK ] base58_decode_block.handles_neg_1 (0 ms)
[ RUN      ] base58_decode_block.handles_neg_z
[       OK ] base58_decode_block.handles_neg_z (0 ms)
[ RUN      ] base58_decode_block.handles_pos_11
[       OK ] base58_decode_block.handles_pos_11 (0 ms)
[ RUN      ] base58_decode_block.handles_pos_5Q
[       OK ] base58_decode_block.handles_pos_5Q (0 ms)
[ RUN      ] base58_decode_block.handles_neg_5R
[       OK ] base58_decode_block.handles_neg_5R (0 ms)
[ RUN      ] base58_decode_block.handles_neg_zz
[       OK ] base58_decode_block.handles_neg_zz (0 ms)
[ RUN      ] base58_decode_block.handles_pos_111
[       OK ] base58_decode_block.handles_pos_111 (0 ms)
[ RUN      ] base58_decode_block.handles_pos_LUv
[       OK ] base58_decode_block.handles_pos_LUv (0 ms)
[ RUN      ] base58_decode_block.handles_neg_LUw
[       OK ] base58_decode_block.handles_neg_LUw (0 ms)
[ RUN      ] base58_decode_block.handles_neg_zzz
[       OK ] base58_decode_block.handles_neg_zzz (0 ms)
[ RUN      ] base58_decode_block.handles_neg_1111
[       OK ] base58_decode_block.handles_neg_1111 (0 ms)
[ RUN      ] base58_decode_block.handles_neg_zzzz
[       OK ] base58_decode_block.handles_neg_zzzz (0 ms)
[ RUN      ] base58_decode_block.handles_pos_11111
[       OK ] base58_decode_block.handles_pos_11111 (0 ms)
[ RUN      ] base58_decode_block.handles_pos_2UzHL
[       OK ] base58_decode_block.handles_pos_2UzHL (0 ms)
[ RUN      ] base58_decode_block.handles_neg_2UzHM
[       OK ] base58_decode_block.handles_neg_2UzHM (0 ms)
[ RUN      ] base58_decode_block.handles_neg_zzzzz
[       OK ] base58_decode_block.handles_neg_zzzzz (0 ms)
[ RUN      ] base58_decode_block.handles_pos_111111
[       OK ] base58_decode_block.handles_pos_111111 (0 ms)
[ RUN      ] base58_decode_block.handles_pos_7YXq9G
[       OK ] base58_decode_block.handles_pos_7YXq9G (1 ms)
[ RUN      ] base58_decode_block.handles_neg_7YXq9H
[       OK ] base58_decode_block.handles_neg_7YXq9H (0 ms)
[ RUN      ] base58_decode_block.handles_neg_zzzzzz
[       OK ] base58_decode_block.handles_neg_zzzzzz (0 ms)
[ RUN      ] base58_decode_block.handles_pos_1111111
[       OK ] base58_decode_block.handles_pos_1111111 (0 ms)
[ RUN      ] base58_decode_block.handles_pos_VtB5VXc
[       OK ] base58_decode_block.handles_pos_VtB5VXc (0 ms)
[ RUN      ] base58_decode_block.handles_neg_VtB5VXd
[       OK ] base58_decode_block.handles_neg_VtB5VXd (0 ms)
[ RUN      ] base58_decode_block.handles_neg_zzzzzzz
[       OK ] base58_decode_block.handles_neg_zzzzzzz (0 ms)
[ RUN      ] base58_decode_block.handles_neg_11111111
[       OK ] base58_decode_block.handles_neg_11111111 (0 ms)
[ RUN      ] base58_decode_block.handles_neg_zzzzzzzz
[       OK ] base58_decode_block.handles_neg_zzzzzzzz (0 ms)
[ RUN      ] base58_decode_block.handles_pos_111111111
[       OK ] base58_decode_block.handles_pos_111111111 (0 ms)
[ RUN      ] base58_decode_block.handles_pos_3CUsUpv9t
[       OK ] base58_decode_block.handles_pos_3CUsUpv9t (0 ms)
[ RUN      ] base58_decode_block.handles_neg_3CUsUpv9u
[       OK ] base58_decode_block.handles_neg_3CUsUpv9u (0 ms)
[ RUN      ] base58_decode_block.handles_neg_zzzzzzzzz
[       OK ] base58_decode_block.handles_neg_zzzzzzzzz (0 ms)
[ RUN      ] base58_decode_block.handles_pos_1111111111
[       OK ] base58_decode_block.handles_pos_1111111111 (0 ms)
[ RUN      ] base58_decode_block.handles_pos_Ahg1opVcGW
[       OK ] base58_decode_block.handles_pos_Ahg1opVcGW (0 ms)
[ RUN      ] base58_decode_block.handles_neg_Ahg1opVcGX
[       OK ] base58_decode_block.handles_neg_Ahg1opVcGX (0 ms)
[ RUN      ] base58_decode_block.handles_neg_zzzzzzzzzz
[       OK ] base58_decode_block.handles_neg_zzzzzzzzzz (0 ms)
[ RUN      ] base58_decode_block.handles_pos_11111111111
[       OK ] base58_decode_block.handles_pos_11111111111 (0 ms)
[ RUN      ] base58_decode_block.handles_pos_jpXCZedGfVQ
[       OK ] base58_decode_block.handles_pos_jpXCZedGfVQ (0 ms)
[ RUN      ] base58_decode_block.handles_neg_jpXCZedGfVR
[       OK ] base58_decode_block.handles_neg_jpXCZedGfVR (0 ms)
[ RUN      ] base58_decode_block.handles_neg_zzzzzzzzzzz
[       OK ] base58_decode_block.handles_neg_zzzzzzzzzzz (0 ms)
[ RUN      ] base58_decode_block.handles_neg_01111111111
[       OK ] base58_decode_block.handles_neg_01111111111 (0 ms)
[ RUN      ] base58_decode_block.handles_neg_11111111110
[       OK ] base58_decode_block.handles_neg_11111111110 (0 ms)
[ RUN      ] base58_decode_block.handles_neg_11111011111
[       OK ] base58_decode_block.handles_neg_11111011111 (0 ms)
[ RUN      ] base58_decode_block.handles_neg_I1111111111
[       OK ] base58_decode_block.handles_neg_I1111111111 (0 ms)
[ RUN      ] base58_decode_block.handles_neg_O1111111111
[       OK ] base58_decode_block.handles_neg_O1111111111 (0 ms)
[ RUN      ] base58_decode_block.handles_neg_l1111111111
[       OK ] base58_decode_block.handles_neg_l1111111111 (0 ms)
[ RUN      ] base58_decode_block.handles_neg__1111111111
[       OK ] base58_decode_block.handles_neg__1111111111 (0 ms)
[----------] 45 tests from base58_decode_block (2 ms total)

[----------] 17 tests from base58_encode
[ RUN      ] base58_encode.handles_11
[       OK ] base58_encode.handles_11 (0 ms)
[ RUN      ] base58_encode.handles_111
[       OK ] base58_encode.handles_111 (0 ms)
[ RUN      ] base58_encode.handles_11111
[       OK ] base58_encode.handles_11111 (0 ms)
[ RUN      ] base58_encode.handles_111111
[       OK ] base58_encode.handles_111111 (0 ms)
[ RUN      ] base58_encode.handles_1111111
[       OK ] base58_encode.handles_1111111 (0 ms)
[ RUN      ] base58_encode.handles_111111111
[       OK ] base58_encode.handles_111111111 (0 ms)
[ RUN      ] base58_encode.handles_1111111111
[       OK ] base58_encode.handles_1111111111 (0 ms)
[ RUN      ] base58_encode.handles_11111111111
[       OK ] base58_encode.handles_11111111111 (0 ms)
[ RUN      ] base58_encode.handles_1111111111111
[       OK ] base58_encode.handles_1111111111111 (0 ms)
[ RUN      ] base58_encode.handles_11111111111111
[       OK ] base58_encode.handles_11111111111111 (0 ms)
[ RUN      ] base58_encode.handles_1111111111111111
[       OK ] base58_encode.handles_1111111111111111 (0 ms)
[ RUN      ] base58_encode.handles_11111111111111111
[       OK ] base58_encode.handles_11111111111111111 (0 ms)
[ RUN      ] base58_encode.handles_111111111111111111
[       OK ] base58_encode.handles_111111111111111111 (0 ms)
[ RUN      ] base58_encode.handles_11111111111111111111
[       OK ] base58_encode.handles_11111111111111111111 (0 ms)
[ RUN      ] base58_encode.handles_111111111111111111111
[       OK ] base58_encode.handles_111111111111111111111 (0 ms)
[ RUN      ] base58_encode.handles_1111111111111111111111
[       OK ] base58_encode.handles_1111111111111111111111 (0 ms)
[ RUN      ] base58_encode.handles_22222222222VtB5VXc
[       OK ] base58_encode.handles_22222222222VtB5VXc (0 ms)
[----------] 17 tests from base58_encode (1 ms total)

[----------] 17 tests from base58_decode_pos
[ RUN      ] base58_decode_pos.handles_pos_
[       OK ] base58_decode_pos.handles_pos_ (0 ms)
[ RUN      ] base58_decode_pos.handles_pos_5Q
[       OK ] base58_decode_pos.handles_pos_5Q (0 ms)
[ RUN      ] base58_decode_pos.handles_pos_LUv
[       OK ] base58_decode_pos.handles_pos_LUv (0 ms)
[ RUN      ] base58_decode_pos.handles_pos_2UzHL
[       OK ] base58_decode_pos.handles_pos_2UzHL (0 ms)
[ RUN      ] base58_decode_pos.handles_pos_7YXq9G
[       OK ] base58_decode_pos.handles_pos_7YXq9G (0 ms)
[ RUN      ] base58_decode_pos.handles_pos_VtB5VXc
[       OK ] base58_decode_pos.handles_pos_VtB5VXc (0 ms)
[ RUN      ] base58_decode_pos.handles_pos_3CUsUpv9t
[       OK ] base58_decode_pos.handles_pos_3CUsUpv9t (0 ms)
[ RUN      ] base58_decode_pos.handles_pos_Ahg1opVcGW
[       OK ] base58_decode_pos.handles_pos_Ahg1opVcGW (0 ms)
[ RUN      ] base58_decode_pos.handles_pos_jpXCZedGfVQ
[       OK ] base58_decode_pos.handles_pos_jpXCZedGfVQ (0 ms)
[ RUN      ] base58_decode_pos.handles_pos_jpXCZedGfVQ5Q
[       OK ] base58_decode_pos.handles_pos_jpXCZedGfVQ5Q (0 ms)
[ RUN      ] base58_decode_pos.handles_pos_jpXCZedGfVQLUv
[       OK ] base58_decode_pos.handles_pos_jpXCZedGfVQLUv (0 ms)
[ RUN      ] base58_decode_pos.handles_pos_jpXCZedGfVQ2UzHL
[       OK ] base58_decode_pos.handles_pos_jpXCZedGfVQ2UzHL (0 ms)
[ RUN      ] base58_decode_pos.handles_pos_jpXCZedGfVQ7YXq9G
[       OK ] base58_decode_pos.handles_pos_jpXCZedGfVQ7YXq9G (0 ms)
[ RUN      ] base58_decode_pos.handles_pos_jpXCZedGfVQVtB5VXc
[       OK ] base58_decode_pos.handles_pos_jpXCZedGfVQVtB5VXc (0 ms)
[ RUN      ] base58_decode_pos.handles_pos_jpXCZedGfVQ3CUsUpv9t
[       OK ] base58_decode_pos.handles_pos_jpXCZedGfVQ3CUsUpv9t (0 ms)
[ RUN      ] base58_decode_pos.handles_pos_jpXCZedGfVQAhg1opVcGW
[       OK ] base58_decode_pos.handles_pos_jpXCZedGfVQAhg1opVcGW (0 ms)
[ RUN      ] base58_decode_pos.handles_pos_jpXCZedGfVQjpXCZedGfVQ
[       OK ] base58_decode_pos.handles_pos_jpXCZedGfVQjpXCZedGfVQ (0 ms)
[----------] 17 tests from base58_decode_pos (1 ms total)

[----------] 56 tests from base58_decode_neg
[ RUN      ] base58_decode_neg.handles_neg_1
[       OK ] base58_decode_neg.handles_neg_1 (0 ms)
[ RUN      ] base58_decode_neg.handles_neg_z
[       OK ] base58_decode_neg.handles_neg_z (0 ms)
[ RUN      ] base58_decode_neg.handles_neg_1111
[       OK ] base58_decode_neg.handles_neg_1111 (0 ms)
[ RUN      ] base58_decode_neg.handles_neg_zzzz
[       OK ] base58_decode_neg.handles_neg_zzzz (0 ms)
[ RUN      ] base58_decode_neg.handles_neg_11111111
[       OK ] base58_decode_neg.handles_neg_11111111 (0 ms)
[ RUN      ] base58_decode_neg.handles_neg_zzzzzzzz
[       OK ] base58_decode_neg.handles_neg_zzzzzzzz (0 ms)
[ RUN      ] base58_decode_neg.handles_neg_123456789AB1
[       OK ] base58_decode_neg.handles_neg_123456789AB1 (0 ms)
[ RUN      ] base58_decode_neg.handles_neg_123456789ABz
[       OK ] base58_decode_neg.handles_neg_123456789ABz (0 ms)
[ RUN      ] base58_decode_neg.handles_neg_123456789AB1111
[       OK ] base58_decode_neg.handles_neg_123456789AB1111 (0 ms)
[ RUN      ] base58_decode_neg.handles_neg_123456789ABzzzz
[       OK ] base58_decode_neg.handles_neg_123456789ABzzzz (0 ms)
[ RUN      ] base58_decode_neg.handles_neg_123456789AB11111111
[       OK ] base58_decode_neg.handles_neg_123456789AB11111111 (0 ms)
[ RUN      ] base58_decode_neg.handles_neg_123456789ABzzzzzzzz
[       OK ] base58_decode_neg.handles_neg_123456789ABzzzzzzzz (0 ms)
[ RUN      ] base58_decode_neg.handles_neg_5R
[       OK ] base58_decode_neg.handles_neg_5R (0 ms)
[ RUN      ] base58_decode_neg.handles_neg_zz
[       OK ] base58_decode_neg.handles_neg_zz (0 ms)
[ RUN      ] base58_decode_neg.handles_neg_LUw
[       OK ] base58_decode_neg.handles_neg_LUw (0 ms)
[ RUN      ] base58_decode_neg.handles_neg_zzz
[       OK ] base58_decode_neg.handles_neg_zzz (0 ms)
[ RUN      ] base58_decode_neg.handles_neg_2UzHM
[       OK ] base58_decode_neg.handles_neg_2UzHM (0 ms)
[ RUN      ] base58_decode_neg.handles_neg_zzzzz
[       OK ] base58_decode_neg.handles_neg_zzzzz (0 ms)
[ RUN      ] base58_decode_neg.handles_neg_7YXq9H
[       OK ] base58_decode_neg.handles_neg_7YXq9H (0 ms)
[ RUN      ] base58_decode_neg.handles_neg_zzzzzz
[       OK ] base58_decode_neg.handles_neg_zzzzzz (0 ms)
[ RUN      ] base58_decode_neg.handles_neg_VtB5VXd
[       OK ] base58_decode_neg.handles_neg_VtB5VXd (0 ms)
[ RUN      ] base58_decode_neg.handles_neg_zzzzzzz
[       OK ] base58_decode_neg.handles_neg_zzzzzzz (0 ms)
[ RUN      ] base58_decode_neg.handles_neg_3CUsUpv9u
[       OK ] base58_decode_neg.handles_neg_3CUsUpv9u (0 ms)
[ RUN      ] base58_decode_neg.handles_neg_zzzzzzzzz
[       OK ] base58_decode_neg.handles_neg_zzzzzzzzz (0 ms)
[ RUN      ] base58_decode_neg.handles_neg_Ahg1opVcGX
[       OK ] base58_decode_neg.handles_neg_Ahg1opVcGX (0 ms)
[ RUN      ] base58_decode_neg.handles_neg_zzzzzzzzzz
[       OK ] base58_decode_neg.handles_neg_zzzzzzzzzz (0 ms)
[ RUN      ] base58_decode_neg.handles_neg_jpXCZedGfVR
[       OK ] base58_decode_neg.handles_neg_jpXCZedGfVR (0 ms)
[ RUN      ] base58_decode_neg.handles_neg_zzzzzzzzzzz
[       OK ] base58_decode_neg.handles_neg_zzzzzzzzzzz (0 ms)
[ RUN      ] base58_decode_neg.handles_neg_123456789AB5R
[       OK ] base58_decode_neg.handles_neg_123456789AB5R (0 ms)
[ RUN      ] base58_decode_neg.handles_neg_123456789ABzz
[       OK ] base58_decode_neg.handles_neg_123456789ABzz (0 ms)
[ RUN      ] base58_decode_neg.handles_neg_123456789ABLUw
[       OK ] base58_decode_neg.handles_neg_123456789ABLUw (0 ms)
[ RUN      ] base58_decode_neg.handles_neg_123456789ABzzz
[       OK ] base58_decode_neg.handles_neg_123456789ABzzz (0 ms)
[ RUN      ] base58_decode_neg.handles_neg_123456789AB2UzHM
[       OK ] base58_decode_neg.handles_neg_123456789AB2UzHM (0 ms)
[ RUN      ] base58_decode_neg.handles_neg_123456789ABzzzzz
[       OK ] base58_decode_neg.handles_neg_123456789ABzzzzz (0 ms)
[ RUN      ] base58_decode_neg.handles_neg_123456789AB7YXq9H
[       OK ] base58_decode_neg.handles_neg_123456789AB7YXq9H (0 ms)
[ RUN      ] base58_decode_neg.handles_neg_123456789ABzzzzzz
[       OK ] base58_decode_neg.handles_neg_123456789ABzzzzzz (0 ms)
[ RUN      ] base58_decode_neg.handles_neg_123456789ABVtB5VXd
[       OK ] base58_decode_neg.handles_neg_123456789ABVtB5VXd (0 ms)
[ RUN      ] base58_decode_neg.handles_neg_123456789ABzzzzzzz
[       OK ] base58_decode_neg.handles_neg_123456789ABzzzzzzz (0 ms)
[ RUN      ] base58_decode_neg.handles_neg_123456789AB3CUsUpv9u
[       OK ] base58_decode_neg.handles_neg_123456789AB3CUsUpv9u (0 ms)
[ RUN      ] base58_decode_neg.handles_neg_123456789ABzzzzzzzzz
[       OK ] base58_decode_neg.handles_neg_123456789ABzzzzzzzzz (0 ms)
[ RUN      ] base58_decode_neg.handles_neg_123456789ABAhg1opVcGX
[       OK ] base58_decode_neg.handles_neg_123456789ABAhg1opVcGX (0 ms)
[ RUN      ] base58_decode_neg.handles_neg_123456789ABzzzzzzzzzz
[       OK ] base58_decode_neg.handles_neg_123456789ABzzzzzzzzzz (0 ms)
[ RUN      ] base58_decode_neg.handles_neg_123456789ABjpXCZedGfVR
[       OK ] base58_decode_neg.handles_neg_123456789ABjpXCZedGfVR (0 ms)
[ RUN      ] base58_decode_neg.handles_neg_123456789ABzzzzzzzzzzz
[       OK ] base58_decode_neg.handles_neg_123456789ABzzzzzzzzzzz (0 ms)
[ RUN      ] base58_decode_neg.handles_neg_zzzzzzzzzzz11
[       OK ] base58_decode_neg.handles_neg_zzzzzzzzzzz11 (0 ms)
[ RUN      ] base58_decode_neg.handles_neg_10
[       OK ] base58_decode_neg.handles_neg_10 (0 ms)
[ RUN      ] base58_decode_neg.handles_neg_11I
[       OK ] base58_decode_neg.handles_neg_11I (0 ms)
[ RUN      ] base58_decode_neg.handles_neg_11O11
[       OK ] base58_decode_neg.handles_neg_11O11 (0 ms)
[ RUN      ] base58_decode_neg.handles_neg_11l111
[       OK ] base58_decode_neg.handles_neg_11l111 (0 ms)
[ RUN      ] base58_decode_neg.handles_neg_11_11111111
[       OK ] base58_decode_neg.handles_neg_11_11111111 (0 ms)
[ RUN      ] base58_decode_neg.handles_neg_1101111111111
[       OK ] base58_decode_neg.handles_neg_1101111111111 (0 ms)
[ RUN      ] base58_decode_neg.handles_neg_11I11111111111111
[       OK ] base58_decode_neg.handles_neg_11I11111111111111 (0 ms)
[ RUN      ] base58_decode_neg.handles_neg_11O1111111111111111111
[       OK ] base58_decode_neg.handles_neg_11O1111111111111111111 (0 ms)
[ RUN      ] base58_decode_neg.handles_neg_1111111111110
[       OK ] base58_decode_neg.handles_neg_1111111111110 (0 ms)
[ RUN      ] base58_decode_neg.handles_neg_111111111111l1111
[       OK ] base58_decode_neg.handles_neg_111111111111l1111 (0 ms)
[ RUN      ] base58_decode_neg.handles_neg_111111111111_111111111
[       OK ] base58_decode_neg.handles_neg_111111111111_111111111 (0 ms)
[----------] 56 tests from base58_decode_neg (3 ms total)

[----------] 21 tests from base58_encode_decode_addr
[ RUN      ] base58_encode_decode_addr.handles_21D35quxec71111111111111111111111111111111111111111111111111111111111111111111111111111116Q5tCH
[       OK ] base58_encode_decode_addr.handles_21D35quxec71111111111111111111111111111111111111111111111111111111111111111111111111111116Q5tCH (0 ms)
[ RUN      ] base58_encode_decode_addr.handles_2Aui6ejTFscjpXCZedGfVQjpXCZedGfVQjpXCZedGfVQjpXCZedGfVQjpXCZedGfVQjpXCZedGfVQjpXCZedGfVQVqegMoV
[       OK ] base58_encode_decode_addr.handles_2Aui6ejTFscjpXCZedGfVQjpXCZedGfVQjpXCZedGfVQjpXCZedGfVQjpXCZedGfVQjpXCZedGfVQjpXCZedGfVQVqegMoV (0 ms)
[ RUN      ] base58_encode_decode_addr.handles_1119XrkPuSmLzdHXgVgrZKjepg5hZAxffLzdHXgVgrZKjepg5hZAxffLzdHXgVgrZKjepg5hZAxffLzdHXgVgrZKVphZRvn
[       OK ] base58_encode_decode_addr.handles_1119XrkPuSmLzdHXgVgrZKjepg5hZAxffLzdHXgVgrZKjepg5hZAxffLzdHXgVgrZKjepg5hZAxffLzdHXgVgrZKVphZRvn (0 ms)
[ RUN      ] base58_encode_decode_addr.handles_111111111111111111111111111111111111111111111111111111111111111111111111111111111111111115TXfiA
[       OK ] base58_encode_decode_addr.handles_111111111111111111111111111111111111111111111111111111111111111111111111111111111111111115TXfiA (0 ms)
[ RUN      ] base58_encode_decode_addr.handles_PuT7GAdgbA83qvSEivPLYo11111111111111111111111111111111111111111111111111111111111111111111111111111169tWrH
[       OK ] base58_encode_decode_addr.handles_PuT7GAdgbA83qvSEivPLYo11111111111111111111111111111111111111111111111111111111111111111111111111111169tWrH (1 ms)
[ RUN      ] base58_encode_decode_addr.handles_PuT7GAdgbA841d7FXjswpJjpXCZedGfVQjpXCZedGfVQjpXCZedGfVQjpXCZedGfVQjpXCZedGfVQjpXCZedGfVQjpXCZedGfVQVq4LL1v
[       OK ] base58_encode_decode_addr.handles_PuT7GAdgbA841d7FXjswpJjpXCZedGfVQjpXCZedGfVQjpXCZedGfVQjpXCZedGfVQjpXCZedGfVQjpXCZedGfVQjpXCZedGfVQVq4LL1v (0 ms)
[ RUN      ] base58_encode_decode_addr.handles_PuT7GAdgbA819VwdWVDP
[       OK ] base58_encode_decode_addr.handles_PuT7GAdgbA819VwdWVDP (0 ms)
[ RUN      ] base58_encode_decode_addr.handles_PuT7GAdgbA81efAfdCjPg
[       OK ] base58_encode_decode_addr.handles_PuT7GAdgbA81efAfdCjPg (0 ms)
[ RUN      ] base58_encode_decode_addr.handles_PuT7GAdgbA83sryEt3YC8Q
[       OK ] base58_encode_decode_addr.handles_PuT7GAdgbA83sryEt3YC8Q (0 ms)
[ RUN      ] base58_encode_decode_addr.handles_PuT7GAdgbA83tWUuc54PFP3b
[       OK ] base58_encode_decode_addr.handles_PuT7GAdgbA83tWUuc54PFP3b (1 ms)
[ RUN      ] base58_encode_decode_addr.handles_PuT7GAdgbA83u9zaKrtRKZ1J6
[       OK ] base58_encode_decode_addr.handles_PuT7GAdgbA83u9zaKrtRKZ1J6 (0 ms)
[ RUN      ] base58_encode_decode_addr.handles_PuT7GAdgbA83uoWF3eanGG1aRoG
[       OK ] base58_encode_decode_addr.handles_PuT7GAdgbA83uoWF3eanGG1aRoG (0 ms)
[ RUN      ] base58_encode_decode_addr.handles_PuT7GAdgbA83vT1umSHMYJ4oNVdu
[       OK ] base58_encode_decode_addr.handles_PuT7GAdgbA83vT1umSHMYJ4oNVdu (0 ms)
[ RUN      ] base58_encode_decode_addr.handles_PuT7GAdgbA83w6XaVDyvpoGQBEWbB
[       OK ] base58_encode_decode_addr.handles_PuT7GAdgbA83w6XaVDyvpoGQBEWbB (0 ms)
[ RUN      ] base58_encode_decode_addr.handles_PuT7GAdgbA83wk3FD1gW7J2KVGofA1r
[       OK ] base58_encode_decode_addr.handles_PuT7GAdgbA83wk3FD1gW7J2KVGofA1r (0 ms)
[ RUN      ] base58_encode_decode_addr.handles_15p2yAV
[       OK ] base58_encode_decode_addr.handles_15p2yAV (0 ms)
[ RUN      ] base58_encode_decode_addr.handles_FNQ3D6A
[       OK ] base58_encode_decode_addr.handles_FNQ3D6A (0 ms)
[ RUN      ] base58_encode_decode_addr.handles_26k9QWweu
[       OK ] base58_encode_decode_addr.handles_26k9QWweu (0 ms)
[ RUN      ] base58_encode_decode_addr.handles_3BzAD7n3y
[       OK ] base58_encode_decode_addr.handles_3BzAD7n3y (0 ms)
[ RUN      ] base58_encode_decode_addr.handles_11efCaY6UjG7JrxuB
[       OK ] base58_encode_decode_addr.handles_11efCaY6UjG7JrxuB (0 ms)
[ RUN      ] base58_encode_decode_addr.handles_21rhHRT48LN4PriP9
[       OK ] base58_encode_decode_addr.handles_21rhHRT48LN4PriP9 (0 ms)
[----------] 21 tests from base58_encode_decode_addr (5 ms total)

[----------] 17 tests from base58_decode_addr_neg
[ RUN      ] base58_decode_addr_neg.decode_fails_due_overflow
[       OK ] base58_decode_addr_neg.decode_fails_due_overflow (0 ms)
[ RUN      ] base58_decode_addr_neg.decode_fails_due_invalid_char_0
[       OK ] base58_decode_addr_neg.decode_fails_due_invalid_char_0 (0 ms)
[ RUN      ] base58_decode_addr_neg.decode_fails_due_invalid_char_I
[       OK ] base58_decode_addr_neg.decode_fails_due_invalid_char_I (0 ms)
[ RUN      ] base58_decode_addr_neg.decode_fails_due_invalid_char_O
[       OK ] base58_decode_addr_neg.decode_fails_due_invalid_char_O (0 ms)
[ RUN      ] base58_decode_addr_neg.decode_fails_due_invalid_char_l
[       OK ] base58_decode_addr_neg.decode_fails_due_invalid_char_l (0 ms)
[ RUN      ] base58_decode_addr_neg.decode_fails_due_invalid_char_00
[       OK ] base58_decode_addr_neg.decode_fails_due_invalid_char_00 (0 ms)
[ RUN      ] base58_decode_addr_neg.decode_fails_due_invalid_lenght
[       OK ] base58_decode_addr_neg.decode_fails_due_invalid_lenght (0 ms)
[ RUN      ] base58_decode_addr_neg.handles_invalid_checksum
[       OK ] base58_decode_addr_neg.handles_invalid_checksum (0 ms)
[ RUN      ] base58_decode_addr_neg.handles_non_correct_tag
[       OK ] base58_decode_addr_neg.handles_non_correct_tag (0 ms)
[ RUN      ] base58_decode_addr_neg.decode_fails_due_invalid_block_len_0
[       OK ] base58_decode_addr_neg.decode_fails_due_invalid_block_len_0 (0 ms)
[ RUN      ] base58_decode_addr_neg.decode_fails_due_invalid_block_len_1
[       OK ] base58_decode_addr_neg.decode_fails_due_invalid_block_len_1 (0 ms)
[ RUN      ] base58_decode_addr_neg.decode_fails_due_address_too_short_0
[       OK ] base58_decode_addr_neg.decode_fails_due_address_too_short_0 (0 ms)
[ RUN      ] base58_decode_addr_neg.decode_fails_due_address_too_short_1
[       OK ] base58_decode_addr_neg.decode_fails_due_address_too_short_1 (0 ms)
[ RUN      ] base58_decode_addr_neg.decode_fails_due_address_too_short_2
[       OK ] base58_decode_addr_neg.decode_fails_due_address_too_short_2 (0 ms)
[ RUN      ] base58_decode_addr_neg.decode_fails_due_address_too_short_3
[       OK ] base58_decode_addr_neg.decode_fails_due_address_too_short_3 (0 ms)
[ RUN      ] base58_decode_addr_neg.decode_fails_due_address_too_short_4
[       OK ] base58_decode_addr_neg.decode_fails_due_address_too_short_4 (0 ms)
[ RUN      ] base58_decode_addr_neg.decode_fails_due_address_too_short_5
[       OK ] base58_decode_addr_neg.decode_fails_due_address_too_short_5 (0 ms)
[----------] 17 tests from base58_decode_addr_neg (1 ms total)

[----------] 1 test from get_account_address_as_str
[ RUN      ] get_account_address_as_str.works_correctly
[       OK ] get_account_address_as_str.works_correctly (0 ms)
[----------] 1 test from get_account_address_as_str (1 ms total)

[----------] 7 tests from get_account_address_from_str
[ RUN      ] get_account_address_from_str.handles_valid_address
[       OK ] get_account_address_from_str.handles_valid_address (0 ms)
[ RUN      ] get_account_address_from_str.fails_on_invalid_address_format
[       OK ] get_account_address_from_str.fails_on_invalid_address_format (0 ms)
[ RUN      ] get_account_address_from_str.fails_on_invalid_address_prefix
[       OK ] get_account_address_from_str.fails_on_invalid_address_prefix (0 ms)
[ RUN      ] get_account_address_from_str.fails_on_invalid_address_content
[       OK ] get_account_address_from_str.fails_on_invalid_address_content (0 ms)
[ RUN      ] get_account_address_from_str.fails_on_invalid_address_spend_key
[       OK ] get_account_address_from_str.fails_on_invalid_address_spend_key (1 ms)
[ RUN      ] get_account_address_from_str.fails_on_invalid_address_view_key
[       OK ] get_account_address_from_str.fails_on_invalid_address_view_key (1 ms)
[ RUN      ] get_account_address_from_str.parses_old_address_format
[       OK ] get_account_address_from_str.parses_old_address_format (0 ms)
[----------] 7 tests from get_account_address_from_str (4 ms total)

[----------] 3 tests from BlockchainDBTest/0, where TypeParam = cryptonote::BlockchainLMDB
[ RUN      ] BlockchainDBTest/0.OpenAndClose
File created by test: /tmp/filenfyJf4/data.mdb
File created by test: /tmp/filenfyJf4/lock.mdb
terminate called after throwing an instance of 'cryptonote::DB_OPEN_FAILURE'
terminate called recursively
<end of output>
Test time =   0.52 sec
----------------------------------------------------------
Test Failed.
"unit_tests" end time: Dec 13 18:07 UTC
"unit_tests" time elapsed: 00:00:00
----------------------------------------------------------

5/13 Testing: difficulty
5/13 Test: difficulty
Command: "/home/buildbot/slave/monero-tests-ubuntu-16_04-armv7/build/build/debug/tests/difficulty/difficulty-tests" "/home/buildbot/slave/monero-tests-ubuntu-16_04-armv7/build/tests/difficulty/data.txt"
Directory: /home/buildbot/slave/monero-tests-ubuntu-16_04-armv7/build/build/debug/tests/difficulty
"difficulty" start time: Dec 13 18:07 UTC
Output:
----------------------------------------------------------
<end of output>
Test time =   0.07 sec
----------------------------------------------------------
Test Passed.
"difficulty" end time: Dec 13 18:07 UTC
"difficulty" time elapsed: 00:00:00
----------------------------------------------------------

6/13 Testing: hash-fast
6/13 Test: hash-fast
Command: "/home/buildbot/slave/monero-tests-ubuntu-16_04-armv7/build/build/debug/tests/hash/hash-tests" "fast" "/home/buildbot/slave/monero-tests-ubuntu-16_04-armv7/build/tests/hash/tests-fast.txt"
Directory: /home/buildbot/slave/monero-tests-ubuntu-16_04-armv7/build/build/debug/tests/hash
"hash-fast" start time: Dec 13 18:07 UTC
Output:
----------------------------------------------------------
<end of output>
Test time =   0.10 sec
----------------------------------------------------------
Test Passed.
"hash-fast" end time: Dec 13 18:07 UTC
"hash-fast" time elapsed: 00:00:00
----------------------------------------------------------

7/13 Testing: hash-slow
7/13 Test: hash-slow
Command: "/home/buildbot/slave/monero-tests-ubuntu-16_04-armv7/build/build/debug/tests/hash/hash-tests" "slow" "/home/buildbot/slave/monero-tests-ubuntu-16_04-armv7/build/tests/hash/tests-slow.txt"
Directory: /home/buildbot/slave/monero-tests-ubuntu-16_04-armv7/build/build/debug/tests/hash
"hash-slow" start time: Dec 13 18:07 UTC
Output:
----------------------------------------------------------
<end of output>
Test time =   1.45 sec
----------------------------------------------------------
Test Passed.
"hash-slow" end time: Dec 13 18:07 UTC
"hash-slow" time elapsed: 00:00:01
----------------------------------------------------------

8/13 Testing: hash-tree
8/13 Test: hash-tree
Command: "/home/buildbot/slave/monero-tests-ubuntu-16_04-armv7/build/build/debug/tests/hash/hash-tests" "tree" "/home/buildbot/slave/monero-tests-ubuntu-16_04-armv7/build/tests/hash/tests-tree.txt"
Directory: /home/buildbot/slave/monero-tests-ubuntu-16_04-armv7/build/build/debug/tests/hash
"hash-tree" start time: Dec 13 18:07 UTC
Output:
----------------------------------------------------------
<end of output>
Test time =   0.03 sec
----------------------------------------------------------
Test Passed.
"hash-tree" end time: Dec 13 18:07 UTC
"hash-tree" time elapsed: 00:00:00
----------------------------------------------------------

9/13 Testing: hash-extra-blake
9/13 Test: hash-extra-blake
Command: "/home/buildbot/slave/monero-tests-ubuntu-16_04-armv7/build/build/debug/tests/hash/hash-tests" "extra-blake" "/home/buildbot/slave/monero-tests-ubuntu-16_04-armv7/build/tests/hash/tests-extra-blake.txt"
Directory: /home/buildbot/slave/monero-tests-ubuntu-16_04-armv7/build/build/debug/tests/hash
"hash-extra-blake" start time: Dec 13 18:07 UTC
Output:
----------------------------------------------------------
<end of output>
Test time =   0.04 sec
----------------------------------------------------------
Test Passed.
"hash-extra-blake" end time: Dec 13 18:07 UTC
"hash-extra-blake" time elapsed: 00:00:00
----------------------------------------------------------

10/13 Testing: hash-extra-groestl
10/13 Test: hash-extra-groestl
Command: "/home/buildbot/slave/monero-tests-ubuntu-16_04-armv7/build/build/debug/tests/hash/hash-tests" "extra-groestl" "/home/buildbot/slave/monero-tests-ubuntu-16_04-armv7/build/tests/hash/tests-extra-groestl.txt"
Directory: /home/buildbot/slave/monero-tests-ubuntu-16_04-armv7/build/build/debug/tests/hash
"hash-extra-groestl" start time: Dec 13 18:07 UTC
Output:
----------------------------------------------------------
<end of output>
Test time =   0.06 sec
----------------------------------------------------------
Test Passed.
"hash-extra-groestl" end time: Dec 13 18:07 UTC
"hash-extra-groestl" time elapsed: 00:00:00
----------------------------------------------------------

11/13 Testing: hash-extra-jh
11/13 Test: hash-extra-jh
Command: "/home/buildbot/slave/monero-tests-ubuntu-16_04-armv7/build/build/debug/tests/hash/hash-tests" "extra-jh" "/home/buildbot/slave/monero-tests-ubuntu-16_04-armv7/build/tests/hash/tests-extra-jh.txt"
Directory: /home/buildbot/slave/monero-tests-ubuntu-16_04-armv7/build/build/debug/tests/hash
"hash-extra-jh" start time: Dec 13 18:07 UTC
Output:
----------------------------------------------------------
<end of output>
Test time =   0.12 sec
----------------------------------------------------------
Test Passed.
"hash-extra-jh" end time: Dec 13 18:07 UTC
"hash-extra-jh" time elapsed: 00:00:00
----------------------------------------------------------

12/13 Testing: hash-extra-skein
12/13 Test: hash-extra-skein
Command: "/home/buildbot/slave/monero-tests-ubuntu-16_04-armv7/build/build/debug/tests/hash/hash-tests" "extra-skein" "/home/buildbot/slave/monero-tests-ubuntu-16_04-armv7/build/tests/hash/tests-extra-skein.txt"
Directory: /home/buildbot/slave/monero-tests-ubuntu-16_04-armv7/build/build/debug/tests/hash
"hash-extra-skein" start time: Dec 13 18:07 UTC
Output:
----------------------------------------------------------
<end of output>
Test time =   0.07 sec
----------------------------------------------------------
Test Passed.
"hash-extra-skein" end time: Dec 13 18:07 UTC
"hash-extra-skein" time elapsed: 00:00:00
----------------------------------------------------------

13/13 Testing: libwallet_api_tests
13/13 Test: libwallet_api_tests
Command: "/home/buildbot/slave/monero-tests-ubuntu-16_04-armv7/build/build/debug/tests/libwallet_api_tests/libwallet_api_tests"
Directory: /home/buildbot/slave/monero-tests-ubuntu-16_04-armv7/build/build/debug/tests/libwallet_api_tests
"libwallet_api_tests" start time: Dec 13 18:07 UTC
Output:
----------------------------------------------------------
[==========] Running 36 tests from 4 test cases.
[----------] Global test environment set-up.
[----------] 14 tests from WalletManagerTest
[ RUN      ] WalletManagerTest.WalletManagerCreatesWallet
WalletManagerTest
** deleting wallet: testwallet
** removing dir recursively: walletdir
2016-Dec-13 18:07:58.096590 wallet_path: testwallet
2016-Dec-13 18:07:58.096771 keys_file_exists: false  wallet_file_exists: false
2016-Dec-13 18:07:58.097096 refreshThreadFunc: starting refresh thread
2016-Dec-13 18:07:58.097331 refreshThreadFunc: waiting for refresh...
2016-Dec-13 18:07:58.100481 Calculated blockchain height: 1200692
** seed: afield twang mundane lids hemlock oval public simplest hubcaps unwind slug incur otherwise inactive otherwise were ribbon anecdote colony dewdrop vixen reduce invoke launching incur
** address: 42EoPZP1oSLYzzBDjyvevgBu61yzJx2GwCx5mcXm88DjAqoZTQcXNFHg92pSsCfJbyaxmCEcUp4UBbm3AtrRpLRz7EqH3Uq
2016-Dec-13 18:07:59.278298 closing wallet...
2016-Dec-13 18:07:59.638791 wallet::store done
2016-Dec-13 18:07:59.638934 Calling wallet::stop...
2016-Dec-13 18:07:59.639037 wallet::stop done
2016-Dec-13 18:07:59.639646 refreshThreadFunc: refresh lock acquired...
2016-Dec-13 18:07:59.639787 refreshThreadFunc: m_refreshEnabled: 0
2016-Dec-13 18:07:59.639890 refreshThreadFunc: m_status: 0
2016-Dec-13 18:07:59.639987 refreshThreadFunc: refresh thread stopped
~WalletManagerTest
[       OK ] WalletManagerTest.WalletManagerCreatesWallet (1545 ms)
[ RUN      ] WalletManagerTest.WalletManagerOpensWallet
WalletManagerTest
** deleting wallet: testwallet
** removing dir recursively: walletdir
2016-Dec-13 18:07:59.641467 wallet_path: testwallet
2016-Dec-13 18:07:59.641614 keys_file_exists: false  wallet_file_exists: false
2016-Dec-13 18:07:59.641906 refreshThreadFunc: starting refresh thread
2016-Dec-13 18:07:59.642047 refreshThreadFunc: waiting for refresh...
2016-Dec-13 18:07:59.644915 Calculated blockchain height: 1200692
2016-Dec-13 18:08:00.787221 closing wallet...
2016-Dec-13 18:08:01.168860 wallet::store done
2016-Dec-13 18:08:01.169002 Calling wallet::stop...
2016-Dec-13 18:08:01.169105 wallet::stop done
2016-Dec-13 18:08:01.169713 refreshThreadFunc: refresh lock acquired...
2016-Dec-13 18:08:01.169852 refreshThreadFunc: m_refreshEnabled: 0
2016-Dec-13 18:08:01.169953 refreshThreadFunc: m_status: 0
2016-Dec-13 18:08:01.170046 refreshThreadFunc: refresh thread stopped
2016-Dec-13 18:08:01.171132 refreshThreadFunc: starting refresh thread
2016-Dec-13 18:08:01.171356 refreshThreadFunc: waiting for refresh...
2016-Dec-13 18:08:01.556173 Loaded wallet keys file, with public address: 48q7ADpQDCaAZCX4TMMYUCU63FFCndNCHXjXTnKv5Epm9vDtCvCUHfqCi3mmkWsy4j9tUujj8rDhuPGdeEst4j8MNdFZKK9
2016-Dec-13 18:08:01.556599 Trying to decrypt cache data
2016-Dec-13 18:08:02.336607 Refreshing addressbook
** seed: python vegan comb alarms potato trying baptism godfather waist myth fowls orbit afar sniff fibula elapse nineteen innocent puzzled nurse duke duration utmost weavers potato
~WalletManagerTest
[       OK ] WalletManagerTest.WalletManagerOpensWallet (2696 ms)
[ RUN      ] WalletManagerTest.WalletMaxAmountAsString
WalletManagerTest
** deleting wallet: testwallet
** removing dir recursively: walletdir
2016-Dec-13 18:08:02.337524 max amount: 18446744.073709551615
~WalletManagerTest
[       OK ] WalletManagerTest.WalletMaxAmountAsString (0 ms)
[ RUN      ] WalletManagerTest.WalletAmountFromString
WalletManagerTest
** deleting wallet: testwallet
** removing dir recursively: walletdir
2016-Dec-13 18:08:02.337986 Exception: boost::exception_detail::clone_impl<boost::exception_detail::error_info_injector<boost::bad_lexical_cast> >
2016-Dec-13 18:08:02.338137 Unwound call stack:
2016-Dec-13 18:08:02.356781      1                  0x2c692d __cxa_throw + 0x60
2016-Dec-13 18:08:02.363675      2                  0x19f2fd void boost::throw_exception<boost::bad_lexical_cast>(boost::bad_lexical_cast const&) + 0xb0
2016-Dec-13 18:08:02.370474      3                  0x29e9f3 cryptonote::parse_amount(unsigned long long&, std::__cxx11::basic_string<char, std::char_traits<char>, std::allocator<char> > const&) + 0x296
2016-Dec-13 18:08:02.377385      4                  0x1a5bbf Bitmonero::Wallet::amountFromString(std::__cxx11::basic_string<char, std::char_traits<char>, std::allocator<char> > const&) + 0x22
2016-Dec-13 18:08:02.384262      5                  0x193109 WalletManagerTest_WalletAmountFromString_Test::TestBody() + 0xd8
2016-Dec-13 18:08:02.390994      6                  0x296759 void testing::internal::HandleSehExceptionsInMethodIfSupported<testing::Test, void>(testing::Test*, void (testing::Test::*)(), char const*) + 0x24
2016-Dec-13 18:08:02.397869      7                  0x29a3a9 void testing::internal::HandleExceptionsInMethodIfSupported<testing::Test, void>(testing::Test*, void (testing::Test::*)(), char const*) + 0x30
2016-Dec-13 18:08:02.404687      8                  0x293b07 testing::Test::Run() + 0x6a
2016-Dec-13 18:08:02.411477      9                  0x293bbb testing::TestInfo::Run() + 0x7a
2016-Dec-13 18:08:02.418251     10                  0x293c8d testing::TestCase::Run() + 0x7c
2016-Dec-13 18:08:02.425078     11                  0x293ec3 testing::internal::UnitTestImpl::RunAllTests() + 0x1de
2016-Dec-13 18:08:02.431876     12                  0x296a99 bool testing::internal::HandleSehExceptionsInMethodIfSupported<testing::internal::UnitTestImpl, bool>(testing::internal::UnitTestImpl*, bool (testing::internal::UnitTestImpl::*)(), char const*) + 0x24
2016-Dec-13 18:08:02.438729     13                  0x29a6b9 bool testing::internal::HandleExceptionsInMethodIfSupported<testing::internal::UnitTestImpl, bool>(testing::internal::UnitTestImpl*, bool (testing::internal::UnitTestImpl::*)(), char const*) + 0x30
2016-Dec-13 18:08:02.445571     14                  0x2940b3 testing::UnitTest::Run() + 0x82
2016-Dec-13 18:08:02.452467     15                  0x194e73 main + 0x1aa
2016-Dec-13 18:08:02.453346     16                  0xb698b8ab __libc_start_main + 0x9e
2016-Dec-13 18:08:02.462878     17                  0x18b0e1 _start + 0x20
terminate called after throwing an instance of 'boost::exception_detail::clone_impl<boost::exception_detail::error_info_injector<boost::bad_lexical_cast> >'
terminate called recursively
<end of output>
Test time =   4.42 sec
----------------------------------------------------------
Test Failed.
"libwallet_api_tests" end time: Dec 13 18:08 UTC
"libwallet_api_tests" time elapsed: 00:00:04
----------------------------------------------------------

End testing: Dec 13 18:08 UTC