(view as text)
make debug
 in dir /home/vagrant/slave/monero-tests-ubuntu-16_04-amd64/build (timeout 1200 secs)
 watching logfiles {}
 argv: ['make', 'debug']
 environment:
  HOME=/home/vagrant
  LANG=en_US
  LANGUAGE=en_US:
  LESSCLOSE=/usr/bin/lesspipe %s %s
  LESSOPEN=| /usr/bin/lesspipe %s
  LOGNAME=vagrant
  LS_COLORS=rs=0:di=01;34:ln=01;36:mh=00:pi=40;33:so=01;35:do=01;35:bd=40;33;01:cd=40;33;01:or=40;31;01:mi=00:su=37;41:sg=30;43:ca=30;41:tw=30;42:ow=34;42:st=37;44:ex=01;32:*.tar=01;31:*.tgz=01;31:*.arc=01;31:*.arj=01;31:*.taz=01;31:*.lha=01;31:*.lz4=01;31:*.lzh=01;31:*.lzma=01;31:*.tlz=01;31:*.txz=01;31:*.tzo=01;31:*.t7z=01;31:*.zip=01;31:*.z=01;31:*.Z=01;31:*.dz=01;31:*.gz=01;31:*.lrz=01;31:*.lz=01;31:*.lzo=01;31:*.xz=01;31:*.bz2=01;31:*.bz=01;31:*.tbz=01;31:*.tbz2=01;31:*.tz=01;31:*.deb=01;31:*.rpm=01;31:*.jar=01;31:*.war=01;31:*.ear=01;31:*.sar=01;31:*.rar=01;31:*.alz=01;31:*.ace=01;31:*.zoo=01;31:*.cpio=01;31:*.7z=01;31:*.rz=01;31:*.cab=01;31:*.jpg=01;35:*.jpeg=01;35:*.gif=01;35:*.bmp=01;35:*.pbm=01;35:*.pgm=01;35:*.ppm=01;35:*.tga=01;35:*.xbm=01;35:*.xpm=01;35:*.tif=01;35:*.tiff=01;35:*.png=01;35:*.svg=01;35:*.svgz=01;35:*.mng=01;35:*.pcx=01;35:*.mov=01;35:*.mpg=01;35:*.mpeg=01;35:*.m2v=01;35:*.mkv=01;35:*.webm=01;35:*.ogm=01;35:*.mp4=01;35:*.m4v=01;35:*.mp4v=01;35:*.vob=01;35:*.qt=01;35:*.nuv=01;35:*.wmv=01;35:*.asf=01;35:*.rm=01;35:*.rmvb=01;35:*.flc=01;35:*.avi=01;35:*.fli=01;35:*.flv=01;35:*.gl=01;35:*.dl=01;35:*.xcf=01;35:*.xwd=01;35:*.yuv=01;35:*.cgm=01;35:*.emf=01;35:*.ogv=01;35:*.ogx=01;35:*.aac=00;36:*.au=00;36:*.flac=00;36:*.m4a=00;36:*.mid=00;36:*.midi=00;36:*.mka=00;36:*.mp3=00;36:*.mpc=00;36:*.ogg=00;36:*.ra=00;36:*.wav=00;36:*.oga=00;36:*.opus=00;36:*.spx=00;36:*.xspf=00;36:
  MAIL=/var/mail/vagrant
  PATH=/home/vagrant/bin:/home/vagrant/.local/bin:/usr/local/sbin:/usr/local/bin:/usr/sbin:/usr/bin:/sbin:/bin:/usr/games:/usr/local/games
  PWD=/home/vagrant/slave/monero-tests-ubuntu-16_04-amd64/build
  SHELL=/bin/bash
  SHLVL=1
  SSH_CLIENT=10.0.2.2 52900 22
  SSH_CONNECTION=10.0.2.2 52900 10.0.2.15 22
  SSH_TTY=/dev/pts/0
  TERM=xterm-256color
  USER=vagrant
  XDG_RUNTIME_DIR=/run/user/900
  XDG_SESSION_ID=2
  _=/usr/local/bin/buildslave
 using PTY: False
mkdir -p build/"Linux/master"/debug
cd build/"Linux/master"/debug && cmake -D CMAKE_BUILD_TYPE=Debug ../../../..
-- CMake version 3.5.1
-- The C compiler identification is GNU 5.4.0
-- The CXX compiler identification is GNU 5.4.0
-- Check for working C compiler: /usr/bin/cc
-- Check for working C compiler: /usr/bin/cc -- works
-- Detecting C compiler ABI info
-- Detecting C compiler ABI info - done
-- Detecting C compile features
-- Detecting C compile features - done
-- Check for working CXX compiler: /usr/bin/c++
-- Check for working CXX compiler: /usr/bin/c++ -- works
-- Detecting CXX compiler ABI info
-- Detecting CXX compiler ABI info - done
-- Detecting CXX compile features
-- Detecting CXX compile features - done
-- The ASM compiler identification is GNU
-- Found assembler: /usr/bin/cc
-- Building without build tag
-- Found Git: /usr/bin/git (found version "2.7.4") 
-- Checking submodules
-- Submodule 'external/miniupnp' is up-to-date
-- Submodule 'external/unbound' is up-to-date
-- Submodule 'external/rapidjson' is up-to-date
-- Submodule 'external/trezor-common' is up-to-date
-- Could not find DEVELOPER_LOCAL_TOOLS in env (not required)
-- BOOST_IGNORE_SYSTEM_PATHS defaults to OFF
-- Could not find DEVELOPER_LIBUNBOUND_OLD in env (not required)
-- Building for a 64-bit system
-- Building internal libraries with position independent code
-- Could not find DATABASE in env (not required unless you want to change database type from default: lmdb)
-- Using LMDB as default DB type
-- Stack trace on exception enabled (using easylogging++)
-- Looking for pthread.h
-- Looking for pthread.h - found
-- Looking for pthread_create
-- Looking for pthread_create - not found
-- Check if compiler accepts -pthread
-- Check if compiler accepts -pthread - yes
-- Found Threads: TRUE  
-- Performing Test _pthread_c
-- Performing Test _pthread_c - Success
-- Performing Test _pthread_cxx
-- Performing Test _pthread_cxx - Success
-- Found OpenSSL: /usr/lib/x86_64-linux-gnu/libssl.so;/usr/lib/x86_64-linux-gnu/libcrypto.so (found version "1.0.2g") 
-- Using OpenSSL include dir at /usr/include
-- Found HIDAPI: /usr/local/lib/libhidapi-libusb.so  
-- Looking for memset_s in c
-- Looking for memset_s in c - not found
-- Looking for explicit_bzero in c
-- Looking for explicit_bzero in c - not found
-- Looking for strptime
-- Looking for strptime - found
-- Could NOT find MiniUPnPc (missing:  MINIUPNP_INCLUDE_DIR MINIUPNP_LIBRARY) 
-- Using in-tree miniupnpc
-- Looking for libunbound
-- Found libunbound include (unbound.h) in /usr/include
-- Found libunbound shared library
-- Using 64-bit LMDB from source tree
-- Looking for backtrace
-- Looking for backtrace - found
-- backtrace facility detected in default set of libraries
-- Backtrace_LIBRARY: 
-- Found Backtrace: /usr/include  
-- Using HIDAPI include dir at /usr/local/include/hidapi
-- Found Protobuf: /usr/lib/x86_64-linux-gnu/libprotobuf.so  
-- Protobuf lib: /usr/lib/x86_64-linux-gnu/libprotobuf.so, inc: /usr/include, protoc: /home/vagrant/bin/protoc
-- Found PythonInterp: /usr/bin/python (found version "2.7.12") 
-- Protobuf Compilation test failed: Change Dir: /home/vagrant/slave/monero-tests-ubuntu-16_04-amd64/build/build/Linux/master/debug/CMakeFiles/CMakeTmp

Run Build Command:"/usr/bin/make" "cmTC_a56a2/fast"
make[1]: Entering directory '/home/vagrant/slave/monero-tests-ubuntu-16_04-amd64/build/build/Linux/master/debug/CMakeFiles/CMakeTmp'
/usr/bin/make -f CMakeFiles/cmTC_a56a2.dir/build.make CMakeFiles/cmTC_a56a2.dir/build
make[2]: Entering directory '/home/vagrant/slave/monero-tests-ubuntu-16_04-amd64/build/build/Linux/master/debug/CMakeFiles/CMakeTmp'
Building CXX object CMakeFiles/cmTC_a56a2.dir/test-protobuf.pb.cc.o
/usr/bin/c++    -I/home/vagrant/slave/monero-tests-ubuntu-16_04-amd64/build/build/Linux/master/debug  -pthread    -std=gnu++11 -o CMakeFiles/cmTC_a56a2.dir/test-protobuf.pb.cc.o -c /home/vagrant/slave/monero-tests-ubuntu-16_04-amd64/build/build/Linux/master/debug/test-protobuf.pb.cc
In file included from /home/vagrant/slave/monero-tests-ubuntu-16_04-amd64/build/build/Linux/master/debug/test-protobuf.pb.cc:4:0:
/home/vagrant/slave/monero-tests-ubuntu-16_04-amd64/build/build/Linux/master/debug/test-protobuf.pb.h:12:2: error: #error This file was generated by a newer version of protoc which is
 #error This file was generated by a newer version of protoc which is
  ^
/home/vagrant/slave/monero-tests-ubuntu-16_04-amd64/build/build/Linux/master/debug/test-protobuf.pb.h:13:2: error: #error incompatible with your Protocol Buffer headers. Please update
 #error incompatible with your Protocol Buffer headers.  Please update
  ^
/home/vagrant/slave/monero-tests-ubuntu-16_04-amd64/build/build/Linux/master/debug/test-protobuf.pb.h:14:2: error: #error your headers.
 #error your headers.
  ^
In file included from /home/vagrant/slave/monero-tests-ubuntu-16_04-amd64/build/build/Linux/master/debug/test-protobuf.pb.cc:4:0:
/home/vagrant/slave/monero-tests-ubuntu-16_04-amd64/build/build/Linux/master/debug/test-protobuf.pb.h:23:35: fatal error: google/protobuf/arena.h: No such file or directory
compilation terminated.
CMakeFiles/cmTC_a56a2.dir/build.make:65: recipe for target 'CMakeFiles/cmTC_a56a2.dir/test-protobuf.pb.cc.o' failed
make[2]: *** [CMakeFiles/cmTC_a56a2.dir/test-protobuf.pb.cc.o] Error 1
make[2]: Leaving directory '/home/vagrant/slave/monero-tests-ubuntu-16_04-amd64/build/build/Linux/master/debug/CMakeFiles/CMakeTmp'
Makefile:126: recipe for target 'cmTC_a56a2/fast' failed
make[1]: *** [cmTC_a56a2/fast] Error 2
make[1]: Leaving directory '/home/vagrant/slave/monero-tests-ubuntu-16_04-amd64/build/build/Linux/master/debug/CMakeFiles/CMakeTmp'
.
-- Building on x86_64 for native
-- Performing Test CC_SUPPORTS_MARCH_NATIVE
-- Performing Test CC_SUPPORTS_MARCH_NATIVE - Success
-- AES support enabled
-- Performing Test _Wformat_c
-- Performing Test _Wformat_c - Success
-- Performing Test _Wformat_cxx
-- Performing Test _Wformat_cxx - Success
-- Performing Test _Wformat_security_c
-- Performing Test _Wformat_security_c - Success
-- Performing Test _Wformat_security_cxx
-- Performing Test _Wformat_security_cxx - Success
-- Performing Test _fstack_protector_c
-- Performing Test _fstack_protector_c - Success
-- Performing Test _fstack_protector_cxx
-- Performing Test _fstack_protector_cxx - Success
-- Performing Test _fstack_protector_strong_c
-- Performing Test _fstack_protector_strong_c - Success
-- Performing Test _fstack_protector_strong_cxx
-- Performing Test _fstack_protector_strong_cxx - Success
-- Performing Test _fcf_protection=full_c
-- Performing Test _fcf_protection=full_c - Failed
-- Performing Test _fcf_protection=full_cxx
-- Performing Test _fcf_protection=full_cxx - Failed
-- Performing Test _fstack_clash_protection_c
-- Performing Test _fstack_clash_protection_c - Failed
-- Performing Test _fstack_clash_protection_cxx
-- Performing Test _fstack_clash_protection_cxx - Failed
-- Performing Test _mmitigate_rop_c
-- Performing Test _mmitigate_rop_c - Failed
-- Performing Test _mmitigate_rop_cxx
-- Performing Test _mmitigate_rop_cxx - Failed
-- Looking for -pie linker flag
-- Looking for -pie linker flag - found
-- Looking for -Wl,-z,relro linker flag
-- Looking for -Wl,-z,relro linker flag - found
-- Looking for -Wl,-z,now linker flag
-- Looking for -Wl,-z,now linker flag - found
-- Looking for -Wl,-z,noexecstack linker flag
-- Looking for -Wl,-z,noexecstack linker flag - found
-- Looking for -Wl,-z,noexecheap linker flag
-- Looking for -Wl,-z,noexecheap linker flag - not found
-- Using C security hardening flags:  -Wformat -Wformat-security -fstack-protector -fstack-protector-strong
-- Using C++ security hardening flags:  -Wformat -Wformat-security -fstack-protector -fstack-protector-strong
-- Using linker security hardening flags:  -pie -Wl,-z,relro -Wl,-z,now -Wl,-z,noexecstack
-- Found Boost Version: 106000
-- Found Readline: /usr/include  
-- Looking for rl_copy_text
-- Looking for rl_copy_text - found
-- Looking for rl_filename_completion_function
-- Looking for rl_filename_completion_function - found
-- Found readline library at: /usr
-- Found Git: /usr/bin/git
-- Trezor support disabled
-- Not building tests
-- Not building debug utilities
-- Found Doxygen: /usr/bin/doxygen (found version "1.8.11") 
-- Performing Test HAVE_C11
-- Performing Test HAVE_C11 - Success
-- Configuring done
-- Generating done
-- Build files have been written to: /home/vagrant/slave/monero-tests-ubuntu-16_04-amd64/build/build/Linux/master/debug
cd build/"Linux/master"/debug && make
make[1]: Entering directory '/home/vagrant/slave/monero-tests-ubuntu-16_04-amd64/build/build/Linux/master/debug'
make[2]: Entering directory '/home/vagrant/slave/monero-tests-ubuntu-16_04-amd64/build/build/Linux/master/debug'
make[3]: Entering directory '/home/vagrant/slave/monero-tests-ubuntu-16_04-amd64/build/build/Linux/master/debug'
Scanning dependencies of target generate_translations_header
make[3]: Leaving directory '/home/vagrant/slave/monero-tests-ubuntu-16_04-amd64/build/build/Linux/master/debug'
make[3]: Entering directory '/home/vagrant/slave/monero-tests-ubuntu-16_04-amd64/build/build/Linux/master/debug'
[  0%] Creating directories for 'generate_translations_header'
[  1%] No download step for 'generate_translations_header'
[  2%] No patch step for 'generate_translations_header'
[  2%] No update step for 'generate_translations_header'
[  2%] Performing configure step for 'generate_translations_header'
-- The C compiler identification is GNU 5.4.0
-- The CXX compiler identification is GNU 5.4.0
-- Check for working C compiler: /usr/bin/cc
-- Check for working C compiler: /usr/bin/cc -- works
-- Detecting C compiler ABI info
-- Detecting C compiler ABI info - done
-- Detecting C compile features
-- Detecting C compile features - done
-- Check for working CXX compiler: /usr/bin/c++
-- Check for working CXX compiler: /usr/bin/c++ -- works
-- Detecting CXX compiler ABI info
-- Detecting CXX compiler ABI info - done
-- Detecting CXX compile features
-- Detecting CXX compile features - done
lrelease: could not find a Qt installation of ''
CMake Warning at CMakeLists.txt:59 (message):
  lrelease program not working, translation files not built


-- Configuring done
-- Generating done
-- Build files have been written to: /home/vagrant/slave/monero-tests-ubuntu-16_04-amd64/build/build/Linux/master/debug/translations
[  3%] Performing build step for 'generate_translations_header'
make[4]: Entering directory '/home/vagrant/slave/monero-tests-ubuntu-16_04-amd64/build/build/Linux/master/debug/translations'
make[5]: Entering directory '/home/vagrant/slave/monero-tests-ubuntu-16_04-amd64/build/build/Linux/master/debug/translations'
make[6]: Entering directory '/home/vagrant/slave/monero-tests-ubuntu-16_04-amd64/build/build/Linux/master/debug/translations'
Scanning dependencies of target generate_translations_header
make[6]: Leaving directory '/home/vagrant/slave/monero-tests-ubuntu-16_04-amd64/build/build/Linux/master/debug/translations'
make[6]: Entering directory '/home/vagrant/slave/monero-tests-ubuntu-16_04-amd64/build/build/Linux/master/debug/translations'
[ 50%] Building C object CMakeFiles/generate_translations_header.dir/generate_translations_header.c.o
[100%] Linking C executable generate_translations_header
Generating embedded translations header
make[6]: Leaving directory '/home/vagrant/slave/monero-tests-ubuntu-16_04-amd64/build/build/Linux/master/debug/translations'
[100%] Built target generate_translations_header
make[5]: Leaving directory '/home/vagrant/slave/monero-tests-ubuntu-16_04-amd64/build/build/Linux/master/debug/translations'
make[4]: Leaving directory '/home/vagrant/slave/monero-tests-ubuntu-16_04-amd64/build/build/Linux/master/debug/translations'
[  3%] Performing install step for 'generate_translations_header'

[  4%] Completed 'generate_translations_header'
make[3]: Leaving directory '/home/vagrant/slave/monero-tests-ubuntu-16_04-amd64/build/build/Linux/master/debug'
[  4%] Built target generate_translations_header
make[3]: Entering directory '/home/vagrant/slave/monero-tests-ubuntu-16_04-amd64/build/build/Linux/master/debug'
Scanning dependencies of target libminiupnpc-static
make[3]: Leaving directory '/home/vagrant/slave/monero-tests-ubuntu-16_04-amd64/build/build/Linux/master/debug'
make[3]: Entering directory '/home/vagrant/slave/monero-tests-ubuntu-16_04-amd64/build/build/Linux/master/debug'
[  5%] Building C object external/miniupnp/miniupnpc/CMakeFiles/libminiupnpc-static.dir/igd_desc_parse.c.o
[  5%] Building C object external/miniupnp/miniupnpc/CMakeFiles/libminiupnpc-static.dir/miniupnpc.c.o
[  5%] Building C object external/miniupnp/miniupnpc/CMakeFiles/libminiupnpc-static.dir/minixml.c.o
[  6%] Building C object external/miniupnp/miniupnpc/CMakeFiles/libminiupnpc-static.dir/minisoap.c.o
[  6%] Building C object external/miniupnp/miniupnpc/CMakeFiles/libminiupnpc-static.dir/minissdpc.c.o
[  7%] Building C object external/miniupnp/miniupnpc/CMakeFiles/libminiupnpc-static.dir/miniwget.c.o
[  7%] Building C object external/miniupnp/miniupnpc/CMakeFiles/libminiupnpc-static.dir/upnpcommands.c.o
[  8%] Building C object external/miniupnp/miniupnpc/CMakeFiles/libminiupnpc-static.dir/upnpdev.c.o
[  8%] Building C object external/miniupnp/miniupnpc/CMakeFiles/libminiupnpc-static.dir/upnpreplyparse.c.o
[  9%] Building C object external/miniupnp/miniupnpc/CMakeFiles/libminiupnpc-static.dir/upnperrors.c.o
[  9%] Building C object external/miniupnp/miniupnpc/CMakeFiles/libminiupnpc-static.dir/connecthostport.c.o
[  9%] Building C object external/miniupnp/miniupnpc/CMakeFiles/libminiupnpc-static.dir/portlistingparse.c.o
[ 10%] Building C object external/miniupnp/miniupnpc/CMakeFiles/libminiupnpc-static.dir/receivedata.c.o
[ 10%] Linking C static library libminiupnpc.a
make[3]: Leaving directory '/home/vagrant/slave/monero-tests-ubuntu-16_04-amd64/build/build/Linux/master/debug'
[ 10%] Built target libminiupnpc-static
make[3]: Entering directory '/home/vagrant/slave/monero-tests-ubuntu-16_04-amd64/build/build/Linux/master/debug'
Scanning dependencies of target lmdb
make[3]: Leaving directory '/home/vagrant/slave/monero-tests-ubuntu-16_04-amd64/build/build/Linux/master/debug'
make[3]: Entering directory '/home/vagrant/slave/monero-tests-ubuntu-16_04-amd64/build/build/Linux/master/debug'
[ 11%] Building C object external/db_drivers/liblmdb/CMakeFiles/lmdb.dir/mdb.c.o
[ 11%] Building C object external/db_drivers/liblmdb/CMakeFiles/lmdb.dir/midl.c.o
[ 12%] Linking C shared library liblmdb.so
make[3]: Leaving directory '/home/vagrant/slave/monero-tests-ubuntu-16_04-amd64/build/build/Linux/master/debug'
[ 12%] Built target lmdb
make[3]: Entering directory '/home/vagrant/slave/monero-tests-ubuntu-16_04-amd64/build/build/Linux/master/debug'
Scanning dependencies of target easylogging
make[3]: Leaving directory '/home/vagrant/slave/monero-tests-ubuntu-16_04-amd64/build/build/Linux/master/debug'
make[3]: Entering directory '/home/vagrant/slave/monero-tests-ubuntu-16_04-amd64/build/build/Linux/master/debug'
[ 12%] Building CXX object external/easylogging++/CMakeFiles/easylogging.dir/easylogging++.cc.o
[ 13%] Linking CXX shared library libeasylogging.so
make[3]: Leaving directory '/home/vagrant/slave/monero-tests-ubuntu-16_04-amd64/build/build/Linux/master/debug'
[ 13%] Built target easylogging
make[3]: Entering directory '/home/vagrant/slave/monero-tests-ubuntu-16_04-amd64/build/build/Linux/master/debug'
Scanning dependencies of target epee_readline
make[3]: Leaving directory '/home/vagrant/slave/monero-tests-ubuntu-16_04-amd64/build/build/Linux/master/debug'
make[3]: Entering directory '/home/vagrant/slave/monero-tests-ubuntu-16_04-amd64/build/build/Linux/master/debug'
[ 15%] Building CXX object contrib/epee/src/CMakeFiles/epee_readline.dir/readline_buffer.cpp.o
[ 15%] Linking CXX static library libepee_readline.a
make[3]: Leaving directory '/home/vagrant/slave/monero-tests-ubuntu-16_04-amd64/build/build/Linux/master/debug'
[ 15%] Built target epee_readline
make[3]: Entering directory '/home/vagrant/slave/monero-tests-ubuntu-16_04-amd64/build/build/Linux/master/debug'
Scanning dependencies of target epee
make[3]: Leaving directory '/home/vagrant/slave/monero-tests-ubuntu-16_04-amd64/build/build/Linux/master/debug'
make[3]: Entering directory '/home/vagrant/slave/monero-tests-ubuntu-16_04-amd64/build/build/Linux/master/debug'
[ 15%] Building CXX object contrib/epee/src/CMakeFiles/epee.dir/hex.cpp.o
[ 16%] Building CXX object contrib/epee/src/CMakeFiles/epee.dir/http_auth.cpp.o
[ 16%] Building CXX object contrib/epee/src/CMakeFiles/epee.dir/mlog.cpp.o
[ 16%] Building CXX object contrib/epee/src/CMakeFiles/epee.dir/net_helper.cpp.o
[ 17%] Building CXX object contrib/epee/src/CMakeFiles/epee.dir/net_utils_base.cpp.o
In file included from /home/vagrant/slave/monero-tests-ubuntu-16_04-amd64/build/contrib/epee/src/net_utils_base.cpp:7:0:
/home/vagrant/slave/monero-tests-ubuntu-16_04-amd64/build/contrib/epee/include/net/local_ip.h: In function 'bool epee::net_utils::is_ipv6_local(const string&)':
/home/vagrant/slave/monero-tests-ubuntu-16_04-amd64/build/contrib/epee/include/net/local_ip.h:42:19: error: 'make_address_v6' is not a member of 'boost::asio::ip'
       auto addr = boost::asio::ip::make_address_v6(ip);
                   ^
contrib/epee/src/CMakeFiles/epee.dir/build.make:158: recipe for target 'contrib/epee/src/CMakeFiles/epee.dir/net_utils_base.cpp.o' failed
make[3]: Leaving directory '/home/vagrant/slave/monero-tests-ubuntu-16_04-amd64/build/build/Linux/master/debug'
CMakeFiles/Makefile2:436: recipe for target 'contrib/epee/src/CMakeFiles/epee.dir/all' failed
make[3]: *** [contrib/epee/src/CMakeFiles/epee.dir/net_utils_base.cpp.o] Error 1
make[2]: *** [contrib/epee/src/CMakeFiles/epee.dir/all] Error 2
make[2]: Leaving directory '/home/vagrant/slave/monero-tests-ubuntu-16_04-amd64/build/build/Linux/master/debug'
Makefile:138: recipe for target 'all' failed
make[1]: Leaving directory '/home/vagrant/slave/monero-tests-ubuntu-16_04-amd64/build/build/Linux/master/debug'
make[1]: *** [all] Error 2
Makefile:58: recipe for target 'debug' failed
make: *** [debug] Error 2
program finished with exit code 2
elapsedTime=29.435387