(view as text)
make debug-test
 in dir /Users/buildbot/slave/monero-tests-osx-10_11/build
 watching logfiles {'LastTest.log': 'build/debug/Testing/Temporary/LastTest.log', 'coretests.log': 'build/debug/tests/core_tests/coretests.log', 'CTestCostData.txt': 'build/debug/Testing/Temporary/CTestCostData.txt'}
 argv: ['make', 'debug-test']
 environment:
  HOME=/Users/buildbot
  OLDPWD=/Users/buildbot/monero-core
  PATH=/usr/local/opt/qt5/bin:/usr/local/bin:/usr/bin:/bin:/usr/sbin:/sbin
  PWD=/Users/buildbot/slave/monero-tests-osx-10_11/build
  SHELL=/bin/bash
  SHLVL=1
  TERM=xterm
  USER=buildbot
  VERSIONER_PYTHON_PREFER_32_BIT=no
  VERSIONER_PYTHON_VERSION=2.7
  _=/usr/local/bin/buildslave
  __CF_USER_TEXT_ENCODING=0x1F6:0:0
 using PTY: False
mkdir -p build/debug
cd build/debug && cmake -D BUILD_TESTS=ON -D CMAKE_BUILD_TYPE=Debug ../.. && /Applications/Xcode.app/Contents/Developer/usr/bin/make && /Applications/Xcode.app/Contents/Developer/usr/bin/make test
-- The C compiler identification is AppleClang 8.0.0.8000038
-- The CXX compiler identification is AppleClang 8.0.0.8000038
-- Check for working C compiler: /Applications/Xcode.app/Contents/Developer/Toolchains/XcodeDefault.xctoolchain/usr/bin/cc
-- Check for working C compiler: /Applications/Xcode.app/Contents/Developer/Toolchains/XcodeDefault.xctoolchain/usr/bin/cc -- works
-- Detecting C compiler ABI info
-- Detecting C compiler ABI info - done
-- Detecting C compile features
-- Detecting C compile features - done
-- Check for working CXX compiler: /Applications/Xcode.app/Contents/Developer/Toolchains/XcodeDefault.xctoolchain/usr/bin/c++
-- Check for working CXX compiler: /Applications/Xcode.app/Contents/Developer/Toolchains/XcodeDefault.xctoolchain/usr/bin/c++ -- works
-- Detecting CXX compiler ABI info
-- Detecting CXX compiler ABI info - done
-- Detecting CXX compile features
-- Detecting CXX compile features - done
-- Could not find DEVELOPER_LOCAL_TOOLS in env (not required)
-- BOOST_IGNORE_SYSTEM_PATHS defaults to OFF
-- Could not find DEVELOPER_LIBUNBOUND_OLD in env (not required)
-- Building for a 64-bit system
-- Building internal libraries as shared
-- Could not find DATABASE in env (not required unless you want to change database type from default: lmdb)
-- Using LMDB as default DB type
-- Could not find libunwind (missing:  LIBUNWIND_LIBRARIES) 
-- Stack trace on exception disabled
-- Found the miniupnpc libraries at /usr/local/lib/libminiupnpc.dylib
-- Found the miniupnpc headers at /usr/local/include/miniupnpc
-- Detecting version of miniupnpc in path: /usr/local/include/miniupnpc
-- Performing Test MINIUPNPC_VERSION_1_7_OR_HIGHER
-- Performing Test MINIUPNPC_VERSION_1_7_OR_HIGHER - Success
-- Found miniupnpc version is v1.7 or higher
-- Using shared miniupnpc found at /usr/local/include/miniupnpc
-- Looking for libunbound
-- Using OpenSSL found at /usr/local/opt/openssl
-- Found OpenSSL: /usr/local/opt/openssl/lib/libssl.dylib;/usr/local/opt/openssl/lib/libcrypto.dylib (found version "1.0.2j") 
-- Looking for pthread.h
-- Looking for pthread.h - found
-- Looking for pthread_create
-- Looking for pthread_create - found
-- Found Threads: TRUE  
-- Looking for arpa/inet.h
-- Looking for arpa/inet.h - found
-- Looking for endian.h
-- Looking for endian.h - not found
-- Looking for dlfcn.h
-- Looking for dlfcn.h - found
-- Looking for event.h
-- Looking for event.h - found
-- Looking for getopt.h
-- Looking for getopt.h - found
-- Looking for glob.h
-- Looking for glob.h - found
-- Looking for grp.h
-- Looking for grp.h - found
-- Looking for inttypes.h
-- Looking for inttypes.h - found
-- Looking for iphlpapi.h
-- Looking for iphlpapi.h - not found
-- Looking for login_cap.h
-- Looking for login_cap.h - not found
-- Looking for memory.h
-- Looking for memory.h - found
-- Looking for netdb.h
-- Looking for netdb.h - found
-- Looking for netinet/in.h
-- Looking for netinet/in.h - found
-- Looking for pwd.h
-- Looking for pwd.h - found
-- Looking for stdarg.h
-- Looking for stdarg.h - found
-- Looking for stdbool.h
-- Looking for stdbool.h - found
-- Looking for stdint.h
-- Looking for stdint.h - found
-- Looking for stdlib.h
-- Looking for stdlib.h - found
-- Looking for strings.h
-- Looking for strings.h - found
-- Looking for string.h
-- Looking for string.h - found
-- Looking for sys/param.h
-- Looking for sys/param.h - found
-- Looking for sys/resource.h
-- Looking for sys/resource.h - found
-- Looking for sys/sha2.h
-- Looking for sys/sha2.h - not found
-- Looking for sys/socket.h
-- Looking for sys/socket.h - found
-- Looking for sys/stat.h
-- Looking for sys/stat.h - found
-- Looking for sys/sysctl.h
-- Looking for sys/sysctl.h - found
-- Looking for sys/types.h
-- Looking for sys/types.h - found
-- Looking for sys/uio.h
-- Looking for sys/uio.h - found
-- Looking for sys/un.h
-- Looking for sys/un.h - found
-- Looking for sys/wait.h
-- Looking for sys/wait.h - found
-- Looking for syslog.h
-- Looking for syslog.h - found
-- Looking for time.h
-- Looking for time.h - found
-- Looking for unistd.h
-- Looking for unistd.h - found
-- Looking for vfork.h
-- Looking for vfork.h - not found
-- Looking for windows.h
-- Looking for windows.h - not found
-- Looking for winsock2.h
-- Looking for winsock2.h - not found
-- Looking for ws2tcpip.h
-- Looking for ws2tcpip.h - not found
-- Looking for _beginthreadex
-- Looking for _beginthreadex - not found
-- Looking for arc4random
-- Looking for arc4random - found
-- Looking for arc4random_uniform
-- Looking for arc4random_uniform - found
-- Looking for chown
-- Looking for chown - found
-- Looking for chroot
-- Looking for chroot - found
-- Looking for ctime_r
-- Looking for ctime_r - found
-- Looking for daemon
-- Looking for daemon - found
-- Looking for endprotoent
-- Looking for endprotoent - found
-- Looking for endservent
-- Looking for endservent - found
-- Looking for fork
-- Looking for fork - found
-- Looking for fseeko
-- Looking for fseeko - found
-- Looking for fsync
-- Looking for fsync - found
-- Looking for getauxval
-- Looking for getauxval - not found
-- Looking for getentropy
-- Looking for getentropy - not found
-- Looking for getpwnam
-- Looking for getpwnam - found
-- Looking for getrlimit
-- Looking for getrlimit - found
-- Looking for glob
-- Looking for glob - found
-- Looking for gmtime_r
-- Looking for gmtime_r - found
-- Looking for fcntl
-- Looking for fcntl - found
-- Looking for inet_aton
-- Looking for inet_aton - found
-- Looking for inet_ntop
-- Looking for inet_ntop - found
-- Looking for inet_pton
-- Looking for inet_pton - found
-- Looking for initgroups
-- Looking for initgroups - found
-- Looking for ioctlsocket
-- Looking for ioctlsocket - not found
-- Looking for isblank
-- Looking for isblank - found
-- Looking for kill
-- Looking for kill - found
-- Looking for localtime_r
-- Looking for localtime_r - found
-- Looking for malloc
-- Looking for malloc - found
-- Looking for memmove
-- Looking for memmove - found
-- Looking for random
-- Looking for random - found
-- Looking for reallocarray
-- Looking for reallocarray - not found
-- Looking for recvmsg
-- Looking for recvmsg - found
-- Looking for sbrk
-- Looking for sbrk - found
-- Looking for sendmsg
-- Looking for sendmsg - found
-- Looking for setregid
-- Looking for setregid - found
-- Looking for setresgid
-- Looking for setresgid - not found
-- Looking for setresuid
-- Looking for setresuid - not found
-- Looking for setreuid
-- Looking for setreuid - found
-- Looking for setrlimit
-- Looking for setrlimit - found
-- Looking for setsid
-- Looking for setsid - found
-- Looking for setusercontent
-- Looking for setusercontent - not found
-- Looking for sigprocmask
-- Looking for sigprocmask - found
-- Looking for sleep
-- Looking for sleep - found
-- Looking for snprintf
-- Looking for snprintf - found
-- Looking for socketpair
-- Looking for socketpair - found
-- Looking for srandom
-- Looking for srandom - found
-- Looking for strftime
-- Looking for strftime - found
-- Looking for strlcat
-- Looking for strlcat - found
-- Looking for strlcpy
-- Looking for strlcpy - found
-- Looking for strptime
-- Looking for strptime - found
-- Looking for tzset
-- Looking for tzset - found
-- Looking for usleep
-- Looking for usleep - found
-- Looking for writev
-- Looking for writev - found
-- Looking for getaddrinfo
-- Looking for getaddrinfo - found
-- Looking for stddef.h
-- Looking for stddef.h - found
-- Check size of time_t
-- Check size of time_t - done
-- Check size of gid_t
-- Check size of gid_t - done
-- Check size of in_addr_t
-- Check size of in_addr_t - done
-- Check size of in_port_t
-- Check size of in_port_t - done
-- Check size of int16_t
-- Check size of int16_t - done
-- Check size of int32_t
-- Check size of int32_t - done
-- Check size of int64_t
-- Check size of int64_t - done
-- Check size of int8_t
-- Check size of int8_t - done
-- Check size of pid_t
-- Check size of pid_t - done
-- Check size of rlim_t
-- Check size of rlim_t - done
-- Check size of ssize_t
-- Check size of ssize_t - done
-- Check size of uid_t
-- Check size of uid_t - done
-- Check size of uint16_t
-- Check size of uint16_t - done
-- Check size of uint32_t
-- Check size of uint32_t - done
-- Check size of uint64_t
-- Check size of uint64_t - done
-- Check size of uint8_t
-- Check size of uint8_t - done
-- Looking for PTHREAD_PRIO_INHERIT
-- Looking for PTHREAD_PRIO_INHERIT - found
-- Looking for pthread_rwlock_t
-- Looking for pthread_rwlock_t - not found
-- Looking for pthread_spinlock_t
-- Looking for pthread_spinlock_t - not found
-- Looking for openssl/conf.h
-- Looking for openssl/conf.h - found
-- Looking for openssl/engine.h
-- Looking for openssl/engine.h - found
-- Looking for openssl/err.h
-- Looking for openssl/err.h - found
-- Looking for openssl/rand.h
-- Looking for openssl/rand.h - found
-- Looking for openssl/ssl.h
-- Looking for openssl/ssl.h - found
-- Looking for NID_secp384r1
-- Looking for NID_secp384r1 - not found
-- Looking for NID_X9_62_prime256v1
-- Looking for NID_X9_62_prime256v1 - not found
-- Looking for sk_SSL_COMP_pop_free
-- Looking for sk_SSL_COMP_pop_free - not found
-- Looking for SSL_COMP_get_compression_methods
-- Looking for SSL_COMP_get_compression_methods - not found
-- Looking for EVP_sha1
-- Looking for EVP_sha1 - found
-- Looking for EVP_sha256
-- Looking for EVP_sha256 - found
-- Looking for EVP_sha512
-- Looking for EVP_sha512 - found
-- Looking for FIPS_mode
-- Looking for FIPS_mode - found
-- Looking for HMAC_CTX_init
-- Looking for HMAC_CTX_init - found
-- Looking for OPENSSL_config
-- Looking for OPENSSL_config - found
-- Looking for SHA512_Update
-- Looking for SHA512_Update - found
-- Found PkgConfig: /usr/local/bin/pkg-config (found version "0.29.1") 
-- Using 64-bit LMDB from source tree
-- Building on x86_64 for native
-- AES support enabled
-- Found Boost Version: 106100
-- Found Git: /usr/bin/git
-- Could NOT find GTest (missing:  GTEST_LIBRARY GTEST_INCLUDE_DIR GTEST_MAIN_LIBRARY) 
-- GTest not found on the system: will use GTest bundled with this source
-- Found PythonInterp: /usr/bin/python (found version "2.7.10") 
-- Found Doxygen: /usr/local/bin/doxygen (found version "1.8.12") 
-- Configuring done
CMake Warning (dev):
  Policy CMP0042 is not set: MACOSX_RPATH is enabled by default.  Run "cmake
  --help-policy CMP0042" for policy details.  Use the cmake_policy command to
  set the policy and suppress this warning.

  MACOSX_RPATH is not specified for the following targets:

   blockchain_db
   common
   crypto
   cryptonote_core
   cryptonote_protocol
   daemonizer
   gtest
   gtest_main
   lmdb
   mnemonics
   otshell_utils
   p2p
   ringct
   rpc
   unbound
   wallet

This warning is for project developers.  Use -Wno-dev to suppress it.

-- Generating done
-- Build files have been written to: /Users/buildbot/slave/monero-tests-osx-10_11/build/build/debug
Scanning dependencies of target version
[  0%] Generating version/version.h
-- You are currently on commit 83b0511
-- The most recent tag was at 53e18ca
-- You are ahead of or behind a tagged release
[  0%] Built target version
Scanning dependencies of target unbound
[  0%] Building C object external/unbound/CMakeFiles/unbound.dir/services/cache/dns.c.o
[  1%] Building C object external/unbound/CMakeFiles/unbound.dir/services/cache/infra.c.o
[  1%] Building C object external/unbound/CMakeFiles/unbound.dir/services/cache/rrset.c.o
[  2%] Building C object external/unbound/CMakeFiles/unbound.dir/util/data/dname.c.o
[  2%] Building C object external/unbound/CMakeFiles/unbound.dir/util/data/msgencode.c.o
[  2%] Building C object external/unbound/CMakeFiles/unbound.dir/util/data/msgparse.c.o
[  3%] Building C object external/unbound/CMakeFiles/unbound.dir/util/data/msgreply.c.o
[  3%] Building C object external/unbound/CMakeFiles/unbound.dir/util/data/packed_rrset.c.o
[  4%] Building C object external/unbound/CMakeFiles/unbound.dir/iterator/iterator.c.o
[  4%] Building C object external/unbound/CMakeFiles/unbound.dir/iterator/iter_delegpt.c.o
[  4%] Building C object external/unbound/CMakeFiles/unbound.dir/iterator/iter_donotq.c.o
[  5%] Building C object external/unbound/CMakeFiles/unbound.dir/iterator/iter_fwd.c.o
[  5%] Building C object external/unbound/CMakeFiles/unbound.dir/iterator/iter_hints.c.o
[  6%] Building C object external/unbound/CMakeFiles/unbound.dir/iterator/iter_priv.c.o
[  6%] Building C object external/unbound/CMakeFiles/unbound.dir/iterator/iter_resptype.c.o
[  6%] Building C object external/unbound/CMakeFiles/unbound.dir/iterator/iter_scrub.c.o
[  7%] Building C object external/unbound/CMakeFiles/unbound.dir/iterator/iter_utils.c.o
[  7%] Building C object external/unbound/CMakeFiles/unbound.dir/services/listen_dnsport.c.o
[  8%] Building C object external/unbound/CMakeFiles/unbound.dir/services/localzone.c.o
[  8%] Building C object external/unbound/CMakeFiles/unbound.dir/services/mesh.c.o
[  8%] Building C object external/unbound/CMakeFiles/unbound.dir/services/modstack.c.o
[  9%] Building C object external/unbound/CMakeFiles/unbound.dir/services/outbound_list.c.o
[  9%] Building C object external/unbound/CMakeFiles/unbound.dir/services/outside_network.c.o
[ 10%] Building C object external/unbound/CMakeFiles/unbound.dir/util/alloc.c.o
[ 10%] Building C object external/unbound/CMakeFiles/unbound.dir/util/config_file.c.o
[ 10%] Building C object external/unbound/CMakeFiles/unbound.dir/util/configlexer.c.o
[ 11%] Building C object external/unbound/CMakeFiles/unbound.dir/util/configparser.c.o
[ 11%] Building C object external/unbound/CMakeFiles/unbound.dir/util/fptr_wlist.c.o
[ 12%] Building C object external/unbound/CMakeFiles/unbound.dir/util/locks.c.o
[ 12%] Building C object external/unbound/CMakeFiles/unbound.dir/util/log.c.o
[ 13%] Building C object external/unbound/CMakeFiles/unbound.dir/util/mini_event.c.o
[ 13%] Building C object external/unbound/CMakeFiles/unbound.dir/util/module.c.o
[ 13%] Building C object external/unbound/CMakeFiles/unbound.dir/util/netevent.c.o
[ 14%] Building C object external/unbound/CMakeFiles/unbound.dir/util/net_help.c.o
[ 14%] Building C object external/unbound/CMakeFiles/unbound.dir/util/random.c.o
[ 15%] Building C object external/unbound/CMakeFiles/unbound.dir/util/rbtree.c.o
[ 15%] Building C object external/unbound/CMakeFiles/unbound.dir/util/regional.c.o
[ 15%] Building C object external/unbound/CMakeFiles/unbound.dir/util/rtt.c.o
[ 16%] Building C object external/unbound/CMakeFiles/unbound.dir/util/storage/dnstree.c.o
[ 16%] Building C object external/unbound/CMakeFiles/unbound.dir/util/storage/lookup3.c.o
[ 17%] Building C object external/unbound/CMakeFiles/unbound.dir/util/storage/lruhash.c.o
[ 17%] Building C object external/unbound/CMakeFiles/unbound.dir/util/storage/slabhash.c.o
[ 17%] Building C object external/unbound/CMakeFiles/unbound.dir/util/timehist.c.o
[ 18%] Building C object external/unbound/CMakeFiles/unbound.dir/util/tube.c.o
[ 18%] Building C object external/unbound/CMakeFiles/unbound.dir/util/winsock_event.c.o
[ 19%] Building C object external/unbound/CMakeFiles/unbound.dir/validator/autotrust.c.o
[ 19%] Building C object external/unbound/CMakeFiles/unbound.dir/validator/val_anchor.c.o
[ 19%] Building C object external/unbound/CMakeFiles/unbound.dir/validator/validator.c.o
[ 20%] Building C object external/unbound/CMakeFiles/unbound.dir/validator/val_kcache.c.o
[ 20%] Building C object external/unbound/CMakeFiles/unbound.dir/validator/val_kentry.c.o
[ 21%] Building C object external/unbound/CMakeFiles/unbound.dir/validator/val_neg.c.o
[ 21%] Building C object external/unbound/CMakeFiles/unbound.dir/validator/val_nsec3.c.o
[ 22%] Building C object external/unbound/CMakeFiles/unbound.dir/validator/val_nsec.c.o
[ 22%] Building C object external/unbound/CMakeFiles/unbound.dir/validator/val_secalgo.c.o
[ 22%] Building C object external/unbound/CMakeFiles/unbound.dir/validator/val_sigcrypt.c.o
[ 23%] Building C object external/unbound/CMakeFiles/unbound.dir/validator/val_utils.c.o
[ 23%] Building C object external/unbound/CMakeFiles/unbound.dir/dns64/dns64.c.o
[ 24%] Building C object external/unbound/CMakeFiles/unbound.dir/testcode/checklocks.c.o
[ 24%] Building C object external/unbound/CMakeFiles/unbound.dir/sldns/keyraw.c.o
[ 24%] Building C object external/unbound/CMakeFiles/unbound.dir/sldns/sbuffer.c.o
[ 25%] Building C object external/unbound/CMakeFiles/unbound.dir/sldns/wire2str.c.o
[ 25%] Building C object external/unbound/CMakeFiles/unbound.dir/sldns/parse.c.o
[ 26%] Building C object external/unbound/CMakeFiles/unbound.dir/sldns/parseutil.c.o
[ 26%] Building C object external/unbound/CMakeFiles/unbound.dir/sldns/rrdef.c.o
[ 26%] Building C object external/unbound/CMakeFiles/unbound.dir/sldns/str2wire.c.o
[ 27%] Building C object external/unbound/CMakeFiles/unbound.dir/compat/explicit_bzero.c.o
[ 27%] Building C object external/unbound/CMakeFiles/unbound.dir/compat/reallocarray.c.o
[ 28%] Building C object external/unbound/CMakeFiles/unbound.dir/compat/getentropy_osx.c.o
[ 28%] Building C object external/unbound/CMakeFiles/unbound.dir/libunbound/context.c.o
[ 28%] Building C object external/unbound/CMakeFiles/unbound.dir/libunbound/libunbound.c.o
[ 29%] Building C object external/unbound/CMakeFiles/unbound.dir/libunbound/libworker.c.o
[ 29%] Linking C shared library libunbound.dylib
[ 29%] Built target unbound
Scanning dependencies of target lmdb
[ 29%] Building C object external/db_drivers/liblmdb/CMakeFiles/lmdb.dir/mdb.c.o
/Users/buildbot/slave/monero-tests-osx-10_11/build/external/db_drivers/liblmdb/mdb.c:10712:46: warning: data argument not used by format string [-Wformat-extra-args]
                                (int)mr[i].mr_pid, (size_t)mr[i].mr_tid, txnid);
                                ~~~~~~~~~~~~~~~~~~~~~~~~~~~~~~~~~~~~~~~~~^~~~~~
/usr/include/secure/_stdio.h:47:56: note: expanded from macro 'sprintf'
  __builtin___sprintf_chk (str, 0, __darwin_obsz(str), __VA_ARGS__)
                                                       ^~~~~~~~~~~
1 warning generated.
[ 30%] Building C object external/db_drivers/liblmdb/CMakeFiles/lmdb.dir/midl.c.o
[ 30%] Linking C shared library liblmdb.dylib
[ 30%] Built target lmdb
Scanning dependencies of target otshell_utils
[ 30%] Building CXX object contrib/otshell_utils/CMakeFiles/otshell_utils.dir/ccolor.cpp.o
[ 30%] Building CXX object contrib/otshell_utils/CMakeFiles/otshell_utils.dir/runoptions.cpp.o
[ 31%] Building CXX object contrib/otshell_utils/CMakeFiles/otshell_utils.dir/utils.cpp.o
[ 31%] Building CXX object contrib/otshell_utils/CMakeFiles/otshell_utils.dir/windows_stream.cpp.o
[ 32%] Linking CXX shared library libotshell_utils.dylib
Undefined symbols for architecture x86_64:
  "boost::system::system_category()", referenced from:
      ___cxx_global_var_init.2 in runoptions.cpp.o
      boost::thread_exception::thread_exception(int, char const*) in utils.cpp.o
      ___cxx_global_var_init.2 in utils.cpp.o
  "boost::system::generic_category()", referenced from:
      ___cxx_global_var_init in runoptions.cpp.o
      ___cxx_global_var_init.1 in runoptions.cpp.o
      ___cxx_global_var_init in utils.cpp.o
      ___cxx_global_var_init.1 in utils.cpp.o
ld: symbol(s) not found for architecture x86_64
clang: error: linker command failed with exit code 1 (use -v to see invocation)
make[3]: *** [contrib/otshell_utils/libotshell_utils.dylib] Error 1
make[2]: *** [contrib/otshell_utils/CMakeFiles/otshell_utils.dir/all] Error 2
make[1]: *** [all] Error 2
make: *** [debug-test] Error 2
program finished with exit code 2
elapsedTime=25.812625