(view as text)
make release-test
 in dir /Users/buildbot/slave/monero-tests-osx-10_11/build
 watching logfiles {'LastTest.log': 'build/debug/Testing/Temporary/LastTest.log', 'coretests.log': 'build/debug/tests/core_tests/coretests.log', 'CTestCostData.txt': 'build/debug/Testing/Temporary/CTestCostData.txt'}
 argv: ['make', 'release-test']
 environment:
  HOME=/Users/buildbot
  PATH=/usr/local/bin:/usr/bin:/bin:/usr/sbin:/sbin
  PWD=/Users/buildbot/slave/monero-tests-osx-10_11/build
  SHELL=/bin/bash
  SHLVL=1
  TERM=xterm
  USER=buildbot
  VERSIONER_PYTHON_PREFER_32_BIT=no
  VERSIONER_PYTHON_VERSION=2.7
  _=/usr/local/bin/buildslave
  __CF_USER_TEXT_ENCODING=0x1F6:0:0
 using PTY: False
mkdir -p build/release
cd build/release && cmake -D BUILD_TESTS=ON -D CMAKE_BUILD_TYPE=release ../.. && /Applications/Xcode.app/Contents/Developer/usr/bin/make && /Applications/Xcode.app/Contents/Developer/usr/bin/make test
-- Could not find DEVELOPER_LOCAL_TOOLS in env (not required)
-- BOOST_IGNORE_SYSTEM_PATHS defaults to OFF
-- Could not find DEVELOPER_LIBUNBOUND_OLD in env (not required)
-- Building for a 64-bit system
-- Building internal libraries as static
-- Could not find DATABASE in env (not required unless you want to change database type from default: lmdb)
-- Using LMDB as default DB type
-- Could not find libunwind (missing:  LIBUNWIND_LIBRARIES) 
-- Stack trace on exception disabled
-- Detecting version of miniupnpc in path: /usr/local/include/miniupnpc
-- Found miniupnpc version is v1.7 or higher
-- Using miniupnpc from local source tree for static build
-- Looking for libunbound
-- Using OpenSSL found at /usr/local/opt/openssl
-- Using 64-bit LMDB from source tree
-- Building on x86_64 for x86-64
-- AES support enabled
-- Found Boost Version: 106100
-- Found Git: /usr/bin/git
-- Could NOT find GTest (missing:  GTEST_LIBRARY GTEST_INCLUDE_DIR GTEST_MAIN_LIBRARY) 
-- GTest not found on the system: will use GTest bundled with this source
-- Configuring done
-- Generating done
-- Build files have been written to: /Users/buildbot/slave/monero-tests-osx-10_11/build/build/release
[  0%] Built target version
[  5%] Built target libminiupnpc-static
[ 31%] Built target unbound
[ 32%] Built target lmdb
[ 33%] Built target epee
[ 35%] Built target otshell_utils
[ 42%] Built target obj_crypto
[ 42%] Built target crypto
[ 44%] Built target obj_common
[ 45%] Built target common
[ 46%] Built target obj_ringct
[ 46%] Built target ringct
[ 47%] Built target blocks
[ 51%] Built target obj_cryptonote_core
[ 52%] Built target obj_blockchain_db
[ 52%] Built target blockchain_db
[ 52%] Built target cryptonote_core
[ 52%] Built target obj_mnemonics
[ 52%] Built target mnemonics
[ 53%] Built target obj_rpc
[ 53%] Built target obj_cryptonote_protocol
[ 54%] Built target cryptonote_protocol
[ 55%] Built target rpc
[ 58%] Built target obj_wallet
[ 60%] Built target obj_p2p
[ 60%] Built target p2p
[ 61%] Built target wallet
[ 62%] Built target wallet_rpc_server
[ 63%] Built target simplewallet
[ 64%] Built target obj_daemonizer
[ 65%] Built target daemonizer
[ 67%] Built target daemon
[ 67%] Built target cn_deserialize
[ 68%] Built target blockchain_export
[ 70%] Built target blockchain_import
[ 70%] Built target hash-target-tests
[ 71%] Built target gtest
[ 72%] Built target gtest_main
[ 78%] Built target coretests
[ 81%] Built target crypto-tests
[ 82%] Built target functional_tests
[ 83%] Built target performance_tests
[ 83%] Built target core_proxy
[ 95%] Built target unit_tests
[ 96%] Built target difficulty-tests
[ 97%] Built target hash-tests
[ 98%] Built target net_load_tests_srv
[ 99%] Built target net_load_tests_clt
[100%] Built target libwallet_api_tests
Running tests...
Test project /Users/buildbot/slave/monero-tests-osx-10_11/build/build/release
      Start  1: hash-target
 1/13 Test  #1: hash-target ......................   Passed    0.05 sec
      Start  2: coretests
 2/13 Test  #2: coretests ........................   Passed  2632.30 sec
      Start  3: crypto
 3/13 Test  #3: crypto ...........................   Passed   10.75 sec
      Start  4: unit_tests
 4/13 Test  #4: unit_tests .......................***Failed   11.68 sec
      Start  5: difficulty
 5/13 Test  #5: difficulty .......................   Passed    0.08 sec
      Start  6: hash-fast
 6/13 Test  #6: hash-fast ........................   Passed    0.03 sec
      Start  7: hash-slow
 7/13 Test  #7: hash-slow ........................   Passed    0.08 sec
      Start  8: hash-tree
 8/13 Test  #8: hash-tree ........................   Passed    0.00 sec
      Start  9: hash-extra-blake
 9/13 Test  #9: hash-extra-blake .................   Passed    0.04 sec
      Start 10: hash-extra-groestl
10/13 Test #10: hash-extra-groestl ...............   Passed    0.01 sec
      Start 11: hash-extra-jh
11/13 Test #11: hash-extra-jh ....................   Passed    0.01 sec
      Start 12: hash-extra-skein
12/13 Test #12: hash-extra-skein .................   Passed    0.01 sec
      Start 13: libwallet_api_tests
13/13 Test #13: libwallet_api_tests ..............***Exception: SegFault242.83 sec

85% tests passed, 2 tests failed out of 13

Total Test time (real) = 2898.04 sec

The following tests FAILED:
	  4 - unit_tests (Failed)
	 13 - libwallet_api_tests (SEGFAULT)
Errors while running CTest
make[1]: *** [test] Error 8
make: *** [release-test] Error 2
program finished with exit code 2
elapsedTime=2907.766441