(view as text)
make debug-test
 in dir /Users/buildbot/slave/monero-tests-osx-10_11/build
 watching logfiles {'LastTest.log': 'build/debug/Testing/Temporary/LastTest.log', 'coretests.log': 'build/debug/tests/core_tests/coretests.log', 'CTestCostData.txt': 'build/debug/Testing/Temporary/CTestCostData.txt'}
 argv: ['make', 'debug-test']
 environment:
  HOME=/Users/buildbot
  LIBRARY_PATH=/usr/local/opt/openssl/lib:
  PATH=/usr/local/opt/qt5/bin:/usr/local/bin:/usr/bin:/bin:/usr/sbin:/sbin
  PWD=/Users/buildbot/slave/monero-tests-osx-10_11/build
  SHELL=/bin/bash
  SHLVL=1
  TERM=xterm
  USER=buildbot
  VERSIONER_PYTHON_PREFER_32_BIT=no
  VERSIONER_PYTHON_VERSION=2.7
  _=/usr/local/bin/buildslave
  __CF_USER_TEXT_ENCODING=0x1F6:0:0
 using PTY: False
mkdir -p build/debug
cd build/debug && cmake -D BUILD_TESTS=ON -D CMAKE_BUILD_TYPE=Debug ../.. && /Applications/Xcode.app/Contents/Developer/usr/bin/make && /Applications/Xcode.app/Contents/Developer/usr/bin/make test
-- Could not find DEVELOPER_LOCAL_TOOLS in env (not required)
-- BOOST_IGNORE_SYSTEM_PATHS defaults to OFF
-- Could not find DEVELOPER_LIBUNBOUND_OLD in env (not required)
-- Building for a 64-bit system
-- Building internal libraries as shared
-- Could not find DATABASE in env (not required unless you want to change database type from default: lmdb)
-- Using LMDB as default DB type
-- Could not find libunwind (missing:  LIBUNWIND_LIBRARIES) 
-- Stack trace on exception disabled
-- Detecting version of miniupnpc in path: /usr/local/include/miniupnpc
-- Found miniupnpc version is v1.7 or higher
-- Using shared miniupnpc found at /usr/local/include/miniupnpc
-- Looking for libunbound
-- Using OpenSSL found at /usr/local/opt/openssl
-- Using 64-bit LMDB from source tree
-- Building on x86_64 for native
-- AES support enabled
-- Found Boost Version: 106100
-- Found Git: /usr/bin/git
-- Could NOT find GTest (missing:  GTEST_LIBRARY GTEST_INCLUDE_DIR GTEST_MAIN_LIBRARY) 
-- GTest not found on the system: will use GTest bundled with this source
-- Configuring done
CMake Warning (dev):
  Policy CMP0042 is not set: MACOSX_RPATH is enabled by default.  Run "cmake
  --help-policy CMP0042" for policy details.  Use the cmake_policy command to
  set the policy and suppress this warning.

  MACOSX_RPATH is not specified for the following targets:

   blockchain_db
   common
   crypto
   cryptonote_core
   cryptonote_protocol
   daemonizer
   gtest
   gtest_main
   lmdb
   mnemonics
   otshell_utils
   p2p
   ringct
   rpc
   unbound
   wallet

This warning is for project developers.  Use -Wno-dev to suppress it.

-- Generating done
-- Build files have been written to: /Users/buildbot/slave/monero-tests-osx-10_11/build/build/debug
[  0%] Built target version
[ 28%] Built target unbound
[ 29%] Built target lmdb
[ 29%] Linking CXX shared library libotshell_utils.dylib
Undefined symbols for architecture x86_64:
  "boost::system::system_category()", referenced from:
      ___cxx_global_var_init.2 in runoptions.cpp.o
      boost::thread_exception::thread_exception(int, char const*) in utils.cpp.o
      ___cxx_global_var_init.2 in utils.cpp.o
  "boost::system::generic_category()", referenced from:
      ___cxx_global_var_init in runoptions.cpp.o
      ___cxx_global_var_init.1 in runoptions.cpp.o
      ___cxx_global_var_init in utils.cpp.o
      ___cxx_global_var_init.1 in utils.cpp.o
ld: symbol(s) not found for architecture x86_64
clang: error: linker command failed with exit code 1 (use -v to see invocation)
make[3]: *** [contrib/otshell_utils/libotshell_utils.dylib] Error 1
make[2]: *** [contrib/otshell_utils/CMakeFiles/otshell_utils.dir/all] Error 2
make[1]: *** [all] Error 2
make: *** [debug-test] Error 2
program finished with exit code 2
elapsedTime=3.010035