(view as text)
make debug
 in dir /opt/buildbot/builder/monero-tests-debian-armv8/build (timeout 1200 secs)
 watching logfiles {}
 argv: ['make', 'debug']
 environment:
  HOME=/opt/buildbot
  JAVA_TOOL_OPTIONS=-Dgnu.io.rxtx.SerialPorts=/dev/tty96B0
  LANG=en_US.UTF-8
  LOGNAME=buildbot
  MAIL=/var/mail/buildbot
  MONITOR_PORT=/dev/tty96B0
  PATH=/usr/local/bin:/usr/bin:/bin:/usr/local/games:/usr/games
  PWD=/opt/buildbot/builder/monero-tests-debian-armv8/build
  SHELL=/bin/bash
  SHLVL=1
  TERM=xterm-256color
  USER=buildbot
  _=/usr/local/bin/buildslave
 using PTY: False
mkdir -p build/"Linux/master"/debug
cd build/"Linux/master"/debug && cmake -D CMAKE_BUILD_TYPE=Debug ../../../..
-- CMake version 3.7.2
-- The C compiler identification is unknown
-- The CXX compiler identification is unknown
-- Check for working C compiler: /usr/bin/cc
-- Check for working C compiler: /usr/bin/cc -- broken
CMake Error at /usr/share/cmake-3.7/Modules/CMakeTestCCompiler.cmake:51 (message):
  The C compiler "/usr/bin/cc" is not able to compile a simple test program.

  It fails with the following output:

   Change Dir: /opt/buildbot/builder/monero-tests-debian-armv8/build/build/Linux/master/debug/CMakeFiles/CMakeTmp

  

  Run Build Command:"/usr/bin/make" "cmTC_8f07b/fast"

  make[1]: Entering directory
  '/opt/buildbot/builder/monero-tests-debian-armv8/build/build/Linux/master/debug/CMakeFiles/CMakeTmp'


  /usr/bin/make -f CMakeFiles/cmTC_8f07b.dir/build.make
  CMakeFiles/cmTC_8f07b.dir/build

  make[2]: Entering directory
  '/opt/buildbot/builder/monero-tests-debian-armv8/build/build/Linux/master/debug/CMakeFiles/CMakeTmp'


  Building C object CMakeFiles/cmTC_8f07b.dir/testCCompiler.c.o

  /usr/bin/cc -o CMakeFiles/cmTC_8f07b.dir/testCCompiler.c.o -c
  /opt/buildbot/builder/monero-tests-debian-armv8/build/build/Linux/master/debug/CMakeFiles/CMakeTmp/testCCompiler.c


  
  /opt/buildbot/builder/monero-tests-debian-armv8/build/build/Linux/master/debug/CMakeFiles/CMakeTmp/testCCompiler.c:11:1:
  fatal error: error closing /tmp/ccKNlFHR.s: No space left on device

   { (void)argv; return argc-1;}
   ^

  compilation terminated.

  CMakeFiles/cmTC_8f07b.dir/build.make:65: recipe for target
  'CMakeFiles/cmTC_8f07b.dir/testCCompiler.c.o' failed

  make[2]: *** [CMakeFiles/cmTC_8f07b.dir/testCCompiler.c.o] Error 1

  make[2]: Leaving directory
  '/opt/buildbot/builder/monero-tests-debian-armv8/build/build/Linux/master/debug/CMakeFiles/CMakeTmp'


  Makefile:126: recipe for target 'cmTC_8f07b/fast' failed

  make[1]: *** [cmTC_8f07b/fast] Error 2

  make[1]: Leaving directory
  '/opt/buildbot/builder/monero-tests-debian-armv8/build/build/Linux/master/debug/CMakeFiles/CMakeTmp'


  

  

  CMake will not be able to correctly generate this project.
Call Stack (most recent call first):
  CMakeLists.txt:45 (project)


-- Configuring incomplete, errors occurred!
See also "/opt/buildbot/builder/monero-tests-debian-armv8/build/build/Linux/master/debug/CMakeFiles/CMakeOutput.log".
See also "/opt/buildbot/builder/monero-tests-debian-armv8/build/build/Linux/master/debug/CMakeFiles/CMakeError.log".
Makefile:54: recipe for target 'cmake-debug' failed
make: *** [cmake-debug] Error 1
program finished with exit code 2
elapsedTime=1.158370