(view as text)
make debug-test
 in dir /mnt/buildbot/buildbot/slave/monero-tests-debian-armv8/build
 watching logfiles {'LastTest.log': 'build/debug/Testing/Temporary/LastTest.log', 'coretests.log': 'build/debug/tests/core_tests/coretests.log', 'CTestCostData.txt': 'build/debug/Testing/Temporary/CTestCostData.txt'}
 argv: ['make', 'debug-test']
 environment:
  HOME=/mnt/buildbot/buildbot
  JAVA_TOOL_OPTIONS=-Dgnu.io.rxtx.SerialPorts=/dev/tty96B0
  LANG=C.UTF-8
  LOGNAME=buildbot
  LS_COLORS=rs=0:di=01;34:ln=01;36:mh=00:pi=40;33:so=01;35:do=01;35:bd=40;33;01:cd=40;33;01:or=40;31;01:mi=00:su=37;41:sg=30;43:ca=30;41:tw=30;42:ow=34;42:st=37;44:ex=01;32:*.tar=01;31:*.tgz=01;31:*.arc=01;31:*.arj=01;31:*.taz=01;31:*.lha=01;31:*.lz4=01;31:*.lzh=01;31:*.lzma=01;31:*.tlz=01;31:*.txz=01;31:*.tzo=01;31:*.t7z=01;31:*.zip=01;31:*.z=01;31:*.Z=01;31:*.dz=01;31:*.gz=01;31:*.lrz=01;31:*.lz=01;31:*.lzo=01;31:*.xz=01;31:*.zst=01;31:*.tzst=01;31:*.bz2=01;31:*.bz=01;31:*.tbz=01;31:*.tbz2=01;31:*.tz=01;31:*.deb=01;31:*.rpm=01;31:*.jar=01;31:*.war=01;31:*.ear=01;31:*.sar=01;31:*.rar=01;31:*.alz=01;31:*.ace=01;31:*.zoo=01;31:*.cpio=01;31:*.7z=01;31:*.rz=01;31:*.cab=01;31:*.jpg=01;35:*.jpeg=01;35:*.mjpg=01;35:*.mjpeg=01;35:*.gif=01;35:*.bmp=01;35:*.pbm=01;35:*.pgm=01;35:*.ppm=01;35:*.tga=01;35:*.xbm=01;35:*.xpm=01;35:*.tif=01;35:*.tiff=01;35:*.png=01;35:*.svg=01;35:*.svgz=01;35:*.mng=01;35:*.pcx=01;35:*.mov=01;35:*.mpg=01;35:*.mpeg=01;35:*.m2v=01;35:*.mkv=01;35:*.webm=01;35:*.ogm=01;35:*.mp4=01;35:*.m4v=01;35:*.mp4v=01;35:*.vob=01;35:*.qt=01;35:*.nuv=01;35:*.wmv=01;35:*.asf=01;35:*.rm=01;35:*.rmvb=01;35:*.flc=01;35:*.avi=01;35:*.fli=01;35:*.flv=01;35:*.gl=01;35:*.dl=01;35:*.xcf=01;35:*.xwd=01;35:*.yuv=01;35:*.cgm=01;35:*.emf=01;35:*.ogv=01;35:*.ogx=01;35:*.aac=00;36:*.au=00;36:*.flac=00;36:*.m4a=00;36:*.mid=00;36:*.midi=00;36:*.mka=00;36:*.mp3=00;36:*.mpc=00;36:*.ogg=00;36:*.ra=00;36:*.wav=00;36:*.oga=00;36:*.opus=00;36:*.spx=00;36:*.xspf=00;36:
  MAIL=/var/mail/buildbot
  MONITOR_PORT=/dev/tty96B0
  OLDPWD=/mnt/buildbot/buildbot/slave
  PATH=/usr/local/bin:/usr/bin:/bin:/usr/local/games:/usr/games
  PWD=/mnt/buildbot/buildbot/slave/monero-tests-debian-armv8/build
  SHELL=/bin/bash
  SHLVL=1
  TERM=xterm
  USER=buildbot
  _=/usr/local/bin/buildslave
 using PTY: False
mkdir -p build/debug
cd build/debug && cmake -D BUILD_TESTS=ON -D CMAKE_BUILD_TYPE=Debug ../.. && make && make test
-- Building without build tag
-- Could not find DEVELOPER_LOCAL_TOOLS in env (not required)
-- BOOST_IGNORE_SYSTEM_PATHS defaults to OFF
-- Could not find DEVELOPER_LIBUNBOUND_OLD in env (not required)
-- Building for a 64-bit system
-- Building internal libraries with position independent code
-- Could not find DATABASE in env (not required unless you want to change database type from default: lmdb)
-- Using LMDB as default DB type
-- Stack trace on exception enabled
-- Found miniupnpc API version 10
-- Using shared miniupnpc found at /usr/include/miniupnpc
-- Looking for libunbound
-- Using 64-bit LMDB from source tree
-- Building on aarch64 for armv8-a
-- Crypto extensions unavailable on your ARMv8 device
-- Setting FPU Flags for ARM Processors
-- Enabling Cortex-A53 workaround 835769
-- Enabling Cortex-A53 workaround 843419
-- Found Boost Version: 106200
-- Could NOT find Readline (missing:  Readline_INCLUDE_DIR Readline_LIBRARY) 
-- Could not find GNU readline library so building without readline support
-- Found Git: /usr/bin/git
-- Could NOT find GTest (missing:  GTEST_LIBRARY GTEST_INCLUDE_DIR GTEST_MAIN_LIBRARY) 
-- GTest not found on the system: will use GTest bundled with this source
Doxygen: graphviz not found - graphs disabled
-- Configuring done
-- Generating done
-- Build files have been written to: /mnt/buildbot/buildbot/slave/monero-tests-debian-armv8/build/build/debug
make[1]: Entering directory '/mnt/buildbot/buildbot/slave/monero-tests-debian-armv8/build/build/debug'
make[2]: Entering directory '/mnt/buildbot/buildbot/slave/monero-tests-debian-armv8/build/build/debug'
make[3]: Entering directory '/mnt/buildbot/buildbot/slave/monero-tests-debian-armv8/build/build/debug'
make[3]: Leaving directory '/mnt/buildbot/buildbot/slave/monero-tests-debian-armv8/build/build/debug'
[  1%] Built target version
make[3]: Entering directory '/mnt/buildbot/buildbot/slave/monero-tests-debian-armv8/build/build/debug'
make[3]: Leaving directory '/mnt/buildbot/buildbot/slave/monero-tests-debian-armv8/build/build/debug'
[ 28%] Built target unbound
make[3]: Entering directory '/mnt/buildbot/buildbot/slave/monero-tests-debian-armv8/build/build/debug'
make[3]: Leaving directory '/mnt/buildbot/buildbot/slave/monero-tests-debian-armv8/build/build/debug'
[ 28%] Built target lmdb
make[3]: Entering directory '/mnt/buildbot/buildbot/slave/monero-tests-debian-armv8/build/build/debug'
make[3]: Leaving directory '/mnt/buildbot/buildbot/slave/monero-tests-debian-armv8/build/build/debug'
[ 29%] Built target easylogging
make[3]: Entering directory '/mnt/buildbot/buildbot/slave/monero-tests-debian-armv8/build/build/debug'
make[3]: Leaving directory '/mnt/buildbot/buildbot/slave/monero-tests-debian-armv8/build/build/debug'
make[3]: Entering directory '/mnt/buildbot/buildbot/slave/monero-tests-debian-armv8/build/build/debug'
[ 29%] Building C object src/crypto/CMakeFiles/obj_cncrypto.dir/aesb.c.o
[ 29%] Building C object src/crypto/CMakeFiles/obj_cncrypto.dir/blake256.c.o
[ 30%] Building C object src/crypto/CMakeFiles/obj_cncrypto.dir/chacha8.c.o
[ 30%] Building C object src/crypto/CMakeFiles/obj_cncrypto.dir/crypto-ops-data.c.o
[ 30%] Building C object src/crypto/CMakeFiles/obj_cncrypto.dir/crypto-ops.c.o
[ 31%] Building CXX object src/crypto/CMakeFiles/obj_cncrypto.dir/crypto.cpp.o
[ 31%] Building C object src/crypto/CMakeFiles/obj_cncrypto.dir/groestl.c.o
[ 31%] Building C object src/crypto/CMakeFiles/obj_cncrypto.dir/hash-extra-blake.c.o
[ 32%] Building C object src/crypto/CMakeFiles/obj_cncrypto.dir/hash-extra-groestl.c.o
[ 32%] Building C object src/crypto/CMakeFiles/obj_cncrypto.dir/hash-extra-jh.c.o
[ 32%] Building C object src/crypto/CMakeFiles/obj_cncrypto.dir/hash-extra-skein.c.o
[ 33%] Building C object src/crypto/CMakeFiles/obj_cncrypto.dir/hash.c.o
[ 33%] Building C object src/crypto/CMakeFiles/obj_cncrypto.dir/jh.c.o
[ 33%] Building C object src/crypto/CMakeFiles/obj_cncrypto.dir/keccak.c.o
[ 34%] Building C object src/crypto/CMakeFiles/obj_cncrypto.dir/oaes_lib.c.o
[ 34%] Building C object src/crypto/CMakeFiles/obj_cncrypto.dir/random.c.o
[ 34%] Building C object src/crypto/CMakeFiles/obj_cncrypto.dir/skein.c.o
[ 35%] Building C object src/crypto/CMakeFiles/obj_cncrypto.dir/slow-hash.c.o
[ 35%] Building C object src/crypto/CMakeFiles/obj_cncrypto.dir/tree-hash.c.o
make[3]: Leaving directory '/mnt/buildbot/buildbot/slave/monero-tests-debian-armv8/build/build/debug'
[ 35%] Built target obj_cncrypto
make[3]: Entering directory '/mnt/buildbot/buildbot/slave/monero-tests-debian-armv8/build/build/debug'
make[3]: Leaving directory '/mnt/buildbot/buildbot/slave/monero-tests-debian-armv8/build/build/debug'
make[3]: Entering directory '/mnt/buildbot/buildbot/slave/monero-tests-debian-armv8/build/build/debug'
[ 35%] Linking CXX shared library libcncrypto.so
make[3]: Leaving directory '/mnt/buildbot/buildbot/slave/monero-tests-debian-armv8/build/build/debug'
[ 35%] Built target cncrypto
make[3]: Entering directory '/mnt/buildbot/buildbot/slave/monero-tests-debian-armv8/build/build/debug'
make[3]: Leaving directory '/mnt/buildbot/buildbot/slave/monero-tests-debian-armv8/build/build/debug'
make[3]: Entering directory '/mnt/buildbot/buildbot/slave/monero-tests-debian-armv8/build/build/debug'
[ 35%] Building CXX object contrib/epee/src/CMakeFiles/epee.dir/hex.cpp.o
[ 36%] Building CXX object contrib/epee/src/CMakeFiles/epee.dir/http_auth.cpp.o
[ 36%] Building CXX object contrib/epee/src/CMakeFiles/epee.dir/mlog.cpp.o
[ 36%] Building CXX object contrib/epee/src/CMakeFiles/epee.dir/string_tools.cpp.o
[ 37%] Linking CXX static library libepee.a
make[3]: Leaving directory '/mnt/buildbot/buildbot/slave/monero-tests-debian-armv8/build/build/debug'
[ 37%] Built target epee
make[3]: Entering directory '/mnt/buildbot/buildbot/slave/monero-tests-debian-armv8/build/build/debug'
make[3]: Leaving directory '/mnt/buildbot/buildbot/slave/monero-tests-debian-armv8/build/build/debug'
make[3]: Entering directory '/mnt/buildbot/buildbot/slave/monero-tests-debian-armv8/build/build/debug'
[ 37%] Building CXX object src/common/CMakeFiles/obj_common.dir/base58.cpp.o
[ 38%] Building CXX object src/common/CMakeFiles/obj_common.dir/command_line.cpp.o
[ 38%] Building CXX object src/common/CMakeFiles/obj_common.dir/dns_utils.cpp.o
[ 38%] Building CXX object src/common/CMakeFiles/obj_common.dir/download.cpp.o
/mnt/buildbot/buildbot/slave/monero-tests-debian-armv8/build/src/common/download.cpp: In member function ‘virtual bool tools::download_thread(tools::download_async_handle)::download_client::on_header(const epee::net_utils::http::http_response_info&)’:
/mnt/buildbot/buildbot/slave/monero-tests-debian-armv8/build/src/common/download.cpp:97:28: warning: ‘length’ may be used uninitialized in this function [-Wmaybe-uninitialized]
             content_length = length;
             ~~~~~~~~~~~~~~~^~~~~~~~
[ 38%] Building CXX object src/common/CMakeFiles/obj_common.dir/util.cpp.o
[ 39%] Building CXX object src/common/CMakeFiles/obj_common.dir/i18n.cpp.o
[ 39%] Building CXX object src/common/CMakeFiles/obj_common.dir/password.cpp.o
[ 39%] Building CXX object src/common/CMakeFiles/obj_common.dir/perf_timer.cpp.o
[ 40%] Building CXX object src/common/CMakeFiles/obj_common.dir/threadpool.cpp.o
[ 40%] Building CXX object src/common/CMakeFiles/obj_common.dir/updates.cpp.o
[ 40%] Building CXX object src/common/CMakeFiles/obj_common.dir/stack_trace.cpp.o
make[3]: Leaving directory '/mnt/buildbot/buildbot/slave/monero-tests-debian-armv8/build/build/debug'
[ 40%] Built target obj_common
make[3]: Entering directory '/mnt/buildbot/buildbot/slave/monero-tests-debian-armv8/build/build/debug'
make[3]: Leaving directory '/mnt/buildbot/buildbot/slave/monero-tests-debian-armv8/build/build/debug'
make[3]: Entering directory '/mnt/buildbot/buildbot/slave/monero-tests-debian-armv8/build/build/debug'
[ 40%] Linking CXX shared library libcommon.so
make[3]: Leaving directory '/mnt/buildbot/buildbot/slave/monero-tests-debian-armv8/build/build/debug'
[ 40%] Built target common
make[3]: Entering directory '/mnt/buildbot/buildbot/slave/monero-tests-debian-armv8/build/build/debug'
make[3]: Leaving directory '/mnt/buildbot/buildbot/slave/monero-tests-debian-armv8/build/build/debug'
make[3]: Entering directory '/mnt/buildbot/buildbot/slave/monero-tests-debian-armv8/build/build/debug'
[ 40%] Building CXX object src/ringct/CMakeFiles/obj_ringct.dir/rctOps.cpp.o
[ 40%] Building CXX object src/ringct/CMakeFiles/obj_ringct.dir/rctSigs.cpp.o
[ 40%] Building CXX object src/ringct/CMakeFiles/obj_ringct.dir/rctTypes.cpp.o
[ 41%] Building C object src/ringct/CMakeFiles/obj_ringct.dir/rctCryptoOps.c.o
make[3]: Leaving directory '/mnt/buildbot/buildbot/slave/monero-tests-debian-armv8/build/build/debug'
[ 41%] Built target obj_ringct
make[3]: Entering directory '/mnt/buildbot/buildbot/slave/monero-tests-debian-armv8/build/build/debug'
make[3]: Leaving directory '/mnt/buildbot/buildbot/slave/monero-tests-debian-armv8/build/build/debug'
make[3]: Entering directory '/mnt/buildbot/buildbot/slave/monero-tests-debian-armv8/build/build/debug'
[ 42%] Building CXX object src/cryptonote_basic/CMakeFiles/obj_cryptonote_basic.dir/account.cpp.o
[ 42%] Building CXX object src/cryptonote_basic/CMakeFiles/obj_cryptonote_basic.dir/checkpoints.cpp.o
[ 42%] Building CXX object src/cryptonote_basic/CMakeFiles/obj_cryptonote_basic.dir/cryptonote_basic_impl.cpp.o
[ 43%] Building CXX object src/cryptonote_basic/CMakeFiles/obj_cryptonote_basic.dir/cryptonote_format_utils.cpp.o
[ 43%] Building CXX object src/cryptonote_basic/CMakeFiles/obj_cryptonote_basic.dir/difficulty.cpp.o
[ 43%] Building CXX object src/cryptonote_basic/CMakeFiles/obj_cryptonote_basic.dir/hardfork.cpp.o
[ 44%] Building CXX object src/cryptonote_basic/CMakeFiles/obj_cryptonote_basic.dir/miner.cpp.o
make[3]: Leaving directory '/mnt/buildbot/buildbot/slave/monero-tests-debian-armv8/build/build/debug'
[ 44%] Built target obj_cryptonote_basic
make[3]: Entering directory '/mnt/buildbot/buildbot/slave/monero-tests-debian-armv8/build/build/debug'
make[3]: Leaving directory '/mnt/buildbot/buildbot/slave/monero-tests-debian-armv8/build/build/debug'
make[3]: Entering directory '/mnt/buildbot/buildbot/slave/monero-tests-debian-armv8/build/build/debug'
[ 44%] Linking CXX shared library libcryptonote_basic.so
make[3]: Leaving directory '/mnt/buildbot/buildbot/slave/monero-tests-debian-armv8/build/build/debug'
[ 44%] Built target cryptonote_basic
make[3]: Entering directory '/mnt/buildbot/buildbot/slave/monero-tests-debian-armv8/build/build/debug'
make[3]: Leaving directory '/mnt/buildbot/buildbot/slave/monero-tests-debian-armv8/build/build/debug'
make[3]: Entering directory '/mnt/buildbot/buildbot/slave/monero-tests-debian-armv8/build/build/debug'
[ 44%] Linking CXX shared library libringct.so
make[3]: Leaving directory '/mnt/buildbot/buildbot/slave/monero-tests-debian-armv8/build/build/debug'
[ 44%] Built target ringct
make[3]: Entering directory '/mnt/buildbot/buildbot/slave/monero-tests-debian-armv8/build/build/debug'
make[3]: Leaving directory '/mnt/buildbot/buildbot/slave/monero-tests-debian-armv8/build/build/debug'
make[3]: Entering directory '/mnt/buildbot/buildbot/slave/monero-tests-debian-armv8/build/build/debug'
[ 45%] Building C object src/blocks/CMakeFiles/blocks.dir/blockexports.c.o
[ 45%] Linking C static library libblocks.a
make[3]: Leaving directory '/mnt/buildbot/buildbot/slave/monero-tests-debian-armv8/build/build/debug'
[ 45%] Built target blocks
make[3]: Entering directory '/mnt/buildbot/buildbot/slave/monero-tests-debian-armv8/build/build/debug'
make[3]: Leaving directory '/mnt/buildbot/buildbot/slave/monero-tests-debian-armv8/build/build/debug'
make[3]: Entering directory '/mnt/buildbot/buildbot/slave/monero-tests-debian-armv8/build/build/debug'
[ 45%] Building CXX object src/cryptonote_core/CMakeFiles/obj_cryptonote_core.dir/blockchain.cpp.o
[ 45%] Building CXX object src/cryptonote_core/CMakeFiles/obj_cryptonote_core.dir/cryptonote_core.cpp.o
[ 46%] Building CXX object src/cryptonote_core/CMakeFiles/obj_cryptonote_core.dir/tx_pool.cpp.o
[ 46%] Building CXX object src/cryptonote_core/CMakeFiles/obj_cryptonote_core.dir/cryptonote_tx_utils.cpp.o
make[3]: Leaving directory '/mnt/buildbot/buildbot/slave/monero-tests-debian-armv8/build/build/debug'
[ 46%] Built target obj_cryptonote_core
make[3]: Entering directory '/mnt/buildbot/buildbot/slave/monero-tests-debian-armv8/build/build/debug'
make[3]: Leaving directory '/mnt/buildbot/buildbot/slave/monero-tests-debian-armv8/build/build/debug'
make[3]: Entering directory '/mnt/buildbot/buildbot/slave/monero-tests-debian-armv8/build/build/debug'
[ 46%] Building CXX object src/blockchain_db/CMakeFiles/obj_blockchain_db.dir/blockchain_db.cpp.o
[ 47%] Building CXX object src/blockchain_db/CMakeFiles/obj_blockchain_db.dir/lmdb/db_lmdb.cpp.o
make[3]: Leaving directory '/mnt/buildbot/buildbot/slave/monero-tests-debian-armv8/build/build/debug'
[ 47%] Built target obj_blockchain_db
make[3]: Entering directory '/mnt/buildbot/buildbot/slave/monero-tests-debian-armv8/build/build/debug'
make[3]: Leaving directory '/mnt/buildbot/buildbot/slave/monero-tests-debian-armv8/build/build/debug'
make[3]: Entering directory '/mnt/buildbot/buildbot/slave/monero-tests-debian-armv8/build/build/debug'
[ 48%] Linking CXX shared library libblockchain_db.so
make[3]: Leaving directory '/mnt/buildbot/buildbot/slave/monero-tests-debian-armv8/build/build/debug'
[ 48%] Built target blockchain_db
make[3]: Entering directory '/mnt/buildbot/buildbot/slave/monero-tests-debian-armv8/build/build/debug'
make[3]: Leaving directory '/mnt/buildbot/buildbot/slave/monero-tests-debian-armv8/build/build/debug'
make[3]: Entering directory '/mnt/buildbot/buildbot/slave/monero-tests-debian-armv8/build/build/debug'
[ 49%] Linking CXX shared library libcryptonote_core.so
make[3]: Leaving directory '/mnt/buildbot/buildbot/slave/monero-tests-debian-armv8/build/build/debug'
[ 49%] Built target cryptonote_core
make[3]: Entering directory '/mnt/buildbot/buildbot/slave/monero-tests-debian-armv8/build/build/debug'
make[3]: Leaving directory '/mnt/buildbot/buildbot/slave/monero-tests-debian-armv8/build/build/debug'
make[3]: Entering directory '/mnt/buildbot/buildbot/slave/monero-tests-debian-armv8/build/build/debug'
[ 50%] Building CXX object src/mnemonics/CMakeFiles/obj_mnemonics.dir/electrum-words.cpp.o
make[3]: Leaving directory '/mnt/buildbot/buildbot/slave/monero-tests-debian-armv8/build/build/debug'
[ 50%] Built target obj_mnemonics
make[3]: Entering directory '/mnt/buildbot/buildbot/slave/monero-tests-debian-armv8/build/build/debug'
make[3]: Leaving directory '/mnt/buildbot/buildbot/slave/monero-tests-debian-armv8/build/build/debug'
make[3]: Entering directory '/mnt/buildbot/buildbot/slave/monero-tests-debian-armv8/build/build/debug'
[ 51%] Linking CXX shared library libmnemonics.so
make[3]: Leaving directory '/mnt/buildbot/buildbot/slave/monero-tests-debian-armv8/build/build/debug'
[ 51%] Built target mnemonics
make[3]: Entering directory '/mnt/buildbot/buildbot/slave/monero-tests-debian-armv8/build/build/debug'
make[3]: Leaving directory '/mnt/buildbot/buildbot/slave/monero-tests-debian-armv8/build/build/debug'
make[3]: Entering directory '/mnt/buildbot/buildbot/slave/monero-tests-debian-armv8/build/build/debug'
[ 51%] Building CXX object src/cryptonote_protocol/CMakeFiles/obj_cryptonote_protocol.dir/block_queue.cpp.o
[ 52%] Building CXX object src/cryptonote_protocol/CMakeFiles/obj_cryptonote_protocol.dir/cryptonote_protocol_handler-base.cpp.o
make[3]: Leaving directory '/mnt/buildbot/buildbot/slave/monero-tests-debian-armv8/build/build/debug'
[ 52%] Built target obj_cryptonote_protocol
make[3]: Entering directory '/mnt/buildbot/buildbot/slave/monero-tests-debian-armv8/build/build/debug'
make[3]: Leaving directory '/mnt/buildbot/buildbot/slave/monero-tests-debian-armv8/build/build/debug'
make[3]: Entering directory '/mnt/buildbot/buildbot/slave/monero-tests-debian-armv8/build/build/debug'
[ 52%] Building CXX object src/p2p/CMakeFiles/obj_p2p.dir/connection_basic.cpp.o
[ 52%] Building CXX object src/p2p/CMakeFiles/obj_p2p.dir/network_throttle-detail.cpp.o
[ 53%] Building CXX object src/p2p/CMakeFiles/obj_p2p.dir/network_throttle.cpp.o
make[3]: Leaving directory '/mnt/buildbot/buildbot/slave/monero-tests-debian-armv8/build/build/debug'
[ 53%] Built target obj_p2p
make[3]: Entering directory '/mnt/buildbot/buildbot/slave/monero-tests-debian-armv8/build/build/debug'
make[3]: Leaving directory '/mnt/buildbot/buildbot/slave/monero-tests-debian-armv8/build/build/debug'
make[3]: Entering directory '/mnt/buildbot/buildbot/slave/monero-tests-debian-armv8/build/build/debug'
[ 53%] Linking CXX shared library libp2p.so
make[3]: Leaving directory '/mnt/buildbot/buildbot/slave/monero-tests-debian-armv8/build/build/debug'
[ 53%] Built target p2p
make[3]: Entering directory '/mnt/buildbot/buildbot/slave/monero-tests-debian-armv8/build/build/debug'
make[3]: Leaving directory '/mnt/buildbot/buildbot/slave/monero-tests-debian-armv8/build/build/debug'
make[3]: Entering directory '/mnt/buildbot/buildbot/slave/monero-tests-debian-armv8/build/build/debug'
[ 53%] Linking CXX shared library libcryptonote_protocol.so
make[3]: Leaving directory '/mnt/buildbot/buildbot/slave/monero-tests-debian-armv8/build/build/debug'
[ 53%] Built target cryptonote_protocol
make[3]: Entering directory '/mnt/buildbot/buildbot/slave/monero-tests-debian-armv8/build/build/debug'
make[3]: Leaving directory '/mnt/buildbot/buildbot/slave/monero-tests-debian-armv8/build/build/debug'
make[3]: Entering directory '/mnt/buildbot/buildbot/slave/monero-tests-debian-armv8/build/build/debug'
[ 53%] Building CXX object src/rpc/CMakeFiles/obj_rpc.dir/core_rpc_server.cpp.o
[ 53%] Building CXX object src/rpc/CMakeFiles/obj_rpc.dir/rpc_args.cpp.o
make[3]: Leaving directory '/mnt/buildbot/buildbot/slave/monero-tests-debian-armv8/build/build/debug'
[ 53%] Built target obj_rpc
make[3]: Entering directory '/mnt/buildbot/buildbot/slave/monero-tests-debian-armv8/build/build/debug'
make[3]: Leaving directory '/mnt/buildbot/buildbot/slave/monero-tests-debian-armv8/build/build/debug'
make[3]: Entering directory '/mnt/buildbot/buildbot/slave/monero-tests-debian-armv8/build/build/debug'
[ 54%] Linking CXX shared library librpc.so
make[3]: Leaving directory '/mnt/buildbot/buildbot/slave/monero-tests-debian-armv8/build/build/debug'
[ 54%] Built target rpc
make[3]: Entering directory '/mnt/buildbot/buildbot/slave/monero-tests-debian-armv8/build/build/debug'
make[3]: Leaving directory '/mnt/buildbot/buildbot/slave/monero-tests-debian-armv8/build/build/debug'
make[3]: Entering directory '/mnt/buildbot/buildbot/slave/monero-tests-debian-armv8/build/build/debug'
[ 54%] Building CXX object src/rpc/CMakeFiles/obj_daemon_messages.dir/message.cpp.o
[ 54%] Building CXX object src/rpc/CMakeFiles/obj_daemon_messages.dir/daemon_messages.cpp.o
make[3]: Leaving directory '/mnt/buildbot/buildbot/slave/monero-tests-debian-armv8/build/build/debug'
[ 54%] Built target obj_daemon_messages
make[3]: Entering directory '/mnt/buildbot/buildbot/slave/monero-tests-debian-armv8/build/build/debug'
make[3]: Leaving directory '/mnt/buildbot/buildbot/slave/monero-tests-debian-armv8/build/build/debug'
make[3]: Entering directory '/mnt/buildbot/buildbot/slave/monero-tests-debian-armv8/build/build/debug'
[ 55%] Building CXX object src/serialization/CMakeFiles/obj_serialization.dir/json_object.cpp.o
make[3]: Leaving directory '/mnt/buildbot/buildbot/slave/monero-tests-debian-armv8/build/build/debug'
[ 55%] Built target obj_serialization
make[3]: Entering directory '/mnt/buildbot/buildbot/slave/monero-tests-debian-armv8/build/build/debug'
make[3]: Leaving directory '/mnt/buildbot/buildbot/slave/monero-tests-debian-armv8/build/build/debug'
make[3]: Entering directory '/mnt/buildbot/buildbot/slave/monero-tests-debian-armv8/build/build/debug'
[ 55%] Linking CXX shared library libserialization.so
make[3]: Leaving directory '/mnt/buildbot/buildbot/slave/monero-tests-debian-armv8/build/build/debug'
[ 55%] Built target serialization
make[3]: Entering directory '/mnt/buildbot/buildbot/slave/monero-tests-debian-armv8/build/build/debug'
make[3]: Leaving directory '/mnt/buildbot/buildbot/slave/monero-tests-debian-armv8/build/build/debug'
make[3]: Entering directory '/mnt/buildbot/buildbot/slave/monero-tests-debian-armv8/build/build/debug'
[ 55%] Linking CXX shared library libdaemon_messages.so
make[3]: Leaving directory '/mnt/buildbot/buildbot/slave/monero-tests-debian-armv8/build/build/debug'
[ 55%] Built target daemon_messages
make[3]: Entering directory '/mnt/buildbot/buildbot/slave/monero-tests-debian-armv8/build/build/debug'
make[3]: Leaving directory '/mnt/buildbot/buildbot/slave/monero-tests-debian-armv8/build/build/debug'
make[3]: Entering directory '/mnt/buildbot/buildbot/slave/monero-tests-debian-armv8/build/build/debug'
[ 56%] Building CXX object src/rpc/CMakeFiles/obj_daemon_rpc_server.dir/daemon_handler.cpp.o
[ 56%] Building CXX object src/rpc/CMakeFiles/obj_daemon_rpc_server.dir/zmq_server.cpp.o
make[3]: Leaving directory '/mnt/buildbot/buildbot/slave/monero-tests-debian-armv8/build/build/debug'
[ 56%] Built target obj_daemon_rpc_server
make[3]: Entering directory '/mnt/buildbot/buildbot/slave/monero-tests-debian-armv8/build/build/debug'
make[3]: Leaving directory '/mnt/buildbot/buildbot/slave/monero-tests-debian-armv8/build/build/debug'
make[3]: Entering directory '/mnt/buildbot/buildbot/slave/monero-tests-debian-armv8/build/build/debug'
[ 56%] Linking CXX shared library libdaemon_rpc_server.so
make[3]: Leaving directory '/mnt/buildbot/buildbot/slave/monero-tests-debian-armv8/build/build/debug'
[ 56%] Built target daemon_rpc_server
make[3]: Entering directory '/mnt/buildbot/buildbot/slave/monero-tests-debian-armv8/build/build/debug'
make[3]: Leaving directory '/mnt/buildbot/buildbot/slave/monero-tests-debian-armv8/build/build/debug'
make[3]: Entering directory '/mnt/buildbot/buildbot/slave/monero-tests-debian-armv8/build/build/debug'
[ 56%] Building CXX object src/wallet/CMakeFiles/obj_wallet.dir/wallet2.cpp.o
[ 56%] Building CXX object src/wallet/CMakeFiles/obj_wallet.dir/wallet_args.cpp.o
[ 57%] Building CXX object src/wallet/CMakeFiles/obj_wallet.dir/node_rpc_proxy.cpp.o
[ 57%] Building CXX object src/wallet/CMakeFiles/obj_wallet.dir/api/wallet.cpp.o
[ 57%] Building CXX object src/wallet/CMakeFiles/obj_wallet.dir/api/wallet_manager.cpp.o
[ 58%] Building CXX object src/wallet/CMakeFiles/obj_wallet.dir/api/transaction_info.cpp.o
[ 58%] Building CXX object src/wallet/CMakeFiles/obj_wallet.dir/api/transaction_history.cpp.o
[ 58%] Building CXX object src/wallet/CMakeFiles/obj_wallet.dir/api/pending_transaction.cpp.o
[ 59%] Building CXX object src/wallet/CMakeFiles/obj_wallet.dir/api/utils.cpp.o
[ 59%] Building CXX object src/wallet/CMakeFiles/obj_wallet.dir/api/address_book.cpp.o
[ 59%] Building CXX object src/wallet/CMakeFiles/obj_wallet.dir/api/unsigned_transaction.cpp.o
make[3]: Leaving directory '/mnt/buildbot/buildbot/slave/monero-tests-debian-armv8/build/build/debug'
[ 59%] Built target obj_wallet
make[3]: Entering directory '/mnt/buildbot/buildbot/slave/monero-tests-debian-armv8/build/build/debug'
make[3]: Leaving directory '/mnt/buildbot/buildbot/slave/monero-tests-debian-armv8/build/build/debug'
make[3]: Entering directory '/mnt/buildbot/buildbot/slave/monero-tests-debian-armv8/build/build/debug'
[ 59%] Linking CXX shared library libwallet.so
make[3]: Leaving directory '/mnt/buildbot/buildbot/slave/monero-tests-debian-armv8/build/build/debug'
[ 59%] Built target wallet
make[3]: Entering directory '/mnt/buildbot/buildbot/slave/monero-tests-debian-armv8/build/build/debug'
make[3]: Leaving directory '/mnt/buildbot/buildbot/slave/monero-tests-debian-armv8/build/build/debug'
make[3]: Entering directory '/mnt/buildbot/buildbot/slave/monero-tests-debian-armv8/build/build/debug'
[ 59%] Building CXX object src/wallet/CMakeFiles/wallet_rpc_server.dir/wallet_rpc_server.cpp.o
[ 60%] Linking CXX executable ../../bin/monero-wallet-rpc
make[3]: Leaving directory '/mnt/buildbot/buildbot/slave/monero-tests-debian-armv8/build/build/debug'
[ 60%] Built target wallet_rpc_server
make[3]: Entering directory '/mnt/buildbot/buildbot/slave/monero-tests-debian-armv8/build/build/debug'
make[3]: Leaving directory '/mnt/buildbot/buildbot/slave/monero-tests-debian-armv8/build/build/debug'
make[3]: Entering directory '/mnt/buildbot/buildbot/slave/monero-tests-debian-armv8/build/build/debug'
[ 60%] Building CXX object src/simplewallet/CMakeFiles/simplewallet.dir/simplewallet.cpp.o
[ 61%] Linking CXX executable ../../bin/monero-wallet-cli
make[3]: Leaving directory '/mnt/buildbot/buildbot/slave/monero-tests-debian-armv8/build/build/debug'
[ 61%] Built target simplewallet
make[3]: Entering directory '/mnt/buildbot/buildbot/slave/monero-tests-debian-armv8/build/build/debug'
make[3]: Leaving directory '/mnt/buildbot/buildbot/slave/monero-tests-debian-armv8/build/build/debug'
make[3]: Entering directory '/mnt/buildbot/buildbot/slave/monero-tests-debian-armv8/build/build/debug'
[ 61%] Building CXX object src/daemonizer/CMakeFiles/obj_daemonizer.dir/posix_fork.cpp.o
make[3]: Leaving directory '/mnt/buildbot/buildbot/slave/monero-tests-debian-armv8/build/build/debug'
[ 61%] Built target obj_daemonizer
make[3]: Entering directory '/mnt/buildbot/buildbot/slave/monero-tests-debian-armv8/build/build/debug'
make[3]: Leaving directory '/mnt/buildbot/buildbot/slave/monero-tests-debian-armv8/build/build/debug'
make[3]: Entering directory '/mnt/buildbot/buildbot/slave/monero-tests-debian-armv8/build/build/debug'
[ 61%] Linking CXX shared library libdaemonizer.so
make[3]: Leaving directory '/mnt/buildbot/buildbot/slave/monero-tests-debian-armv8/build/build/debug'
[ 61%] Built target daemonizer
make[3]: Entering directory '/mnt/buildbot/buildbot/slave/monero-tests-debian-armv8/build/build/debug'
make[3]: Leaving directory '/mnt/buildbot/buildbot/slave/monero-tests-debian-armv8/build/build/debug'
make[3]: Entering directory '/mnt/buildbot/buildbot/slave/monero-tests-debian-armv8/build/build/debug'
[ 62%] Building CXX object src/daemon/CMakeFiles/daemon.dir/command_parser_executor.cpp.o
[ 62%] Building CXX object src/daemon/CMakeFiles/daemon.dir/command_server.cpp.o
[ 62%] Building CXX object src/daemon/CMakeFiles/daemon.dir/daemon.cpp.o
[ 63%] Building CXX object src/daemon/CMakeFiles/daemon.dir/executor.cpp.o
[ 63%] Building CXX object src/daemon/CMakeFiles/daemon.dir/main.cpp.o
[ 63%] Building CXX object src/daemon/CMakeFiles/daemon.dir/rpc_command_executor.cpp.o
[ 64%] Linking CXX executable ../../bin/monerod
make[3]: Leaving directory '/mnt/buildbot/buildbot/slave/monero-tests-debian-armv8/build/build/debug'
[ 64%] Built target daemon
make[3]: Entering directory '/mnt/buildbot/buildbot/slave/monero-tests-debian-armv8/build/build/debug'
make[3]: Leaving directory '/mnt/buildbot/buildbot/slave/monero-tests-debian-armv8/build/build/debug'
make[3]: Entering directory '/mnt/buildbot/buildbot/slave/monero-tests-debian-armv8/build/build/debug'
[ 65%] Building CXX object src/blockchain_utilities/CMakeFiles/blockchain_import.dir/blockchain_import.cpp.o
[ 65%] Building CXX object src/blockchain_utilities/CMakeFiles/blockchain_import.dir/bootstrap_file.cpp.o
[ 65%] Building CXX object src/blockchain_utilities/CMakeFiles/blockchain_import.dir/blocksdat_file.cpp.o
[ 66%] Linking CXX executable ../../bin/monero-blockchain-import
make[3]: Leaving directory '/mnt/buildbot/buildbot/slave/monero-tests-debian-armv8/build/build/debug'
[ 66%] Built target blockchain_import
make[3]: Entering directory '/mnt/buildbot/buildbot/slave/monero-tests-debian-armv8/build/build/debug'
make[3]: Leaving directory '/mnt/buildbot/buildbot/slave/monero-tests-debian-armv8/build/build/debug'
make[3]: Entering directory '/mnt/buildbot/buildbot/slave/monero-tests-debian-armv8/build/build/debug'
[ 66%] Building CXX object src/blockchain_utilities/CMakeFiles/blockchain_export.dir/blockchain_export.cpp.o
[ 66%] Building CXX object src/blockchain_utilities/CMakeFiles/blockchain_export.dir/bootstrap_file.cpp.o
[ 67%] Building CXX object src/blockchain_utilities/CMakeFiles/blockchain_export.dir/blocksdat_file.cpp.o
[ 67%] Linking CXX executable ../../bin/monero-blockchain-export
make[3]: Leaving directory '/mnt/buildbot/buildbot/slave/monero-tests-debian-armv8/build/build/debug'
[ 67%] Built target blockchain_export
make[3]: Entering directory '/mnt/buildbot/buildbot/slave/monero-tests-debian-armv8/build/build/debug'
make[3]: Leaving directory '/mnt/buildbot/buildbot/slave/monero-tests-debian-armv8/build/build/debug'
make[3]: Entering directory '/mnt/buildbot/buildbot/slave/monero-tests-debian-armv8/build/build/debug'
[ 67%] Building CXX object src/debug_utilities/CMakeFiles/cn_deserialize.dir/cn_deserialize.cpp.o
[ 68%] Linking CXX executable ../../bin/monero-utils-deserialize
make[3]: Leaving directory '/mnt/buildbot/buildbot/slave/monero-tests-debian-armv8/build/build/debug'
[ 68%] Built target cn_deserialize
make[3]: Entering directory '/mnt/buildbot/buildbot/slave/monero-tests-debian-armv8/build/build/debug'
make[3]: Leaving directory '/mnt/buildbot/buildbot/slave/monero-tests-debian-armv8/build/build/debug'
make[3]: Entering directory '/mnt/buildbot/buildbot/slave/monero-tests-debian-armv8/build/build/debug'
[ 69%] Building CXX object src/debug_utilities/CMakeFiles/object_sizes.dir/object_sizes.cpp.o
[ 69%] Linking CXX executable ../../bin/monero-utils-object-sizes
make[3]: Leaving directory '/mnt/buildbot/buildbot/slave/monero-tests-debian-armv8/build/build/debug'
[ 69%] Built target object_sizes
make[3]: Entering directory '/mnt/buildbot/buildbot/slave/monero-tests-debian-armv8/build/build/debug'
Scanning dependencies of target googletest
make[3]: Leaving directory '/mnt/buildbot/buildbot/slave/monero-tests-debian-armv8/build/build/debug'
make[3]: Entering directory '/mnt/buildbot/buildbot/slave/monero-tests-debian-armv8/build/build/debug'
[ 69%] Creating directories for 'googletest'
[ 69%] No download step for 'googletest'
[ 69%] No patch step for 'googletest'
[ 70%] No update step for 'googletest'
[ 70%] Performing configure step for 'googletest'
-- The CXX compiler identification is GNU 6.3.0
-- The C compiler identification is GNU 6.3.0
-- Check for working CXX compiler: /usr/bin/c++
-- Check for working CXX compiler: /usr/bin/c++ -- works
-- Detecting CXX compiler ABI info
-- Detecting CXX compiler ABI info - done
-- Detecting CXX compile features
-- Detecting CXX compile features - done
-- Check for working C compiler: /usr/bin/cc
-- Check for working C compiler: /usr/bin/cc -- works
-- Detecting C compiler ABI info
-- Detecting C compiler ABI info - done
-- Detecting C compile features
-- Detecting C compile features - done
-- Found PythonInterp: /usr/bin/python (found version "2.7.13") 
-- Looking for pthread.h
-- Looking for pthread.h - found
-- Looking for pthread_create
-- Looking for pthread_create - not found
-- Looking for pthread_create in pthreads
-- Looking for pthread_create in pthreads - not found
-- Looking for pthread_create in pthread
-- Looking for pthread_create in pthread - found
-- Found Threads: TRUE  
-- Configuring done
-- Generating done
-- Build files have been written to: /mnt/buildbot/buildbot/slave/monero-tests-debian-armv8/build/build/debug/tests/gtest
[ 71%] Performing build step for 'googletest'
make[4]: Entering directory '/mnt/buildbot/buildbot/slave/monero-tests-debian-armv8/build/build/debug/tests/gtest'
make[5]: Entering directory '/mnt/buildbot/buildbot/slave/monero-tests-debian-armv8/build/build/debug/tests/gtest'
make[6]: Entering directory '/mnt/buildbot/buildbot/slave/monero-tests-debian-armv8/build/build/debug/tests/gtest'
Scanning dependencies of target gtest
make[6]: Leaving directory '/mnt/buildbot/buildbot/slave/monero-tests-debian-armv8/build/build/debug/tests/gtest'
make[6]: Entering directory '/mnt/buildbot/buildbot/slave/monero-tests-debian-armv8/build/build/debug/tests/gtest'
[ 25%] Building CXX object CMakeFiles/gtest.dir/src/gtest-all.cc.o
[ 50%] Linking CXX static library libgtest.a
make[6]: Leaving directory '/mnt/buildbot/buildbot/slave/monero-tests-debian-armv8/build/build/debug/tests/gtest'
[ 50%] Built target gtest
make[6]: Entering directory '/mnt/buildbot/buildbot/slave/monero-tests-debian-armv8/build/build/debug/tests/gtest'
Scanning dependencies of target gtest_main
make[6]: Leaving directory '/mnt/buildbot/buildbot/slave/monero-tests-debian-armv8/build/build/debug/tests/gtest'
make[6]: Entering directory '/mnt/buildbot/buildbot/slave/monero-tests-debian-armv8/build/build/debug/tests/gtest'
[ 75%] Building CXX object CMakeFiles/gtest_main.dir/src/gtest_main.cc.o
[100%] Linking CXX static library libgtest_main.a
make[6]: Leaving directory '/mnt/buildbot/buildbot/slave/monero-tests-debian-armv8/build/build/debug/tests/gtest'
[100%] Built target gtest_main
make[5]: Leaving directory '/mnt/buildbot/buildbot/slave/monero-tests-debian-armv8/build/build/debug/tests/gtest'
make[4]: Leaving directory '/mnt/buildbot/buildbot/slave/monero-tests-debian-armv8/build/build/debug/tests/gtest'
[ 72%] No install step for 'googletest'
[ 72%] Completed 'googletest'
make[3]: Leaving directory '/mnt/buildbot/buildbot/slave/monero-tests-debian-armv8/build/build/debug'
[ 72%] Built target googletest
make[3]: Entering directory '/mnt/buildbot/buildbot/slave/monero-tests-debian-armv8/build/build/debug'
Scanning dependencies of target hash-target-tests
make[3]: Leaving directory '/mnt/buildbot/buildbot/slave/monero-tests-debian-armv8/build/build/debug'
make[3]: Entering directory '/mnt/buildbot/buildbot/slave/monero-tests-debian-armv8/build/build/debug'
[ 72%] Building CXX object tests/CMakeFiles/hash-target-tests.dir/hash-target.cpp.o
[ 72%] Linking CXX executable hash-target-tests
make[3]: Leaving directory '/mnt/buildbot/buildbot/slave/monero-tests-debian-armv8/build/build/debug'
[ 72%] Built target hash-target-tests
make[3]: Entering directory '/mnt/buildbot/buildbot/slave/monero-tests-debian-armv8/build/build/debug'
Scanning dependencies of target coretests
make[3]: Leaving directory '/mnt/buildbot/buildbot/slave/monero-tests-debian-armv8/build/build/debug'
make[3]: Entering directory '/mnt/buildbot/buildbot/slave/monero-tests-debian-armv8/build/build/debug'
[ 72%] Building CXX object tests/core_tests/CMakeFiles/coretests.dir/block_reward.cpp.o
[ 73%] Building CXX object tests/core_tests/CMakeFiles/coretests.dir/block_validation.cpp.o
[ 73%] Building CXX object tests/core_tests/CMakeFiles/coretests.dir/chain_split_1.cpp.o
[ 73%] Building CXX object tests/core_tests/CMakeFiles/coretests.dir/chain_switch_1.cpp.o
[ 74%] Building CXX object tests/core_tests/CMakeFiles/coretests.dir/chaingen.cpp.o
[ 74%] Building CXX object tests/core_tests/CMakeFiles/coretests.dir/chaingen001.cpp.o
[ 74%] Building CXX object tests/core_tests/CMakeFiles/coretests.dir/chaingen_main.cpp.o
[ 75%] Building CXX object tests/core_tests/CMakeFiles/coretests.dir/double_spend.cpp.o
[ 75%] Building CXX object tests/core_tests/CMakeFiles/coretests.dir/integer_overflow.cpp.o
[ 75%] Building CXX object tests/core_tests/CMakeFiles/coretests.dir/ring_signature_1.cpp.o
[ 76%] Building CXX object tests/core_tests/CMakeFiles/coretests.dir/transaction_tests.cpp.o
[ 76%] Building CXX object tests/core_tests/CMakeFiles/coretests.dir/tx_validation.cpp.o
[ 76%] Building CXX object tests/core_tests/CMakeFiles/coretests.dir/v2_tests.cpp.o
[ 77%] Building CXX object tests/core_tests/CMakeFiles/coretests.dir/rct.cpp.o
[ 77%] Linking CXX executable coretests
make[3]: Leaving directory '/mnt/buildbot/buildbot/slave/monero-tests-debian-armv8/build/build/debug'
[ 77%] Built target coretests
make[3]: Entering directory '/mnt/buildbot/buildbot/slave/monero-tests-debian-armv8/build/build/debug'
Scanning dependencies of target cold-outputs_fuzz_tests
make[3]: Leaving directory '/mnt/buildbot/buildbot/slave/monero-tests-debian-armv8/build/build/debug'
make[3]: Entering directory '/mnt/buildbot/buildbot/slave/monero-tests-debian-armv8/build/build/debug'
[ 78%] Building CXX object tests/fuzz/CMakeFiles/cold-outputs_fuzz_tests.dir/cold-outputs.cpp.o
[ 78%] Building CXX object tests/fuzz/CMakeFiles/cold-outputs_fuzz_tests.dir/fuzzer.cpp.o
[ 78%] Linking CXX executable cold-outputs_fuzz_tests
make[3]: Leaving directory '/mnt/buildbot/buildbot/slave/monero-tests-debian-armv8/build/build/debug'
[ 78%] Built target cold-outputs_fuzz_tests
make[3]: Entering directory '/mnt/buildbot/buildbot/slave/monero-tests-debian-armv8/build/build/debug'
Scanning dependencies of target transaction_fuzz_tests
make[3]: Leaving directory '/mnt/buildbot/buildbot/slave/monero-tests-debian-armv8/build/build/debug'
make[3]: Entering directory '/mnt/buildbot/buildbot/slave/monero-tests-debian-armv8/build/build/debug'
[ 78%] Building CXX object tests/fuzz/CMakeFiles/transaction_fuzz_tests.dir/transaction.cpp.o
[ 78%] Building CXX object tests/fuzz/CMakeFiles/transaction_fuzz_tests.dir/fuzzer.cpp.o
[ 78%] Linking CXX executable transaction_fuzz_tests
make[3]: Leaving directory '/mnt/buildbot/buildbot/slave/monero-tests-debian-armv8/build/build/debug'
[ 78%] Built target transaction_fuzz_tests
make[3]: Entering directory '/mnt/buildbot/buildbot/slave/monero-tests-debian-armv8/build/build/debug'
Scanning dependencies of target block_fuzz_tests
make[3]: Leaving directory '/mnt/buildbot/buildbot/slave/monero-tests-debian-armv8/build/build/debug'
make[3]: Entering directory '/mnt/buildbot/buildbot/slave/monero-tests-debian-armv8/build/build/debug'
[ 78%] Building CXX object tests/fuzz/CMakeFiles/block_fuzz_tests.dir/block.cpp.o
[ 78%] Building CXX object tests/fuzz/CMakeFiles/block_fuzz_tests.dir/fuzzer.cpp.o
[ 78%] Linking CXX executable block_fuzz_tests
make[3]: Leaving directory '/mnt/buildbot/buildbot/slave/monero-tests-debian-armv8/build/build/debug'
[ 78%] Built target block_fuzz_tests
make[3]: Entering directory '/mnt/buildbot/buildbot/slave/monero-tests-debian-armv8/build/build/debug'
Scanning dependencies of target signature_fuzz_tests
make[3]: Leaving directory '/mnt/buildbot/buildbot/slave/monero-tests-debian-armv8/build/build/debug'
make[3]: Entering directory '/mnt/buildbot/buildbot/slave/monero-tests-debian-armv8/build/build/debug'
[ 78%] Building CXX object tests/fuzz/CMakeFiles/signature_fuzz_tests.dir/signature.cpp.o
[ 79%] Building CXX object tests/fuzz/CMakeFiles/signature_fuzz_tests.dir/fuzzer.cpp.o
[ 79%] Linking CXX executable signature_fuzz_tests
make[3]: Leaving directory '/mnt/buildbot/buildbot/slave/monero-tests-debian-armv8/build/build/debug'
[ 79%] Built target signature_fuzz_tests
make[3]: Entering directory '/mnt/buildbot/buildbot/slave/monero-tests-debian-armv8/build/build/debug'
Scanning dependencies of target cold-transaction_fuzz_tests
make[3]: Leaving directory '/mnt/buildbot/buildbot/slave/monero-tests-debian-armv8/build/build/debug'
make[3]: Entering directory '/mnt/buildbot/buildbot/slave/monero-tests-debian-armv8/build/build/debug'
[ 80%] Building CXX object tests/fuzz/CMakeFiles/cold-transaction_fuzz_tests.dir/cold-transaction.cpp.o
[ 80%] Building CXX object tests/fuzz/CMakeFiles/cold-transaction_fuzz_tests.dir/fuzzer.cpp.o
[ 80%] Linking CXX executable cold-transaction_fuzz_tests
make[3]: Leaving directory '/mnt/buildbot/buildbot/slave/monero-tests-debian-armv8/build/build/debug'
[ 80%] Built target cold-transaction_fuzz_tests
make[3]: Entering directory '/mnt/buildbot/buildbot/slave/monero-tests-debian-armv8/build/build/debug'
Scanning dependencies of target cncrypto-tests
make[3]: Leaving directory '/mnt/buildbot/buildbot/slave/monero-tests-debian-armv8/build/build/debug'
make[3]: Entering directory '/mnt/buildbot/buildbot/slave/monero-tests-debian-armv8/build/build/debug'
[ 80%] Building C object tests/crypto/CMakeFiles/cncrypto-tests.dir/crypto-ops-data.c.o
[ 81%] Building C object tests/crypto/CMakeFiles/cncrypto-tests.dir/crypto-ops.c.o
[ 81%] Building CXX object tests/crypto/CMakeFiles/cncrypto-tests.dir/crypto.cpp.o
[ 81%] Building C object tests/crypto/CMakeFiles/cncrypto-tests.dir/hash.c.o
[ 82%] Building CXX object tests/crypto/CMakeFiles/cncrypto-tests.dir/main.cpp.o
[ 82%] Building C object tests/crypto/CMakeFiles/cncrypto-tests.dir/random.c.o
[ 82%] Linking CXX executable cncrypto-tests
make[3]: Leaving directory '/mnt/buildbot/buildbot/slave/monero-tests-debian-armv8/build/build/debug'
[ 82%] Built target cncrypto-tests
make[3]: Entering directory '/mnt/buildbot/buildbot/slave/monero-tests-debian-armv8/build/build/debug'
Scanning dependencies of target functional_tests
make[3]: Leaving directory '/mnt/buildbot/buildbot/slave/monero-tests-debian-armv8/build/build/debug'
make[3]: Entering directory '/mnt/buildbot/buildbot/slave/monero-tests-debian-armv8/build/build/debug'
[ 82%] Building CXX object tests/functional_tests/CMakeFiles/functional_tests.dir/main.cpp.o
[ 82%] Building CXX object tests/functional_tests/CMakeFiles/functional_tests.dir/transactions_flow_test.cpp.o
[ 83%] Building CXX object tests/functional_tests/CMakeFiles/functional_tests.dir/transactions_generation_from_blockchain.cpp.o
[ 83%] Linking CXX executable functional_tests
make[3]: Leaving directory '/mnt/buildbot/buildbot/slave/monero-tests-debian-armv8/build/build/debug'
[ 83%] Built target functional_tests
make[3]: Entering directory '/mnt/buildbot/buildbot/slave/monero-tests-debian-armv8/build/build/debug'
Scanning dependencies of target performance_tests
make[3]: Leaving directory '/mnt/buildbot/buildbot/slave/monero-tests-debian-armv8/build/build/debug'
make[3]: Entering directory '/mnt/buildbot/buildbot/slave/monero-tests-debian-armv8/build/build/debug'
[ 84%] Building CXX object tests/performance_tests/CMakeFiles/performance_tests.dir/main.cpp.o
[ 84%] Linking CXX executable performance_tests
make[3]: Leaving directory '/mnt/buildbot/buildbot/slave/monero-tests-debian-armv8/build/build/debug'
[ 84%] Built target performance_tests
make[3]: Entering directory '/mnt/buildbot/buildbot/slave/monero-tests-debian-armv8/build/build/debug'
Scanning dependencies of target core_proxy
make[3]: Leaving directory '/mnt/buildbot/buildbot/slave/monero-tests-debian-armv8/build/build/debug'
make[3]: Entering directory '/mnt/buildbot/buildbot/slave/monero-tests-debian-armv8/build/build/debug'
[ 85%] Building CXX object tests/core_proxy/CMakeFiles/core_proxy.dir/core_proxy.cpp.o
[ 85%] Linking CXX executable core_proxy
make[3]: Leaving directory '/mnt/buildbot/buildbot/slave/monero-tests-debian-armv8/build/build/debug'
[ 85%] Built target core_proxy
make[3]: Entering directory '/mnt/buildbot/buildbot/slave/monero-tests-debian-armv8/build/build/debug'
Scanning dependencies of target unit_tests
make[3]: Leaving directory '/mnt/buildbot/buildbot/slave/monero-tests-debian-armv8/build/build/debug'
make[3]: Entering directory '/mnt/buildbot/buildbot/slave/monero-tests-debian-armv8/build/build/debug'
[ 85%] Building CXX object tests/unit_tests/CMakeFiles/unit_tests.dir/address_from_url.cpp.o
[ 85%] Building CXX object tests/unit_tests/CMakeFiles/unit_tests.dir/ban.cpp.o
[ 86%] Building CXX object tests/unit_tests/CMakeFiles/unit_tests.dir/base58.cpp.o
[ 86%] Building CXX object tests/unit_tests/CMakeFiles/unit_tests.dir/blockchain_db.cpp.o
[ 86%] Building CXX object tests/unit_tests/CMakeFiles/unit_tests.dir/block_queue.cpp.o
[ 87%] Building CXX object tests/unit_tests/CMakeFiles/unit_tests.dir/block_reward.cpp.o
[ 87%] Building CXX object tests/unit_tests/CMakeFiles/unit_tests.dir/canonical_amounts.cpp.o
[ 87%] Building CXX object tests/unit_tests/CMakeFiles/unit_tests.dir/chacha8.cpp.o
[ 88%] Building CXX object tests/unit_tests/CMakeFiles/unit_tests.dir/checkpoints.cpp.o
[ 88%] Building CXX object tests/unit_tests/CMakeFiles/unit_tests.dir/command_line.cpp.o
[ 88%] Building CXX object tests/unit_tests/CMakeFiles/unit_tests.dir/crypto.cpp.o
[ 88%] Building CXX object tests/unit_tests/CMakeFiles/unit_tests.dir/decompose_amount_into_digits.cpp.o
[ 89%] Building CXX object tests/unit_tests/CMakeFiles/unit_tests.dir/dns_resolver.cpp.o
[ 89%] Building CXX object tests/unit_tests/CMakeFiles/unit_tests.dir/epee_boosted_tcp_server.cpp.o
[ 89%] Building CXX object tests/unit_tests/CMakeFiles/unit_tests.dir/epee_levin_protocol_handler_async.cpp.o
[ 90%] Building CXX object tests/unit_tests/CMakeFiles/unit_tests.dir/epee_utils.cpp.o
[ 90%] Building CXX object tests/unit_tests/CMakeFiles/unit_tests.dir/fee.cpp.o
[ 90%] Building CXX object tests/unit_tests/CMakeFiles/unit_tests.dir/get_xtype_from_string.cpp.o
[ 91%] Building CXX object tests/unit_tests/CMakeFiles/unit_tests.dir/http.cpp.o
[ 91%] Building CXX object tests/unit_tests/CMakeFiles/unit_tests.dir/main.cpp.o
[ 91%] Building CXX object tests/unit_tests/CMakeFiles/unit_tests.dir/mnemonics.cpp.o
[ 92%] Building CXX object tests/unit_tests/CMakeFiles/unit_tests.dir/mul_div.cpp.o
[ 92%] Building CXX object tests/unit_tests/CMakeFiles/unit_tests.dir/parse_amount.cpp.o
[ 92%] Building CXX object tests/unit_tests/CMakeFiles/unit_tests.dir/serialization.cpp.o
[ 93%] Building CXX object tests/unit_tests/CMakeFiles/unit_tests.dir/slow_memmem.cpp.o
[ 93%] Building CXX object tests/unit_tests/CMakeFiles/unit_tests.dir/test_tx_utils.cpp.o
[ 93%] Building CXX object tests/unit_tests/CMakeFiles/unit_tests.dir/test_peerlist.cpp.o
[ 94%] Building CXX object tests/unit_tests/CMakeFiles/unit_tests.dir/test_protocol_pack.cpp.o
[ 94%] Building CXX object tests/unit_tests/CMakeFiles/unit_tests.dir/hardfork.cpp.o
[ 94%] Building CXX object tests/unit_tests/CMakeFiles/unit_tests.dir/unbound.cpp.o
[ 95%] Building CXX object tests/unit_tests/CMakeFiles/unit_tests.dir/uri.cpp.o
[ 95%] Building CXX object tests/unit_tests/CMakeFiles/unit_tests.dir/varint.cpp.o
[ 95%] Building CXX object tests/unit_tests/CMakeFiles/unit_tests.dir/ringct.cpp.o
[ 96%] Building CXX object tests/unit_tests/CMakeFiles/unit_tests.dir/output_selection.cpp.o
[ 96%] Building CXX object tests/unit_tests/CMakeFiles/unit_tests.dir/vercmp.cpp.o
[ 96%] Linking CXX executable unit_tests
make[3]: Leaving directory '/mnt/buildbot/buildbot/slave/monero-tests-debian-armv8/build/build/debug'
[ 96%] Built target unit_tests
make[3]: Entering directory '/mnt/buildbot/buildbot/slave/monero-tests-debian-armv8/build/build/debug'
Scanning dependencies of target difficulty-tests
make[3]: Leaving directory '/mnt/buildbot/buildbot/slave/monero-tests-debian-armv8/build/build/debug'
make[3]: Entering directory '/mnt/buildbot/buildbot/slave/monero-tests-debian-armv8/build/build/debug'
[ 97%] Building CXX object tests/difficulty/CMakeFiles/difficulty-tests.dir/difficulty.cpp.o
[ 97%] Linking CXX executable difficulty-tests
make[3]: Leaving directory '/mnt/buildbot/buildbot/slave/monero-tests-debian-armv8/build/build/debug'
[ 97%] Built target difficulty-tests
make[3]: Entering directory '/mnt/buildbot/buildbot/slave/monero-tests-debian-armv8/build/build/debug'
Scanning dependencies of target hash-tests
make[3]: Leaving directory '/mnt/buildbot/buildbot/slave/monero-tests-debian-armv8/build/build/debug'
make[3]: Entering directory '/mnt/buildbot/buildbot/slave/monero-tests-debian-armv8/build/build/debug'
[ 98%] Building CXX object tests/hash/CMakeFiles/hash-tests.dir/main.cpp.o
[ 98%] Linking CXX executable hash-tests
make[3]: Leaving directory '/mnt/buildbot/buildbot/slave/monero-tests-debian-armv8/build/build/debug'
[ 98%] Built target hash-tests
make[3]: Entering directory '/mnt/buildbot/buildbot/slave/monero-tests-debian-armv8/build/build/debug'
Scanning dependencies of target net_load_tests_clt
make[3]: Leaving directory '/mnt/buildbot/buildbot/slave/monero-tests-debian-armv8/build/build/debug'
make[3]: Entering directory '/mnt/buildbot/buildbot/slave/monero-tests-debian-armv8/build/build/debug'
[ 98%] Building CXX object tests/net_load_tests/CMakeFiles/net_load_tests_clt.dir/clt.cpp.o
[ 98%] Linking CXX executable net_load_tests_clt
make[3]: Leaving directory '/mnt/buildbot/buildbot/slave/monero-tests-debian-armv8/build/build/debug'
[ 98%] Built target net_load_tests_clt
make[3]: Entering directory '/mnt/buildbot/buildbot/slave/monero-tests-debian-armv8/build/build/debug'
Scanning dependencies of target net_load_tests_srv
make[3]: Leaving directory '/mnt/buildbot/buildbot/slave/monero-tests-debian-armv8/build/build/debug'
make[3]: Entering directory '/mnt/buildbot/buildbot/slave/monero-tests-debian-armv8/build/build/debug'
[ 99%] Building CXX object tests/net_load_tests/CMakeFiles/net_load_tests_srv.dir/srv.cpp.o
[ 99%] Linking CXX executable net_load_tests_srv
make[3]: Leaving directory '/mnt/buildbot/buildbot/slave/monero-tests-debian-armv8/build/build/debug'
[ 99%] Built target net_load_tests_srv
make[3]: Entering directory '/mnt/buildbot/buildbot/slave/monero-tests-debian-armv8/build/build/debug'
Scanning dependencies of target libwallet_api_tests
make[3]: Leaving directory '/mnt/buildbot/buildbot/slave/monero-tests-debian-armv8/build/build/debug'
make[3]: Entering directory '/mnt/buildbot/buildbot/slave/monero-tests-debian-armv8/build/build/debug'
[ 99%] Building CXX object tests/libwallet_api_tests/CMakeFiles/libwallet_api_tests.dir/main.cpp.o
[100%] Linking CXX executable libwallet_api_tests
make[3]: Leaving directory '/mnt/buildbot/buildbot/slave/monero-tests-debian-armv8/build/build/debug'
[100%] Built target libwallet_api_tests
make[2]: Leaving directory '/mnt/buildbot/buildbot/slave/monero-tests-debian-armv8/build/build/debug'
make[1]: Leaving directory '/mnt/buildbot/buildbot/slave/monero-tests-debian-armv8/build/build/debug'
make[1]: Entering directory '/mnt/buildbot/buildbot/slave/monero-tests-debian-armv8/build/build/debug'
Running tests...
Test project /mnt/buildbot/buildbot/slave/monero-tests-debian-armv8/build/build/debug
      Start  1: hash-target
 1/13 Test  #1: hash-target ......................   Passed    0.43 sec
      Start  2: coretests
 2/13 Test  #2: coretests ........................***Exception: SegFault40078.14 sec
      Start  3: cncrypto
 3/13 Test  #3: cncrypto .........................   Passed   78.76 sec
      Start  4: unit_tests
 4/13 Test  #4: unit_tests .......................***Failed   70.67 sec
      Start  5: difficulty
 5/13 Test  #5: difficulty .......................   Passed    0.09 sec
      Start  6: hash-fast
 6/13 Test  #6: hash-fast ........................   Passed    0.08 sec
      Start  7: hash-slow
 7/13 Test  #7: hash-slow ........................   Passed    1.82 sec
      Start  8: hash-tree
 8/13 Test  #8: hash-tree ........................   Passed    0.02 sec
      Start  9: hash-extra-blake
 9/13 Test  #9: hash-extra-blake .................   Passed    0.03 sec
      Start 10: hash-extra-groestl
10/13 Test #10: hash-extra-groestl ...............   Passed    0.07 sec
      Start 11: hash-extra-jh
11/13 Test #11: hash-extra-jh ....................   Passed    0.04 sec
      Start 12: hash-extra-skein
12/13 Test #12: hash-extra-skein .................   Passed    0.03 sec
      Start 13: libwallet_api_tests
13/13 Test #13: libwallet_api_tests ..............***Failed  303.02 sec

77% tests passed, 3 tests failed out of 13

Total Test time (real) = 40533.36 sec

The following tests FAILED:
	  2 - coretests (SEGFAULT)
	  4 - unit_tests (Failed)
	 13 - libwallet_api_tests (Failed)
Errors while running CTest
Makefile:127: recipe for target 'test' failed
make[1]: Leaving directory '/mnt/buildbot/buildbot/slave/monero-tests-debian-armv8/build/build/debug'
make[1]: *** [test] Error 8
Makefile:39: recipe for target 'debug-test' failed
make: *** [debug-test] Error 2
program finished with exit code 2
elapsedTime=53420.141990