(view as text)
make debug-test
 in dir /home/buildbot/slave/monero-tests-debian-armv8/build
 watching logfiles {'LastTest.log': 'build/debug/Testing/Temporary/LastTest.log', 'coretests.log': 'build/debug/tests/core_tests/coretests.log', 'CTestCostData.txt': 'build/debug/Testing/Temporary/CTestCostData.txt'}
 argv: ['make', 'debug-test']
 environment:
  HOME=/home/buildbot
  JAVA_TOOL_OPTIONS=-Dgnu.io.rxtx.SerialPorts=/dev/tty96B0
  LANG=C.UTF-8
  LOGNAME=buildbot
  LS_COLORS=rs=0:di=01;34:ln=01;36:mh=00:pi=40;33:so=01;35:do=01;35:bd=40;33;01:cd=40;33;01:or=40;31;01:mi=00:su=37;41:sg=30;43:ca=30;41:tw=30;42:ow=34;42:st=37;44:ex=01;32:*.tar=01;31:*.tgz=01;31:*.arc=01;31:*.arj=01;31:*.taz=01;31:*.lha=01;31:*.lz4=01;31:*.lzh=01;31:*.lzma=01;31:*.tlz=01;31:*.txz=01;31:*.tzo=01;31:*.t7z=01;31:*.zip=01;31:*.z=01;31:*.Z=01;31:*.dz=01;31:*.gz=01;31:*.lrz=01;31:*.lz=01;31:*.lzo=01;31:*.xz=01;31:*.bz2=01;31:*.bz=01;31:*.tbz=01;31:*.tbz2=01;31:*.tz=01;31:*.deb=01;31:*.rpm=01;31:*.jar=01;31:*.war=01;31:*.ear=01;31:*.sar=01;31:*.rar=01;31:*.alz=01;31:*.ace=01;31:*.zoo=01;31:*.cpio=01;31:*.7z=01;31:*.rz=01;31:*.cab=01;31:*.jpg=01;35:*.jpeg=01;35:*.gif=01;35:*.bmp=01;35:*.pbm=01;35:*.pgm=01;35:*.ppm=01;35:*.tga=01;35:*.xbm=01;35:*.xpm=01;35:*.tif=01;35:*.tiff=01;35:*.png=01;35:*.svg=01;35:*.svgz=01;35:*.mng=01;35:*.pcx=01;35:*.mov=01;35:*.mpg=01;35:*.mpeg=01;35:*.m2v=01;35:*.mkv=01;35:*.webm=01;35:*.ogm=01;35:*.mp4=01;35:*.m4v=01;35:*.mp4v=01;35:*.vob=01;35:*.qt=01;35:*.nuv=01;35:*.wmv=01;35:*.asf=01;35:*.rm=01;35:*.rmvb=01;35:*.flc=01;35:*.avi=01;35:*.fli=01;35:*.flv=01;35:*.gl=01;35:*.dl=01;35:*.xcf=01;35:*.xwd=01;35:*.yuv=01;35:*.cgm=01;35:*.emf=01;35:*.ogv=01;35:*.ogx=01;35:*.aac=00;36:*.au=00;36:*.flac=00;36:*.m4a=00;36:*.mid=00;36:*.midi=00;36:*.mka=00;36:*.mp3=00;36:*.mpc=00;36:*.ogg=00;36:*.ra=00;36:*.wav=00;36:*.oga=00;36:*.opus=00;36:*.spx=00;36:*.xspf=00;36:
  MAIL=/var/mail/buildbot
  MONITOR_PORT=/dev/tty96B0
  PATH=/usr/local/bin:/usr/bin:/bin:/usr/local/games:/usr/games
  PWD=/home/buildbot/slave/monero-tests-debian-armv8/build
  SHELL=/bin/bash
  SHLVL=1
  TERM=xterm
  USER=buildbot
  _=/usr/local/bin/buildslave
 using PTY: False
mkdir -p build/debug
cd build/debug && cmake -D BUILD_TESTS=ON -D CMAKE_BUILD_TYPE=Debug ../.. && make && make test
-- The C compiler identification is GNU 6.2.0
-- The CXX compiler identification is GNU 6.2.0
-- Check for working C compiler: /usr/bin/cc
-- Check for working C compiler: /usr/bin/cc -- works
-- Detecting C compiler ABI info
-- Detecting C compiler ABI info - done
-- Detecting C compile features
-- Detecting C compile features - done
-- Check for working CXX compiler: /usr/bin/c++
-- Check for working CXX compiler: /usr/bin/c++ -- works
-- Detecting CXX compiler ABI info
-- Detecting CXX compiler ABI info - done
-- Detecting CXX compile features
-- Detecting CXX compile features - done
-- Could not find DEVELOPER_LOCAL_TOOLS in env (not required)
-- BOOST_IGNORE_SYSTEM_PATHS defaults to OFF
-- Could not find DEVELOPER_LIBUNBOUND_OLD in env (not required)
-- Building for a 64-bit system
-- Building internal libraries with position independent code
-- Could not find DATABASE in env (not required unless you want to change database type from default: lmdb)
-- Using LMDB as default DB type
-- Could not find libunwind (missing:  LIBUNWIND_INCLUDE_DIR LIBUNWIND_LIBRARIES) 
-- Stack trace on exception disabled
-- Looking for pthread.h
-- Looking for pthread.h - found
-- Looking for pthread_create
-- Looking for pthread_create - not found
-- Check if compiler accepts -pthread
-- Check if compiler accepts -pthread - yes
-- Found Threads: TRUE  
-- Found the miniupnpc libraries at /usr/lib/aarch64-linux-gnu/libminiupnpc.so
-- Found the miniupnpc headers at /usr/include/miniupnpc
-- Detecting version of miniupnpc in path: /usr/include/miniupnpc
-- Performing Test MINIUPNPC_VERSION_1_7_OR_HIGHER
-- Performing Test MINIUPNPC_VERSION_1_7_OR_HIGHER - Success
-- Found miniupnpc version is v1.7 or higher
-- Using shared miniupnpc found at /usr/include/miniupnpc
-- Looking for libunbound
-- Found OpenSSL: /usr/lib/aarch64-linux-gnu/libssl.so;/usr/lib/aarch64-linux-gnu/libcrypto.so (found version "1.0.2j") 
-- Looking for arpa/inet.h
-- Looking for arpa/inet.h - found
-- Looking for endian.h
-- Looking for endian.h - found
-- Looking for dlfcn.h
-- Looking for dlfcn.h - found
-- Looking for event.h
-- Looking for event.h - found
-- Looking for getopt.h
-- Looking for getopt.h - found
-- Looking for glob.h
-- Looking for glob.h - found
-- Looking for grp.h
-- Looking for grp.h - found
-- Looking for inttypes.h
-- Looking for inttypes.h - found
-- Looking for iphlpapi.h
-- Looking for iphlpapi.h - not found
-- Looking for login_cap.h
-- Looking for login_cap.h - not found
-- Looking for memory.h
-- Looking for memory.h - found
-- Looking for netdb.h
-- Looking for netdb.h - found
-- Looking for netinet/in.h
-- Looking for netinet/in.h - found
-- Looking for pwd.h
-- Looking for pwd.h - found
-- Looking for stdarg.h
-- Looking for stdarg.h - found
-- Looking for stdbool.h
-- Looking for stdbool.h - found
-- Looking for stdint.h
-- Looking for stdint.h - found
-- Looking for stdlib.h
-- Looking for stdlib.h - found
-- Looking for strings.h
-- Looking for strings.h - found
-- Looking for string.h
-- Looking for string.h - found
-- Looking for sys/param.h
-- Looking for sys/param.h - found
-- Looking for sys/resource.h
-- Looking for sys/resource.h - found
-- Looking for sys/sha2.h
-- Looking for sys/sha2.h - not found
-- Looking for sys/socket.h
-- Looking for sys/socket.h - found
-- Looking for sys/stat.h
-- Looking for sys/stat.h - found
-- Looking for sys/sysctl.h
-- Looking for sys/sysctl.h - found
-- Looking for sys/types.h
-- Looking for sys/types.h - found
-- Looking for sys/uio.h
-- Looking for sys/uio.h - found
-- Looking for sys/un.h
-- Looking for sys/un.h - found
-- Looking for sys/wait.h
-- Looking for sys/wait.h - found
-- Looking for syslog.h
-- Looking for syslog.h - found
-- Looking for time.h
-- Looking for time.h - found
-- Looking for unistd.h
-- Looking for unistd.h - found
-- Looking for vfork.h
-- Looking for vfork.h - not found
-- Looking for windows.h
-- Looking for windows.h - not found
-- Looking for winsock2.h
-- Looking for winsock2.h - not found
-- Looking for ws2tcpip.h
-- Looking for ws2tcpip.h - not found
-- Looking for _beginthreadex
-- Looking for _beginthreadex - not found
-- Looking for arc4random
-- Looking for arc4random - not found
-- Looking for arc4random_uniform
-- Looking for arc4random_uniform - not found
-- Looking for chown
-- Looking for chown - found
-- Looking for chroot
-- Looking for chroot - found
-- Looking for ctime_r
-- Looking for ctime_r - found
-- Looking for daemon
-- Looking for daemon - found
-- Looking for endprotoent
-- Looking for endprotoent - found
-- Looking for endservent
-- Looking for endservent - found
-- Looking for fork
-- Looking for fork - found
-- Looking for fseeko
-- Looking for fseeko - found
-- Looking for fsync
-- Looking for fsync - found
-- Looking for getauxval
-- Looking for getauxval - found
-- Looking for getentropy
-- Looking for getentropy - not found
-- Looking for getpwnam
-- Looking for getpwnam - found
-- Looking for getrlimit
-- Looking for getrlimit - found
-- Looking for glob
-- Looking for glob - found
-- Looking for gmtime_r
-- Looking for gmtime_r - found
-- Looking for fcntl
-- Looking for fcntl - found
-- Looking for inet_aton
-- Looking for inet_aton - found
-- Looking for inet_ntop
-- Looking for inet_ntop - found
-- Looking for inet_pton
-- Looking for inet_pton - found
-- Looking for initgroups
-- Looking for initgroups - found
-- Looking for ioctlsocket
-- Looking for ioctlsocket - not found
-- Looking for isblank
-- Looking for isblank - found
-- Looking for kill
-- Looking for kill - found
-- Looking for localtime_r
-- Looking for localtime_r - found
-- Looking for malloc
-- Looking for malloc - found
-- Looking for memmove
-- Looking for memmove - found
-- Looking for random
-- Looking for random - found
-- Looking for reallocarray
-- Looking for reallocarray - not found
-- Looking for recvmsg
-- Looking for recvmsg - found
-- Looking for sbrk
-- Looking for sbrk - found
-- Looking for sendmsg
-- Looking for sendmsg - found
-- Looking for setregid
-- Looking for setregid - found
-- Looking for setresgid
-- Looking for setresgid - found
-- Looking for setresuid
-- Looking for setresuid - found
-- Looking for setreuid
-- Looking for setreuid - found
-- Looking for setrlimit
-- Looking for setrlimit - found
-- Looking for setsid
-- Looking for setsid - found
-- Looking for setusercontent
-- Looking for setusercontent - not found
-- Looking for sigprocmask
-- Looking for sigprocmask - found
-- Looking for sleep
-- Looking for sleep - found
-- Looking for snprintf
-- Looking for snprintf - found
-- Looking for socketpair
-- Looking for socketpair - found
-- Looking for srandom
-- Looking for srandom - found
-- Looking for strftime
-- Looking for strftime - found
-- Looking for strlcat
-- Looking for strlcat - not found
-- Looking for strlcpy
-- Looking for strlcpy - not found
-- Looking for strptime
-- Looking for strptime - found
-- Looking for tzset
-- Looking for tzset - found
-- Looking for usleep
-- Looking for usleep - found
-- Looking for writev
-- Looking for writev - found
-- Looking for getaddrinfo
-- Looking for getaddrinfo - found
-- Looking for stddef.h
-- Looking for stddef.h - found
-- Check size of time_t
-- Check size of time_t - done
-- Check size of gid_t
-- Check size of gid_t - done
-- Check size of in_addr_t
-- Check size of in_addr_t - done
-- Check size of in_port_t
-- Check size of in_port_t - done
-- Check size of int16_t
-- Check size of int16_t - done
-- Check size of int32_t
-- Check size of int32_t - done
-- Check size of int64_t
-- Check size of int64_t - done
-- Check size of int8_t
-- Check size of int8_t - done
-- Check size of pid_t
-- Check size of pid_t - done
-- Check size of rlim_t
-- Check size of rlim_t - done
-- Check size of ssize_t
-- Check size of ssize_t - done
-- Check size of uid_t
-- Check size of uid_t - done
-- Check size of uint16_t
-- Check size of uint16_t - done
-- Check size of uint32_t
-- Check size of uint32_t - done
-- Check size of uint64_t
-- Check size of uint64_t - done
-- Check size of uint8_t
-- Check size of uint8_t - done
-- Looking for PTHREAD_PRIO_INHERIT
-- Looking for PTHREAD_PRIO_INHERIT - not found
-- Looking for pthread_rwlock_t
-- Looking for pthread_rwlock_t - not found
-- Looking for pthread_spinlock_t
-- Looking for pthread_spinlock_t - not found
-- Looking for openssl/conf.h
-- Looking for openssl/conf.h - found
-- Looking for openssl/engine.h
-- Looking for openssl/engine.h - found
-- Looking for openssl/err.h
-- Looking for openssl/err.h - found
-- Looking for openssl/rand.h
-- Looking for openssl/rand.h - found
-- Looking for openssl/ssl.h
-- Looking for openssl/ssl.h - found
-- Looking for NID_secp384r1
-- Looking for NID_secp384r1 - found
-- Looking for NID_X9_62_prime256v1
-- Looking for NID_X9_62_prime256v1 - found
-- Looking for sk_SSL_COMP_pop_free
-- Looking for sk_SSL_COMP_pop_free - found
-- Looking for SSL_COMP_get_compression_methods
-- Looking for SSL_COMP_get_compression_methods - not found
-- Looking for EVP_sha1
-- Looking for EVP_sha1 - found
-- Looking for EVP_sha256
-- Looking for EVP_sha256 - found
-- Looking for EVP_sha512
-- Looking for EVP_sha512 - found
-- Looking for FIPS_mode
-- Looking for FIPS_mode - found
-- Looking for HMAC_CTX_init
-- Looking for HMAC_CTX_init - found
-- Looking for OPENSSL_config
-- Looking for OPENSSL_config - found
-- Looking for SHA512_Update
-- Looking for SHA512_Update - found
-- Found PkgConfig: /usr/bin/pkg-config (found version "0.29") 
-- Using 64-bit LMDB from source tree
-- Building on aarch64 for native
-- Checking to see if CXX compiler accepts flag -march=native+crypto
-- Checking to see if CXX compiler accepts flag -march=native+crypto - no
-- Crypto extensions unavailable on your ARMv8 device
-- Setting FPU Flags for ARM Processors
-- Checking to see if CXX compiler accepts flag -mfix-cortex-a53-835769
-- Checking to see if CXX compiler accepts flag -mfix-cortex-a53-835769 - yes
-- Checking to see if CXX compiler accepts flag -mfix-cortex-a53-843419
-- Checking to see if CXX compiler accepts flag -mfix-cortex-a53-843419 - yes
-- Enabling Cortex-A53 workaround 835769
-- Enabling Cortex-A53 workaround 843419
CMake Warning at /usr/share/cmake-3.6/Modules/FindBoost.cmake:743 (message):
  Imported targets not available for Boost version 106200
Call Stack (most recent call first):
  /usr/share/cmake-3.6/Modules/FindBoost.cmake:842 (_Boost_COMPONENT_DEPENDENCIES)
  /usr/share/cmake-3.6/Modules/FindBoost.cmake:1411 (_Boost_MISSING_DEPENDENCIES)
  CMakeLists.txt:569 (find_package)


CMake Warning at /usr/share/cmake-3.6/Modules/FindBoost.cmake:743 (message):
  Imported targets not available for Boost version 106200
Call Stack (most recent call first):
  /usr/share/cmake-3.6/Modules/FindBoost.cmake:842 (_Boost_COMPONENT_DEPENDENCIES)
  /usr/share/cmake-3.6/Modules/FindBoost.cmake:1411 (_Boost_MISSING_DEPENDENCIES)
  CMakeLists.txt:569 (find_package)


CMake Warning at /usr/share/cmake-3.6/Modules/FindBoost.cmake:743 (message):
  Imported targets not available for Boost version 106200
Call Stack (most recent call first):
  /usr/share/cmake-3.6/Modules/FindBoost.cmake:842 (_Boost_COMPONENT_DEPENDENCIES)
  /usr/share/cmake-3.6/Modules/FindBoost.cmake:1411 (_Boost_MISSING_DEPENDENCIES)
  CMakeLists.txt:569 (find_package)


CMake Warning at /usr/share/cmake-3.6/Modules/FindBoost.cmake:743 (message):
  Imported targets not available for Boost version 106200
Call Stack (most recent call first):
  /usr/share/cmake-3.6/Modules/FindBoost.cmake:842 (_Boost_COMPONENT_DEPENDENCIES)
  /usr/share/cmake-3.6/Modules/FindBoost.cmake:1411 (_Boost_MISSING_DEPENDENCIES)
  CMakeLists.txt:569 (find_package)


CMake Warning at /usr/share/cmake-3.6/Modules/FindBoost.cmake:743 (message):
  Imported targets not available for Boost version 106200
Call Stack (most recent call first):
  /usr/share/cmake-3.6/Modules/FindBoost.cmake:842 (_Boost_COMPONENT_DEPENDENCIES)
  /usr/share/cmake-3.6/Modules/FindBoost.cmake:1411 (_Boost_MISSING_DEPENDENCIES)
  CMakeLists.txt:569 (find_package)


CMake Warning at /usr/share/cmake-3.6/Modules/FindBoost.cmake:743 (message):
  Imported targets not available for Boost version 106200
Call Stack (most recent call first):
  /usr/share/cmake-3.6/Modules/FindBoost.cmake:842 (_Boost_COMPONENT_DEPENDENCIES)
  /usr/share/cmake-3.6/Modules/FindBoost.cmake:1411 (_Boost_MISSING_DEPENDENCIES)
  CMakeLists.txt:569 (find_package)


CMake Warning at /usr/share/cmake-3.6/Modules/FindBoost.cmake:743 (message):
  Imported targets not available for Boost version 106200
Call Stack (most recent call first):
  /usr/share/cmake-3.6/Modules/FindBoost.cmake:842 (_Boost_COMPONENT_DEPENDENCIES)
  /usr/share/cmake-3.6/Modules/FindBoost.cmake:1411 (_Boost_MISSING_DEPENDENCIES)
  CMakeLists.txt:569 (find_package)


CMake Warning at /usr/share/cmake-3.6/Modules/FindBoost.cmake:743 (message):
  Imported targets not available for Boost version 106200
Call Stack (most recent call first):
  /usr/share/cmake-3.6/Modules/FindBoost.cmake:842 (_Boost_COMPONENT_DEPENDENCIES)
  /usr/share/cmake-3.6/Modules/FindBoost.cmake:1411 (_Boost_MISSING_DEPENDENCIES)
  CMakeLists.txt:569 (find_package)


-- Found Boost Version: 106200
-- Found Git: /usr/bin/git
-- Could NOT find GTest (missing:  GTEST_LIBRARY GTEST_INCLUDE_DIR GTEST_MAIN_LIBRARY) 
-- GTest not found on the system: will use GTest bundled with this source
-- Found PythonInterp: /usr/bin/python (found version "2.7.12") 
-- Found Doxygen: /usr/bin/doxygen (found version "1.8.12") 
-- Configuring done
-- Generating done
-- Build files have been written to: /home/buildbot/slave/monero-tests-debian-armv8/build/build/debug
make[1]: Entering directory '/home/buildbot/slave/monero-tests-debian-armv8/build/build/debug'
make[2]: Entering directory '/home/buildbot/slave/monero-tests-debian-armv8/build/build/debug'
make[3]: Entering directory '/home/buildbot/slave/monero-tests-debian-armv8/build/build/debug'
Scanning dependencies of target version
make[3]: Leaving directory '/home/buildbot/slave/monero-tests-debian-armv8/build/build/debug'
make[3]: Entering directory '/home/buildbot/slave/monero-tests-debian-armv8/build/build/debug'
[  0%] Generating version/version.h
-- You are currently on commit eb6d66e
-- The most recent tag was at 53e18ca
-- You are ahead of or behind a tagged release
make[3]: Leaving directory '/home/buildbot/slave/monero-tests-debian-armv8/build/build/debug'
[  0%] Built target version
make[3]: Entering directory '/home/buildbot/slave/monero-tests-debian-armv8/build/build/debug'
Scanning dependencies of target unbound
make[3]: Leaving directory '/home/buildbot/slave/monero-tests-debian-armv8/build/build/debug'
make[3]: Entering directory '/home/buildbot/slave/monero-tests-debian-armv8/build/build/debug'
[  0%] Building C object external/unbound/CMakeFiles/unbound.dir/services/cache/dns.c.o
[  1%] Building C object external/unbound/CMakeFiles/unbound.dir/services/cache/infra.c.o
[  1%] Building C object external/unbound/CMakeFiles/unbound.dir/services/cache/rrset.c.o
[  2%] Building C object external/unbound/CMakeFiles/unbound.dir/util/data/dname.c.o
[  2%] Building C object external/unbound/CMakeFiles/unbound.dir/util/data/msgencode.c.o
[  2%] Building C object external/unbound/CMakeFiles/unbound.dir/util/data/msgparse.c.o
[  3%] Building C object external/unbound/CMakeFiles/unbound.dir/util/data/msgreply.c.o
[  3%] Building C object external/unbound/CMakeFiles/unbound.dir/util/data/packed_rrset.c.o
[  4%] Building C object external/unbound/CMakeFiles/unbound.dir/iterator/iterator.c.o
[  4%] Building C object external/unbound/CMakeFiles/unbound.dir/iterator/iter_delegpt.c.o
[  4%] Building C object external/unbound/CMakeFiles/unbound.dir/iterator/iter_donotq.c.o
[  5%] Building C object external/unbound/CMakeFiles/unbound.dir/iterator/iter_fwd.c.o
[  5%] Building C object external/unbound/CMakeFiles/unbound.dir/iterator/iter_hints.c.o
[  5%] Building C object external/unbound/CMakeFiles/unbound.dir/iterator/iter_priv.c.o
[  6%] Building C object external/unbound/CMakeFiles/unbound.dir/iterator/iter_resptype.c.o
[  6%] Building C object external/unbound/CMakeFiles/unbound.dir/iterator/iter_scrub.c.o
[  7%] Building C object external/unbound/CMakeFiles/unbound.dir/iterator/iter_utils.c.o
[  7%] Building C object external/unbound/CMakeFiles/unbound.dir/services/listen_dnsport.c.o
[  7%] Building C object external/unbound/CMakeFiles/unbound.dir/services/localzone.c.o
[  8%] Building C object external/unbound/CMakeFiles/unbound.dir/services/mesh.c.o
[  8%] Building C object external/unbound/CMakeFiles/unbound.dir/services/modstack.c.o
[  9%] Building C object external/unbound/CMakeFiles/unbound.dir/services/outbound_list.c.o
[  9%] Building C object external/unbound/CMakeFiles/unbound.dir/services/outside_network.c.o
[  9%] Building C object external/unbound/CMakeFiles/unbound.dir/util/alloc.c.o
[ 10%] Building C object external/unbound/CMakeFiles/unbound.dir/util/config_file.c.o
[ 10%] Building C object external/unbound/CMakeFiles/unbound.dir/util/configlexer.c.o
[ 10%] Building C object external/unbound/CMakeFiles/unbound.dir/util/configparser.c.o
[ 11%] Building C object external/unbound/CMakeFiles/unbound.dir/util/fptr_wlist.c.o
[ 11%] Building C object external/unbound/CMakeFiles/unbound.dir/util/locks.c.o
[ 12%] Building C object external/unbound/CMakeFiles/unbound.dir/util/log.c.o
[ 12%] Building C object external/unbound/CMakeFiles/unbound.dir/util/mini_event.c.o
[ 12%] Building C object external/unbound/CMakeFiles/unbound.dir/util/module.c.o
[ 13%] Building C object external/unbound/CMakeFiles/unbound.dir/util/netevent.c.o
[ 13%] Building C object external/unbound/CMakeFiles/unbound.dir/util/net_help.c.o
[ 14%] Building C object external/unbound/CMakeFiles/unbound.dir/util/random.c.o
[ 14%] Building C object external/unbound/CMakeFiles/unbound.dir/util/rbtree.c.o
[ 14%] Building C object external/unbound/CMakeFiles/unbound.dir/util/regional.c.o
[ 15%] Building C object external/unbound/CMakeFiles/unbound.dir/util/rtt.c.o
[ 15%] Building C object external/unbound/CMakeFiles/unbound.dir/util/storage/dnstree.c.o
[ 15%] Building C object external/unbound/CMakeFiles/unbound.dir/util/storage/lookup3.c.o
[ 16%] Building C object external/unbound/CMakeFiles/unbound.dir/util/storage/lruhash.c.o
[ 16%] Building C object external/unbound/CMakeFiles/unbound.dir/util/storage/slabhash.c.o
[ 17%] Building C object external/unbound/CMakeFiles/unbound.dir/util/timehist.c.o
[ 17%] Building C object external/unbound/CMakeFiles/unbound.dir/util/tube.c.o
[ 17%] Building C object external/unbound/CMakeFiles/unbound.dir/util/winsock_event.c.o
[ 18%] Building C object external/unbound/CMakeFiles/unbound.dir/validator/autotrust.c.o
[ 18%] Building C object external/unbound/CMakeFiles/unbound.dir/validator/val_anchor.c.o
[ 19%] Building C object external/unbound/CMakeFiles/unbound.dir/validator/validator.c.o
[ 19%] Building C object external/unbound/CMakeFiles/unbound.dir/validator/val_kcache.c.o
[ 19%] Building C object external/unbound/CMakeFiles/unbound.dir/validator/val_kentry.c.o
[ 20%] Building C object external/unbound/CMakeFiles/unbound.dir/validator/val_neg.c.o
[ 20%] Building C object external/unbound/CMakeFiles/unbound.dir/validator/val_nsec3.c.o
[ 20%] Building C object external/unbound/CMakeFiles/unbound.dir/validator/val_nsec.c.o
[ 21%] Building C object external/unbound/CMakeFiles/unbound.dir/validator/val_secalgo.c.o
[ 21%] Building C object external/unbound/CMakeFiles/unbound.dir/validator/val_sigcrypt.c.o
[ 22%] Building C object external/unbound/CMakeFiles/unbound.dir/validator/val_utils.c.o
[ 22%] Building C object external/unbound/CMakeFiles/unbound.dir/dns64/dns64.c.o
[ 22%] Building C object external/unbound/CMakeFiles/unbound.dir/testcode/checklocks.c.o
[ 23%] Building C object external/unbound/CMakeFiles/unbound.dir/sldns/keyraw.c.o
[ 23%] Building C object external/unbound/CMakeFiles/unbound.dir/sldns/sbuffer.c.o
[ 24%] Building C object external/unbound/CMakeFiles/unbound.dir/sldns/wire2str.c.o
[ 24%] Building C object external/unbound/CMakeFiles/unbound.dir/sldns/parse.c.o
[ 24%] Building C object external/unbound/CMakeFiles/unbound.dir/sldns/parseutil.c.o
[ 25%] Building C object external/unbound/CMakeFiles/unbound.dir/sldns/rrdef.c.o
[ 25%] Building C object external/unbound/CMakeFiles/unbound.dir/sldns/str2wire.c.o
[ 26%] Building C object external/unbound/CMakeFiles/unbound.dir/compat/strlcat.c.o
[ 26%] Building C object external/unbound/CMakeFiles/unbound.dir/compat/strlcpy.c.o
[ 26%] Building C object external/unbound/CMakeFiles/unbound.dir/compat/explicit_bzero.c.o
[ 27%] Building C object external/unbound/CMakeFiles/unbound.dir/compat/arc4random.c.o
[ 27%] Building C object external/unbound/CMakeFiles/unbound.dir/compat/arc4random_uniform.c.o
[ 27%] Building C object external/unbound/CMakeFiles/unbound.dir/compat/reallocarray.c.o
[ 28%] Building C object external/unbound/CMakeFiles/unbound.dir/compat/arc4_lock.c.o
[ 28%] Building C object external/unbound/CMakeFiles/unbound.dir/compat/getentropy_linux.c.o
[ 29%] Building C object external/unbound/CMakeFiles/unbound.dir/libunbound/context.c.o
[ 29%] Building C object external/unbound/CMakeFiles/unbound.dir/libunbound/libunbound.c.o
[ 29%] Building C object external/unbound/CMakeFiles/unbound.dir/libunbound/libworker.c.o
[ 30%] Linking C shared library libunbound.so
make[3]: Leaving directory '/home/buildbot/slave/monero-tests-debian-armv8/build/build/debug'
[ 30%] Built target unbound
make[3]: Entering directory '/home/buildbot/slave/monero-tests-debian-armv8/build/build/debug'
Scanning dependencies of target lmdb
make[3]: Leaving directory '/home/buildbot/slave/monero-tests-debian-armv8/build/build/debug'
make[3]: Entering directory '/home/buildbot/slave/monero-tests-debian-armv8/build/build/debug'
[ 31%] Building C object external/db_drivers/liblmdb/CMakeFiles/lmdb.dir/mdb.c.o
[ 31%] Building C object external/db_drivers/liblmdb/CMakeFiles/lmdb.dir/midl.c.o
[ 31%] Linking C shared library liblmdb.so
make[3]: Leaving directory '/home/buildbot/slave/monero-tests-debian-armv8/build/build/debug'
[ 31%] Built target lmdb
make[3]: Entering directory '/home/buildbot/slave/monero-tests-debian-armv8/build/build/debug'
Scanning dependencies of target otshell_utils
make[3]: Leaving directory '/home/buildbot/slave/monero-tests-debian-armv8/build/build/debug'
make[3]: Entering directory '/home/buildbot/slave/monero-tests-debian-armv8/build/build/debug'
[ 32%] Building CXX object contrib/otshell_utils/CMakeFiles/otshell_utils.dir/ccolor.cpp.o
[ 32%] Building CXX object contrib/otshell_utils/CMakeFiles/otshell_utils.dir/runoptions.cpp.o
[ 33%] Building CXX object contrib/otshell_utils/CMakeFiles/otshell_utils.dir/utils.cpp.o
[ 33%] Building CXX object contrib/otshell_utils/CMakeFiles/otshell_utils.dir/windows_stream.cpp.o
[ 33%] Linking CXX shared library libotshell_utils.so
make[3]: Leaving directory '/home/buildbot/slave/monero-tests-debian-armv8/build/build/debug'
[ 33%] Built target otshell_utils
make[3]: Entering directory '/home/buildbot/slave/monero-tests-debian-armv8/build/build/debug'
Scanning dependencies of target obj_common
make[3]: Leaving directory '/home/buildbot/slave/monero-tests-debian-armv8/build/build/debug'
make[3]: Entering directory '/home/buildbot/slave/monero-tests-debian-armv8/build/build/debug'
[ 33%] Building CXX object src/common/CMakeFiles/obj_common.dir/base58.cpp.o
[ 34%] Building CXX object src/common/CMakeFiles/obj_common.dir/command_line.cpp.o
[ 34%] Building CXX object src/common/CMakeFiles/obj_common.dir/dns_utils.cpp.o
[ 35%] Building CXX object src/common/CMakeFiles/obj_common.dir/util.cpp.o
[ 35%] Building CXX object src/common/CMakeFiles/obj_common.dir/i18n.cpp.o
[ 35%] Building CXX object src/common/CMakeFiles/obj_common.dir/perf_timer.cpp.o
[ 36%] Building CXX object src/common/CMakeFiles/obj_common.dir/thread_group.cpp.o
make[3]: Leaving directory '/home/buildbot/slave/monero-tests-debian-armv8/build/build/debug'
[ 36%] Built target obj_common
make[3]: Entering directory '/home/buildbot/slave/monero-tests-debian-armv8/build/build/debug'
Scanning dependencies of target obj_crypto
make[3]: Leaving directory '/home/buildbot/slave/monero-tests-debian-armv8/build/build/debug'
make[3]: Entering directory '/home/buildbot/slave/monero-tests-debian-armv8/build/build/debug'
[ 36%] Building C object src/crypto/CMakeFiles/obj_crypto.dir/aesb.c.o
[ 36%] Building C object src/crypto/CMakeFiles/obj_crypto.dir/blake256.c.o
[ 37%] Building C object src/crypto/CMakeFiles/obj_crypto.dir/chacha8.c.o
[ 37%] Building C object src/crypto/CMakeFiles/obj_crypto.dir/crypto-ops-data.c.o
[ 38%] Building C object src/crypto/CMakeFiles/obj_crypto.dir/crypto-ops.c.o
[ 38%] Building CXX object src/crypto/CMakeFiles/obj_crypto.dir/crypto.cpp.o
[ 38%] Building C object src/crypto/CMakeFiles/obj_crypto.dir/groestl.c.o
[ 39%] Building C object src/crypto/CMakeFiles/obj_crypto.dir/hash-extra-blake.c.o
[ 39%] Building C object src/crypto/CMakeFiles/obj_crypto.dir/hash-extra-groestl.c.o
[ 40%] Building C object src/crypto/CMakeFiles/obj_crypto.dir/hash-extra-jh.c.o
[ 40%] Building C object src/crypto/CMakeFiles/obj_crypto.dir/hash-extra-skein.c.o
[ 40%] Building C object src/crypto/CMakeFiles/obj_crypto.dir/hash.c.o
[ 41%] Building C object src/crypto/CMakeFiles/obj_crypto.dir/jh.c.o
[ 41%] Building C object src/crypto/CMakeFiles/obj_crypto.dir/keccak.c.o
[ 41%] Building C object src/crypto/CMakeFiles/obj_crypto.dir/oaes_lib.c.o
[ 42%] Building C object src/crypto/CMakeFiles/obj_crypto.dir/random.c.o
[ 42%] Building C object src/crypto/CMakeFiles/obj_crypto.dir/skein.c.o
[ 43%] Building C object src/crypto/CMakeFiles/obj_crypto.dir/slow-hash.c.o
[ 43%] Building C object src/crypto/CMakeFiles/obj_crypto.dir/tree-hash.c.o
make[3]: Leaving directory '/home/buildbot/slave/monero-tests-debian-armv8/build/build/debug'
[ 43%] Built target obj_crypto
make[3]: Entering directory '/home/buildbot/slave/monero-tests-debian-armv8/build/build/debug'
Scanning dependencies of target crypto
make[3]: Leaving directory '/home/buildbot/slave/monero-tests-debian-armv8/build/build/debug'
make[3]: Entering directory '/home/buildbot/slave/monero-tests-debian-armv8/build/build/debug'
[ 44%] Linking CXX shared library libcrypto.so
make[3]: Leaving directory '/home/buildbot/slave/monero-tests-debian-armv8/build/build/debug'
[ 44%] Built target crypto
make[3]: Entering directory '/home/buildbot/slave/monero-tests-debian-armv8/build/build/debug'
Scanning dependencies of target common
make[3]: Leaving directory '/home/buildbot/slave/monero-tests-debian-armv8/build/build/debug'
make[3]: Entering directory '/home/buildbot/slave/monero-tests-debian-armv8/build/build/debug'
[ 45%] Linking CXX shared library libcommon.so
make[3]: Leaving directory '/home/buildbot/slave/monero-tests-debian-armv8/build/build/debug'
[ 45%] Built target common
make[3]: Entering directory '/home/buildbot/slave/monero-tests-debian-armv8/build/build/debug'
Scanning dependencies of target obj_ringct
make[3]: Leaving directory '/home/buildbot/slave/monero-tests-debian-armv8/build/build/debug'
make[3]: Entering directory '/home/buildbot/slave/monero-tests-debian-armv8/build/build/debug'
[ 45%] Building CXX object src/ringct/CMakeFiles/obj_ringct.dir/rctOps.cpp.o
[ 45%] Building CXX object src/ringct/CMakeFiles/obj_ringct.dir/rctSigs.cpp.o
[ 46%] Building CXX object src/ringct/CMakeFiles/obj_ringct.dir/rctTypes.cpp.o
[ 46%] Building C object src/ringct/CMakeFiles/obj_ringct.dir/rctCryptoOps.c.o
make[3]: Leaving directory '/home/buildbot/slave/monero-tests-debian-armv8/build/build/debug'
[ 46%] Built target obj_ringct
make[3]: Entering directory '/home/buildbot/slave/monero-tests-debian-armv8/build/build/debug'
Scanning dependencies of target ringct
make[3]: Leaving directory '/home/buildbot/slave/monero-tests-debian-armv8/build/build/debug'
make[3]: Entering directory '/home/buildbot/slave/monero-tests-debian-armv8/build/build/debug'
[ 47%] Linking CXX shared library libringct.so
make[3]: Leaving directory '/home/buildbot/slave/monero-tests-debian-armv8/build/build/debug'
[ 47%] Built target ringct
make[3]: Entering directory '/home/buildbot/slave/monero-tests-debian-armv8/build/build/debug'
Scanning dependencies of target obj_cryptonote_core
make[3]: Leaving directory '/home/buildbot/slave/monero-tests-debian-armv8/build/build/debug'
make[3]: Entering directory '/home/buildbot/slave/monero-tests-debian-armv8/build/build/debug'
[ 47%] Building CXX object src/cryptonote_core/CMakeFiles/obj_cryptonote_core.dir/account.cpp.o
[ 48%] Building CXX object src/cryptonote_core/CMakeFiles/obj_cryptonote_core.dir/blockchain.cpp.o
[ 48%] Building CXX object src/cryptonote_core/CMakeFiles/obj_cryptonote_core.dir/checkpoints.cpp.o
[ 49%] Building CXX object src/cryptonote_core/CMakeFiles/obj_cryptonote_core.dir/cryptonote_basic_impl.cpp.o
[ 49%] Building CXX object src/cryptonote_core/CMakeFiles/obj_cryptonote_core.dir/cryptonote_core.cpp.o
[ 49%] Building CXX object src/cryptonote_core/CMakeFiles/obj_cryptonote_core.dir/cryptonote_format_utils.cpp.o
[ 50%] Building CXX object src/cryptonote_core/CMakeFiles/obj_cryptonote_core.dir/difficulty.cpp.o
[ 50%] Building CXX object src/cryptonote_core/CMakeFiles/obj_cryptonote_core.dir/miner.cpp.o
[ 51%] Building CXX object src/cryptonote_core/CMakeFiles/obj_cryptonote_core.dir/tx_pool.cpp.o
[ 51%] Building CXX object src/cryptonote_core/CMakeFiles/obj_cryptonote_core.dir/hardfork.cpp.o
make[3]: Leaving directory '/home/buildbot/slave/monero-tests-debian-armv8/build/build/debug'
[ 51%] Built target obj_cryptonote_core
make[3]: Entering directory '/home/buildbot/slave/monero-tests-debian-armv8/build/build/debug'
[ 52%] Generating testnet_blocks.o
[ 52%] Generating blocks.o
Scanning dependencies of target blocks
make[3]: Leaving directory '/home/buildbot/slave/monero-tests-debian-armv8/build/build/debug'
make[3]: Entering directory '/home/buildbot/slave/monero-tests-debian-armv8/build/build/debug'
[ 52%] Building C object src/blocks/CMakeFiles/blocks.dir/blockexports.c.o
[ 53%] Linking C static library libblocks.a
make[3]: Leaving directory '/home/buildbot/slave/monero-tests-debian-armv8/build/build/debug'
[ 53%] Built target blocks
make[3]: Entering directory '/home/buildbot/slave/monero-tests-debian-armv8/build/build/debug'
Scanning dependencies of target obj_blockchain_db
make[3]: Leaving directory '/home/buildbot/slave/monero-tests-debian-armv8/build/build/debug'
make[3]: Entering directory '/home/buildbot/slave/monero-tests-debian-armv8/build/build/debug'
[ 54%] Building CXX object src/blockchain_db/CMakeFiles/obj_blockchain_db.dir/blockchain_db.cpp.o
[ 54%] Building CXX object src/blockchain_db/CMakeFiles/obj_blockchain_db.dir/lmdb/db_lmdb.cpp.o
make[3]: Leaving directory '/home/buildbot/slave/monero-tests-debian-armv8/build/build/debug'
[ 54%] Built target obj_blockchain_db
make[3]: Entering directory '/home/buildbot/slave/monero-tests-debian-armv8/build/build/debug'
Scanning dependencies of target blockchain_db
make[3]: Leaving directory '/home/buildbot/slave/monero-tests-debian-armv8/build/build/debug'
make[3]: Entering directory '/home/buildbot/slave/monero-tests-debian-armv8/build/build/debug'
[ 54%] Linking CXX shared library libblockchain_db.so
make[3]: Leaving directory '/home/buildbot/slave/monero-tests-debian-armv8/build/build/debug'
[ 54%] Built target blockchain_db
make[3]: Entering directory '/home/buildbot/slave/monero-tests-debian-armv8/build/build/debug'
Scanning dependencies of target cryptonote_core
make[3]: Leaving directory '/home/buildbot/slave/monero-tests-debian-armv8/build/build/debug'
make[3]: Entering directory '/home/buildbot/slave/monero-tests-debian-armv8/build/build/debug'
[ 55%] Linking CXX shared library libcryptonote_core.so
make[3]: Leaving directory '/home/buildbot/slave/monero-tests-debian-armv8/build/build/debug'
[ 55%] Built target cryptonote_core
make[3]: Entering directory '/home/buildbot/slave/monero-tests-debian-armv8/build/build/debug'
Scanning dependencies of target obj_mnemonics
make[3]: Leaving directory '/home/buildbot/slave/monero-tests-debian-armv8/build/build/debug'
make[3]: Entering directory '/home/buildbot/slave/monero-tests-debian-armv8/build/build/debug'
[ 55%] Building CXX object src/mnemonics/CMakeFiles/obj_mnemonics.dir/electrum-words.cpp.o
make[3]: Leaving directory '/home/buildbot/slave/monero-tests-debian-armv8/build/build/debug'
[ 55%] Built target obj_mnemonics
make[3]: Entering directory '/home/buildbot/slave/monero-tests-debian-armv8/build/build/debug'
Scanning dependencies of target mnemonics
make[3]: Leaving directory '/home/buildbot/slave/monero-tests-debian-armv8/build/build/debug'
make[3]: Entering directory '/home/buildbot/slave/monero-tests-debian-armv8/build/build/debug'
[ 56%] Linking CXX shared library libmnemonics.so
make[3]: Leaving directory '/home/buildbot/slave/monero-tests-debian-armv8/build/build/debug'
[ 56%] Built target mnemonics
make[3]: Entering directory '/home/buildbot/slave/monero-tests-debian-armv8/build/build/debug'
Scanning dependencies of target obj_rpc
make[3]: Leaving directory '/home/buildbot/slave/monero-tests-debian-armv8/build/build/debug'
make[3]: Entering directory '/home/buildbot/slave/monero-tests-debian-armv8/build/build/debug'
[ 57%] Building CXX object src/rpc/CMakeFiles/obj_rpc.dir/core_rpc_server.cpp.o
make[3]: Leaving directory '/home/buildbot/slave/monero-tests-debian-armv8/build/build/debug'
[ 57%] Built target obj_rpc
make[3]: Entering directory '/home/buildbot/slave/monero-tests-debian-armv8/build/build/debug'
Scanning dependencies of target obj_cryptonote_protocol
make[3]: Leaving directory '/home/buildbot/slave/monero-tests-debian-armv8/build/build/debug'
make[3]: Entering directory '/home/buildbot/slave/monero-tests-debian-armv8/build/build/debug'
[ 57%] Building CXX object src/cryptonote_protocol/CMakeFiles/obj_cryptonote_protocol.dir/cryptonote_protocol_handler-base.cpp.o
make[3]: Leaving directory '/home/buildbot/slave/monero-tests-debian-armv8/build/build/debug'
[ 57%] Built target obj_cryptonote_protocol
make[3]: Entering directory '/home/buildbot/slave/monero-tests-debian-armv8/build/build/debug'
Scanning dependencies of target cryptonote_protocol
make[3]: Leaving directory '/home/buildbot/slave/monero-tests-debian-armv8/build/build/debug'
make[3]: Entering directory '/home/buildbot/slave/monero-tests-debian-armv8/build/build/debug'
[ 57%] Linking CXX shared library libcryptonote_protocol.so
make[3]: Leaving directory '/home/buildbot/slave/monero-tests-debian-armv8/build/build/debug'
[ 57%] Built target cryptonote_protocol
make[3]: Entering directory '/home/buildbot/slave/monero-tests-debian-armv8/build/build/debug'
Scanning dependencies of target rpc
make[3]: Leaving directory '/home/buildbot/slave/monero-tests-debian-armv8/build/build/debug'
make[3]: Entering directory '/home/buildbot/slave/monero-tests-debian-armv8/build/build/debug'
[ 57%] Linking CXX shared library librpc.so
make[3]: Leaving directory '/home/buildbot/slave/monero-tests-debian-armv8/build/build/debug'
[ 57%] Built target rpc
make[3]: Entering directory '/home/buildbot/slave/monero-tests-debian-armv8/build/build/debug'
Scanning dependencies of target obj_wallet
make[3]: Leaving directory '/home/buildbot/slave/monero-tests-debian-armv8/build/build/debug'
make[3]: Entering directory '/home/buildbot/slave/monero-tests-debian-armv8/build/build/debug'
[ 57%] Building CXX object src/wallet/CMakeFiles/obj_wallet.dir/password_container.cpp.o
[ 57%] Building CXX object src/wallet/CMakeFiles/obj_wallet.dir/wallet2.cpp.o
[ 58%] Building CXX object src/wallet/CMakeFiles/obj_wallet.dir/wallet_args.cpp.o
[ 58%] Building CXX object src/wallet/CMakeFiles/obj_wallet.dir/wallet_rpc_server.cpp.o
[ 58%] Building CXX object src/wallet/CMakeFiles/obj_wallet.dir/api/wallet.cpp.o
[ 59%] Building CXX object src/wallet/CMakeFiles/obj_wallet.dir/api/wallet_manager.cpp.o
[ 59%] Building CXX object src/wallet/CMakeFiles/obj_wallet.dir/api/transaction_info.cpp.o
[ 60%] Building CXX object src/wallet/CMakeFiles/obj_wallet.dir/api/transaction_history.cpp.o
[ 60%] Building CXX object src/wallet/CMakeFiles/obj_wallet.dir/api/pending_transaction.cpp.o
[ 60%] Building CXX object src/wallet/CMakeFiles/obj_wallet.dir/api/utils.cpp.o
make[3]: Leaving directory '/home/buildbot/slave/monero-tests-debian-armv8/build/build/debug'
[ 60%] Built target obj_wallet
make[3]: Entering directory '/home/buildbot/slave/monero-tests-debian-armv8/build/build/debug'
Scanning dependencies of target obj_p2p
make[3]: Leaving directory '/home/buildbot/slave/monero-tests-debian-armv8/build/build/debug'
make[3]: Entering directory '/home/buildbot/slave/monero-tests-debian-armv8/build/build/debug'
[ 60%] Building CXX object src/p2p/CMakeFiles/obj_p2p.dir/connection_basic.cpp.o
[ 61%] Building CXX object src/p2p/CMakeFiles/obj_p2p.dir/data_logger.cpp.o
[ 61%] Building CXX object src/p2p/CMakeFiles/obj_p2p.dir/network_throttle-detail.cpp.o
[ 62%] Building CXX object src/p2p/CMakeFiles/obj_p2p.dir/network_throttle.cpp.o
make[3]: Leaving directory '/home/buildbot/slave/monero-tests-debian-armv8/build/build/debug'
[ 62%] Built target obj_p2p
make[3]: Entering directory '/home/buildbot/slave/monero-tests-debian-armv8/build/build/debug'
Scanning dependencies of target p2p
make[3]: Leaving directory '/home/buildbot/slave/monero-tests-debian-armv8/build/build/debug'
make[3]: Entering directory '/home/buildbot/slave/monero-tests-debian-armv8/build/build/debug'
[ 63%] Linking CXX shared library libp2p.so
make[3]: Leaving directory '/home/buildbot/slave/monero-tests-debian-armv8/build/build/debug'
[ 63%] Built target p2p
make[3]: Entering directory '/home/buildbot/slave/monero-tests-debian-armv8/build/build/debug'
Scanning dependencies of target wallet
make[3]: Leaving directory '/home/buildbot/slave/monero-tests-debian-armv8/build/build/debug'
make[3]: Entering directory '/home/buildbot/slave/monero-tests-debian-armv8/build/build/debug'
[ 64%] Linking CXX shared library libwallet.so
make[3]: Leaving directory '/home/buildbot/slave/monero-tests-debian-armv8/build/build/debug'
[ 64%] Built target wallet
make[3]: Entering directory '/home/buildbot/slave/monero-tests-debian-armv8/build/build/debug'
Scanning dependencies of target wallet_rpc_server
make[3]: Leaving directory '/home/buildbot/slave/monero-tests-debian-armv8/build/build/debug'
make[3]: Entering directory '/home/buildbot/slave/monero-tests-debian-armv8/build/build/debug'
[ 64%] Building CXX object src/wallet/CMakeFiles/wallet_rpc_server.dir/wallet_rpc_server.cpp.o
[ 65%] Linking CXX executable ../../bin/monero-wallet-rpc
make[3]: Leaving directory '/home/buildbot/slave/monero-tests-debian-armv8/build/build/debug'
[ 65%] Built target wallet_rpc_server
make[3]: Entering directory '/home/buildbot/slave/monero-tests-debian-armv8/build/build/debug'
Scanning dependencies of target simplewallet
make[3]: Leaving directory '/home/buildbot/slave/monero-tests-debian-armv8/build/build/debug'
make[3]: Entering directory '/home/buildbot/slave/monero-tests-debian-armv8/build/build/debug'
[ 66%] Building CXX object src/simplewallet/CMakeFiles/simplewallet.dir/simplewallet.cpp.o
[ 66%] Linking CXX executable ../../bin/monero-wallet-cli
make[3]: Leaving directory '/home/buildbot/slave/monero-tests-debian-armv8/build/build/debug'
[ 66%] Built target simplewallet
make[3]: Entering directory '/home/buildbot/slave/monero-tests-debian-armv8/build/build/debug'
Scanning dependencies of target obj_daemonizer
make[3]: Leaving directory '/home/buildbot/slave/monero-tests-debian-armv8/build/build/debug'
make[3]: Entering directory '/home/buildbot/slave/monero-tests-debian-armv8/build/build/debug'
[ 67%] Building CXX object src/daemonizer/CMakeFiles/obj_daemonizer.dir/posix_fork.cpp.o
make[3]: Leaving directory '/home/buildbot/slave/monero-tests-debian-armv8/build/build/debug'
[ 67%] Built target obj_daemonizer
make[3]: Entering directory '/home/buildbot/slave/monero-tests-debian-armv8/build/build/debug'
Scanning dependencies of target daemonizer
make[3]: Leaving directory '/home/buildbot/slave/monero-tests-debian-armv8/build/build/debug'
make[3]: Entering directory '/home/buildbot/slave/monero-tests-debian-armv8/build/build/debug'
[ 68%] Linking CXX shared library libdaemonizer.so
make[3]: Leaving directory '/home/buildbot/slave/monero-tests-debian-armv8/build/build/debug'
[ 68%] Built target daemonizer
make[3]: Entering directory '/home/buildbot/slave/monero-tests-debian-armv8/build/build/debug'
[ 68%] Generating blocksdat.o
Scanning dependencies of target daemon
make[3]: Leaving directory '/home/buildbot/slave/monero-tests-debian-armv8/build/build/debug'
make[3]: Entering directory '/home/buildbot/slave/monero-tests-debian-armv8/build/build/debug'
[ 69%] Building CXX object src/daemon/CMakeFiles/daemon.dir/command_parser_executor.cpp.o
[ 69%] Building CXX object src/daemon/CMakeFiles/daemon.dir/command_server.cpp.o
[ 70%] Building CXX object src/daemon/CMakeFiles/daemon.dir/daemon.cpp.o
[ 70%] Building CXX object src/daemon/CMakeFiles/daemon.dir/executor.cpp.o
[ 70%] Building CXX object src/daemon/CMakeFiles/daemon.dir/main.cpp.o
[ 71%] Building CXX object src/daemon/CMakeFiles/daemon.dir/rpc_command_executor.cpp.o
[ 71%] Linking CXX executable ../../bin/monerod
make[3]: Leaving directory '/home/buildbot/slave/monero-tests-debian-armv8/build/build/debug'
[ 71%] Built target daemon
make[3]: Entering directory '/home/buildbot/slave/monero-tests-debian-armv8/build/build/debug'
Scanning dependencies of target blockchain_import
make[3]: Leaving directory '/home/buildbot/slave/monero-tests-debian-armv8/build/build/debug'
make[3]: Entering directory '/home/buildbot/slave/monero-tests-debian-armv8/build/build/debug'
[ 72%] Building CXX object src/blockchain_utilities/CMakeFiles/blockchain_import.dir/blockchain_import.cpp.o
[ 72%] Building CXX object src/blockchain_utilities/CMakeFiles/blockchain_import.dir/bootstrap_file.cpp.o
[ 73%] Building CXX object src/blockchain_utilities/CMakeFiles/blockchain_import.dir/blocksdat_file.cpp.o
[ 73%] Linking CXX executable ../../bin/monero-blockchain-import
make[3]: Leaving directory '/home/buildbot/slave/monero-tests-debian-armv8/build/build/debug'
[ 73%] Built target blockchain_import
make[3]: Entering directory '/home/buildbot/slave/monero-tests-debian-armv8/build/build/debug'
Scanning dependencies of target cn_deserialize
make[3]: Leaving directory '/home/buildbot/slave/monero-tests-debian-armv8/build/build/debug'
make[3]: Entering directory '/home/buildbot/slave/monero-tests-debian-armv8/build/build/debug'
[ 73%] Building CXX object src/blockchain_utilities/CMakeFiles/cn_deserialize.dir/cn_deserialize.cpp.o
[ 73%] Linking CXX executable ../../bin/cn_deserialize
make[3]: Leaving directory '/home/buildbot/slave/monero-tests-debian-armv8/build/build/debug'
[ 73%] Built target cn_deserialize
make[3]: Entering directory '/home/buildbot/slave/monero-tests-debian-armv8/build/build/debug'
Scanning dependencies of target blockchain_export
make[3]: Leaving directory '/home/buildbot/slave/monero-tests-debian-armv8/build/build/debug'
make[3]: Entering directory '/home/buildbot/slave/monero-tests-debian-armv8/build/build/debug'
[ 73%] Building CXX object src/blockchain_utilities/CMakeFiles/blockchain_export.dir/blockchain_export.cpp.o
[ 74%] Building CXX object src/blockchain_utilities/CMakeFiles/blockchain_export.dir/bootstrap_file.cpp.o
[ 74%] Building CXX object src/blockchain_utilities/CMakeFiles/blockchain_export.dir/blocksdat_file.cpp.o
[ 74%] Linking CXX executable ../../bin/monero-blockchain-export
make[3]: Leaving directory '/home/buildbot/slave/monero-tests-debian-armv8/build/build/debug'
[ 74%] Built target blockchain_export
make[3]: Entering directory '/home/buildbot/slave/monero-tests-debian-armv8/build/build/debug'
Scanning dependencies of target hash-target-tests
make[3]: Leaving directory '/home/buildbot/slave/monero-tests-debian-armv8/build/build/debug'
make[3]: Entering directory '/home/buildbot/slave/monero-tests-debian-armv8/build/build/debug'
[ 74%] Building CXX object tests/CMakeFiles/hash-target-tests.dir/hash-target.cpp.o
[ 75%] Linking CXX executable hash-target-tests
make[3]: Leaving directory '/home/buildbot/slave/monero-tests-debian-armv8/build/build/debug'
[ 75%] Built target hash-target-tests
make[3]: Entering directory '/home/buildbot/slave/monero-tests-debian-armv8/build/build/debug'
Scanning dependencies of target gtest
make[3]: Leaving directory '/home/buildbot/slave/monero-tests-debian-armv8/build/build/debug'
make[3]: Entering directory '/home/buildbot/slave/monero-tests-debian-armv8/build/build/debug'
[ 76%] Building CXX object tests/gtest/CMakeFiles/gtest.dir/src/gtest-all.cc.o
[ 76%] Linking CXX static library libgtest.a
make[3]: Leaving directory '/home/buildbot/slave/monero-tests-debian-armv8/build/build/debug'
[ 76%] Built target gtest
make[3]: Entering directory '/home/buildbot/slave/monero-tests-debian-armv8/build/build/debug'
Scanning dependencies of target gtest_main
make[3]: Leaving directory '/home/buildbot/slave/monero-tests-debian-armv8/build/build/debug'
make[3]: Entering directory '/home/buildbot/slave/monero-tests-debian-armv8/build/build/debug'
[ 76%] Building CXX object tests/gtest/CMakeFiles/gtest_main.dir/src/gtest_main.cc.o
In file included from /home/buildbot/slave/monero-tests-debian-armv8/build/tests/gtest/include/gtest/internal/gtest-internal.h:40:0,
                 from /home/buildbot/slave/monero-tests-debian-armv8/build/tests/gtest/include/gtest/gtest.h:58,
                 from /home/buildbot/slave/monero-tests-debian-armv8/build/tests/gtest/src/gtest_main.cc:32:
/home/buildbot/slave/monero-tests-debian-armv8/build/tests/gtest/include/gtest/internal/gtest-port.h:309:5: warning: "_MSC_VER" is not defined [-Wundef]
 #if _MSC_VER >= 1500
     ^~~~~~~~
/home/buildbot/slave/monero-tests-debian-armv8/build/tests/gtest/include/gtest/internal/gtest-port.h:393:5: warning: "GTEST_OS_WINDOWS" is not defined [-Wundef]
 #if GTEST_OS_WINDOWS
     ^~~~~~~~~~~~~~~~
In file included from /home/buildbot/slave/monero-tests-debian-armv8/build/tests/gtest/include/gtest/internal/gtest-internal.h:40:0,
                 from /home/buildbot/slave/monero-tests-debian-armv8/build/tests/gtest/include/gtest/gtest.h:58,
                 from /home/buildbot/slave/monero-tests-debian-armv8/build/tests/gtest/src/gtest_main.cc:32:
/home/buildbot/slave/monero-tests-debian-armv8/build/tests/gtest/include/gtest/internal/gtest-port.h:411:5: warning: "GTEST_OS_LINUX_ANDROID" is not defined [-Wundef]
 #if GTEST_OS_LINUX_ANDROID
     ^~~~~~~~~~~~~~~~~~~~~~
/home/buildbot/slave/monero-tests-debian-armv8/build/tests/gtest/include/gtest/internal/gtest-port.h:418:6: warning: "GTEST_OS_LINUX_ANDROID" is not defined [-Wundef]
 # if GTEST_OS_LINUX_ANDROID
      ^~~~~~~~~~~~~~~~~~~~~~
/home/buildbot/slave/monero-tests-debian-armv8/build/tests/gtest/include/gtest/internal/gtest-port.h:426:5: warning: "GTEST_USES_PCRE" is not defined [-Wundef]
 #if GTEST_USES_PCRE
     ^~~~~~~~~~~~~~~
/home/buildbot/slave/monero-tests-debian-armv8/build/tests/gtest/include/gtest/internal/gtest-port.h:422:32: warning: "GTEST_OS_WINDOWS" is not defined [-Wundef]
 #  define GTEST_HAS_POSIX_RE (!GTEST_OS_WINDOWS)
                                ^
/home/buildbot/slave/monero-tests-debian-armv8/build/tests/gtest/include/gtest/internal/gtest-port.h:429:7: note: in expansion of macro ‘GTEST_HAS_POSIX_RE’
 #elif GTEST_HAS_POSIX_RE
       ^~~~~~~~~~~~~~~~~~
In file included from /home/buildbot/slave/monero-tests-debian-armv8/build/tests/gtest/include/gtest/internal/gtest-internal.h:40:0,
                 from /home/buildbot/slave/monero-tests-debian-armv8/build/tests/gtest/include/gtest/gtest.h:58,
                 from /home/buildbot/slave/monero-tests-debian-armv8/build/tests/gtest/src/gtest_main.cc:32:
/home/buildbot/slave/monero-tests-debian-armv8/build/tests/gtest/include/gtest/internal/gtest-port.h:554:8: warning: "GTEST_OS_LINUX_ANDROID" is not defined [-Wundef]
 #   if GTEST_OS_LINUX_ANDROID && defined(_STLPORT_MAJOR) && \
        ^~~~~~~~~~~~~~~~~~~~~~
In file included from /home/buildbot/slave/monero-tests-debian-armv8/build/tests/gtest/include/gtest/internal/gtest-internal.h:40:0,
                 from /home/buildbot/slave/monero-tests-debian-armv8/build/tests/gtest/include/gtest/gtest.h:58,
                 from /home/buildbot/slave/monero-tests-debian-armv8/build/tests/gtest/src/gtest_main.cc:32:
/home/buildbot/slave/monero-tests-debian-armv8/build/tests/gtest/include/gtest/internal/gtest-port.h:619:6: warning: "_MSC_VER" is not defined [-Wundef]
 # if _MSC_VER
      ^~~~~~~~
/home/buildbot/slave/monero-tests-debian-armv8/build/tests/gtest/include/gtest/internal/gtest-port.h:629:6: warning: "GTEST_OS_LINUX_ANDROID" is not defined [-Wundef]
 # if GTEST_OS_LINUX_ANDROID && defined(_STLPORT_MAJOR)
      ^~~~~~~~~~~~~~~~~~~~~~
/home/buildbot/slave/monero-tests-debian-armv8/build/tests/gtest/include/gtest/internal/gtest-port.h:654:11: warning: "GTEST_OS_QNX" is not defined [-Wundef]
       && !GTEST_OS_QNX && !defined(_LIBCPP_VERSION)) || _MSC_VER >= 1600
           ^~~~~~~~~~~~
In file included from /home/buildbot/slave/monero-tests-debian-armv8/build/tests/gtest/include/gtest/internal/gtest-internal.h:40:0,
                 from /home/buildbot/slave/monero-tests-debian-armv8/build/tests/gtest/include/gtest/gtest.h:58,
                 from /home/buildbot/slave/monero-tests-debian-armv8/build/tests/gtest/src/gtest_main.cc:32:
/home/buildbot/slave/monero-tests-debian-armv8/build/tests/gtest/include/gtest/internal/gtest-port.h:756:7: warning: "GTEST_OS_LINUX_ANDROID" is not defined [-Wundef]
 #  if GTEST_OS_LINUX_ANDROID
       ^~~~~~~~~~~~~~~~~~~~~~
/home/buildbot/slave/monero-tests-debian-armv8/build/tests/gtest/include/gtest/internal/gtest-port.h:777:6: warning: "GTEST_OS_WINDOWS_MOBILE" is not defined [-Wundef]
 # if GTEST_OS_WINDOWS_MOBILE || GTEST_OS_SYMBIAN || \
      ^~~~~~~~~~~~~~~~~~~~~~~
/home/buildbot/slave/monero-tests-debian-armv8/build/tests/gtest/include/gtest/internal/gtest-port.h:777:33: warning: "GTEST_OS_SYMBIAN" is not defined [-Wundef]
 # if GTEST_OS_WINDOWS_MOBILE || GTEST_OS_SYMBIAN || \
                                 ^~~~~~~~~~~~~~~~
/home/buildbot/slave/monero-tests-debian-armv8/build/tests/gtest/include/gtest/internal/gtest-port.h:778:5: warning: "GTEST_OS_WINDOWS_PHONE" is not defined [-Wundef]
     GTEST_OS_WINDOWS_PHONE || GTEST_OS_WINDOWS_RT
     ^~~~~~~~~~~~~~~~~~~~~~
/home/buildbot/slave/monero-tests-debian-armv8/build/tests/gtest/include/gtest/internal/gtest-port.h:778:31: warning: "GTEST_OS_WINDOWS_RT" is not defined [-Wundef]
     GTEST_OS_WINDOWS_PHONE || GTEST_OS_WINDOWS_RT
                               ^~~~~~~~~~~~~~~~~~~
In file included from /home/buildbot/slave/monero-tests-debian-armv8/build/tests/gtest/include/gtest/internal/gtest-internal.h:40:0,
                 from /home/buildbot/slave/monero-tests-debian-armv8/build/tests/gtest/include/gtest/gtest.h:58,
                 from /home/buildbot/slave/monero-tests-debian-armv8/build/tests/gtest/src/gtest_main.cc:32:
/home/buildbot/slave/monero-tests-debian-armv8/build/tests/gtest/include/gtest/internal/gtest-port.h:522:8: warning: "GTEST_OS_LINUX_ANDROID" is not defined [-Wundef]
     (!(GTEST_OS_LINUX_ANDROID || GTEST_OS_CYGWIN || GTEST_OS_SOLARIS))
        ^
/home/buildbot/slave/monero-tests-debian-armv8/build/tests/gtest/include/gtest/internal/gtest-port.h:530:6: note: in expansion of macro ‘GTEST_HAS_STD_WSTRING’
     (GTEST_HAS_STD_WSTRING && GTEST_HAS_GLOBAL_STRING)
      ^~~~~~~~~~~~~~~~~~~~~
/home/buildbot/slave/monero-tests-debian-armv8/build/tests/gtest/include/gtest/internal/gtest-port.h:1100:5: note: in expansion of macro ‘GTEST_HAS_GLOBAL_WSTRING’
 #if GTEST_HAS_GLOBAL_WSTRING
     ^~~~~~~~~~~~~~~~~~~~~~~~
/home/buildbot/slave/monero-tests-debian-armv8/build/tests/gtest/include/gtest/internal/gtest-port.h:522:34: warning: "GTEST_OS_CYGWIN" is not defined [-Wundef]
     (!(GTEST_OS_LINUX_ANDROID || GTEST_OS_CYGWIN || GTEST_OS_SOLARIS))
                                  ^
/home/buildbot/slave/monero-tests-debian-armv8/build/tests/gtest/include/gtest/internal/gtest-port.h:530:6: note: in expansion of macro ‘GTEST_HAS_STD_WSTRING’
     (GTEST_HAS_STD_WSTRING && GTEST_HAS_GLOBAL_STRING)
      ^~~~~~~~~~~~~~~~~~~~~
/home/buildbot/slave/monero-tests-debian-armv8/build/tests/gtest/include/gtest/internal/gtest-port.h:1100:5: note: in expansion of macro ‘GTEST_HAS_GLOBAL_WSTRING’
 #if GTEST_HAS_GLOBAL_WSTRING
     ^~~~~~~~~~~~~~~~~~~~~~~~
/home/buildbot/slave/monero-tests-debian-armv8/build/tests/gtest/include/gtest/internal/gtest-port.h:522:53: warning: "GTEST_OS_SOLARIS" is not defined [-Wundef]
     (!(GTEST_OS_LINUX_ANDROID || GTEST_OS_CYGWIN || GTEST_OS_SOLARIS))
                                                     ^
/home/buildbot/slave/monero-tests-debian-armv8/build/tests/gtest/include/gtest/internal/gtest-port.h:530:6: note: in expansion of macro ‘GTEST_HAS_STD_WSTRING’
     (GTEST_HAS_STD_WSTRING && GTEST_HAS_GLOBAL_STRING)
      ^~~~~~~~~~~~~~~~~~~~~
/home/buildbot/slave/monero-tests-debian-armv8/build/tests/gtest/include/gtest/internal/gtest-port.h:1100:5: note: in expansion of macro ‘GTEST_HAS_GLOBAL_WSTRING’
 #if GTEST_HAS_GLOBAL_WSTRING
     ^~~~~~~~~~~~~~~~~~~~~~~~
/home/buildbot/slave/monero-tests-debian-armv8/build/tests/gtest/include/gtest/internal/gtest-port.h:522:8: warning: "GTEST_OS_LINUX_ANDROID" is not defined [-Wundef]
     (!(GTEST_OS_LINUX_ANDROID || GTEST_OS_CYGWIN || GTEST_OS_SOLARIS))
        ^
/home/buildbot/slave/monero-tests-debian-armv8/build/tests/gtest/include/gtest/internal/gtest-port.h:1102:7: note: in expansion of macro ‘GTEST_HAS_STD_WSTRING’
 #elif GTEST_HAS_STD_WSTRING
       ^~~~~~~~~~~~~~~~~~~~~
/home/buildbot/slave/monero-tests-debian-armv8/build/tests/gtest/include/gtest/internal/gtest-port.h:522:34: warning: "GTEST_OS_CYGWIN" is not defined [-Wundef]
     (!(GTEST_OS_LINUX_ANDROID || GTEST_OS_CYGWIN || GTEST_OS_SOLARIS))
                                  ^
/home/buildbot/slave/monero-tests-debian-armv8/build/tests/gtest/include/gtest/internal/gtest-port.h:1102:7: note: in expansion of macro ‘GTEST_HAS_STD_WSTRING’
 #elif GTEST_HAS_STD_WSTRING
       ^~~~~~~~~~~~~~~~~~~~~
/home/buildbot/slave/monero-tests-debian-armv8/build/tests/gtest/include/gtest/internal/gtest-port.h:522:53: warning: "GTEST_OS_SOLARIS" is not defined [-Wundef]
     (!(GTEST_OS_LINUX_ANDROID || GTEST_OS_CYGWIN || GTEST_OS_SOLARIS))
                                                     ^
/home/buildbot/slave/monero-tests-debian-armv8/build/tests/gtest/include/gtest/internal/gtest-port.h:1102:7: note: in expansion of macro ‘GTEST_HAS_STD_WSTRING’
 #elif GTEST_HAS_STD_WSTRING
       ^~~~~~~~~~~~~~~~~~~~~
In file included from /home/buildbot/slave/monero-tests-debian-armv8/build/tests/gtest/include/gtest/internal/gtest-internal.h:40:0,
                 from /home/buildbot/slave/monero-tests-debian-armv8/build/tests/gtest/include/gtest/gtest.h:58,
                 from /home/buildbot/slave/monero-tests-debian-armv8/build/tests/gtest/src/gtest_main.cc:32:
/home/buildbot/slave/monero-tests-debian-armv8/build/tests/gtest/include/gtest/internal/gtest-port.h:1397:5: warning: "GTEST_HAS_DOWNCAST_" is not defined [-Wundef]
 #if GTEST_HAS_DOWNCAST_
     ^~~~~~~~~~~~~~~~~~~
/home/buildbot/slave/monero-tests-debian-armv8/build/tests/gtest/include/gtest/internal/gtest-port.h:917:6: warning: "GTEST_HAS_MUTEX_AND_THREAD_LOCAL_" is not defined [-Wundef]
     (GTEST_HAS_MUTEX_AND_THREAD_LOCAL_ \
      ^
/home/buildbot/slave/monero-tests-debian-armv8/build/tests/gtest/include/gtest/internal/gtest-port.h:917:6: note: in definition of macro ‘GTEST_IS_THREADSAFE’
     (GTEST_HAS_MUTEX_AND_THREAD_LOCAL_ \
      ^~~~~~~~~~~~~~~~~~~~~~~~~~~~~~~~~
/home/buildbot/slave/monero-tests-debian-armv8/build/tests/gtest/include/gtest/internal/gtest-port.h:918:10: warning: "GTEST_OS_WINDOWS" is not defined [-Wundef]
      || (GTEST_OS_WINDOWS && !GTEST_OS_WINDOWS_PHONE && !GTEST_OS_WINDOWS_RT) \
          ^
/home/buildbot/slave/monero-tests-debian-armv8/build/tests/gtest/include/gtest/internal/gtest-port.h:1443:5: note: in expansion of macro ‘GTEST_IS_THREADSAFE’
 #if GTEST_IS_THREADSAFE
     ^~~~~~~~~~~~~~~~~~~
/home/buildbot/slave/monero-tests-debian-armv8/build/tests/gtest/include/gtest/internal/gtest-port.h:1457:6: warning: "GTEST_HAS_NOTIFICATION_" is not defined [-Wundef]
 # if GTEST_HAS_NOTIFICATION_
      ^~~~~~~~~~~~~~~~~~~~~~~
/home/buildbot/slave/monero-tests-debian-armv8/build/tests/gtest/include/gtest/internal/gtest-port.h:1559:28: warning: "GTEST_OS_WINDOWS_MINGW" is not defined [-Wundef]
 # if GTEST_HAS_PTHREAD && !GTEST_OS_WINDOWS_MINGW
                            ^~~~~~~~~~~~~~~~~~~~~~
/home/buildbot/slave/monero-tests-debian-armv8/build/tests/gtest/include/gtest/internal/gtest-port.h:1640:6: warning: "GTEST_HAS_MUTEX_AND_THREAD_LOCAL_" is not defined [-Wundef]
 # if GTEST_HAS_MUTEX_AND_THREAD_LOCAL_
      ^~~~~~~~~~~~~~~~~~~~~~~~~~~~~~~~~
/home/buildbot/slave/monero-tests-debian-armv8/build/tests/gtest/include/gtest/internal/gtest-port.h:1644:8: warning: "GTEST_OS_WINDOWS" is not defined [-Wundef]
 # elif GTEST_OS_WINDOWS && !GTEST_OS_WINDOWS_PHONE && !GTEST_OS_WINDOWS_RT
        ^~~~~~~~~~~~~~~~
/home/buildbot/slave/monero-tests-debian-armv8/build/tests/gtest/include/gtest/internal/gtest-port.h:2233:5: warning: "GTEST_OS_WINDOWS" is not defined [-Wundef]
 #if GTEST_OS_WINDOWS
     ^~~~~~~~~~~~~~~~
/home/buildbot/slave/monero-tests-debian-armv8/build/tests/gtest/include/gtest/internal/gtest-port.h:2301:5: warning: "GTEST_OS_WINDOWS" is not defined [-Wundef]
 #if GTEST_OS_WINDOWS
     ^~~~~~~~~~~~~~~~
/home/buildbot/slave/monero-tests-debian-armv8/build/tests/gtest/include/gtest/internal/gtest-port.h:2364:6: warning: "GTEST_OS_WINDOWS_MOBILE" is not defined [-Wundef]
 #if !GTEST_OS_WINDOWS_MOBILE && !GTEST_OS_WINDOWS_PHONE && !GTEST_OS_WINDOWS_RT
      ^~~~~~~~~~~~~~~~~~~~~~~
/home/buildbot/slave/monero-tests-debian-armv8/build/tests/gtest/include/gtest/internal/gtest-port.h:2364:34: warning: "GTEST_OS_WINDOWS_PHONE" is not defined [-Wundef]
 #if !GTEST_OS_WINDOWS_MOBILE && !GTEST_OS_WINDOWS_PHONE && !GTEST_OS_WINDOWS_RT
                                  ^~~~~~~~~~~~~~~~~~~~~~
/home/buildbot/slave/monero-tests-debian-armv8/build/tests/gtest/include/gtest/internal/gtest-port.h:2364:61: warning: "GTEST_OS_WINDOWS_RT" is not defined [-Wundef]
 #if !GTEST_OS_WINDOWS_MOBILE && !GTEST_OS_WINDOWS_PHONE && !GTEST_OS_WINDOWS_RT
                                                             ^~~~~~~~~~~~~~~~~~~
/home/buildbot/slave/monero-tests-debian-armv8/build/tests/gtest/include/gtest/internal/gtest-port.h:2370:6: warning: "GTEST_OS_WINDOWS_MOBILE" is not defined [-Wundef]
 #if !GTEST_OS_WINDOWS_MOBILE
      ^~~~~~~~~~~~~~~~~~~~~~~
/home/buildbot/slave/monero-tests-debian-armv8/build/tests/gtest/include/gtest/internal/gtest-port.h:2377:6: warning: "GTEST_OS_WINDOWS_MOBILE" is not defined [-Wundef]
 #if !GTEST_OS_WINDOWS_MOBILE
      ^~~~~~~~~~~~~~~~~~~~~~~
/home/buildbot/slave/monero-tests-debian-armv8/build/tests/gtest/include/gtest/internal/gtest-port.h:2388:5: warning: "GTEST_OS_WINDOWS_MOBILE" is not defined [-Wundef]
 #if GTEST_OS_WINDOWS_MOBILE || GTEST_OS_WINDOWS_PHONE | GTEST_OS_WINDOWS_RT
     ^~~~~~~~~~~~~~~~~~~~~~~
/home/buildbot/slave/monero-tests-debian-armv8/build/tests/gtest/include/gtest/internal/gtest-port.h:2388:32: warning: "GTEST_OS_WINDOWS_PHONE" is not defined [-Wundef]
 #if GTEST_OS_WINDOWS_MOBILE || GTEST_OS_WINDOWS_PHONE | GTEST_OS_WINDOWS_RT
                                ^~~~~~~~~~~~~~~~~~~~~~
/home/buildbot/slave/monero-tests-debian-armv8/build/tests/gtest/include/gtest/internal/gtest-port.h:2388:57: warning: "GTEST_OS_WINDOWS_RT" is not defined [-Wundef]
 #if GTEST_OS_WINDOWS_MOBILE || GTEST_OS_WINDOWS_PHONE | GTEST_OS_WINDOWS_RT
                                                         ^~~~~~~~~~~~~~~~~~~
/home/buildbot/slave/monero-tests-debian-armv8/build/tests/gtest/include/gtest/internal/gtest-port.h:2404:5: warning: "GTEST_OS_WINDOWS_MOBILE" is not defined [-Wundef]
 #if GTEST_OS_WINDOWS_MOBILE
     ^~~~~~~~~~~~~~~~~~~~~~~
/home/buildbot/slave/monero-tests-debian-armv8/build/tests/gtest/include/gtest/internal/gtest-port.h:2420:5: warning: "_MSC_VER" is not defined [-Wundef]
 #if _MSC_VER >= 1400 && !GTEST_OS_WINDOWS_MOBILE
     ^~~~~~~~
/home/buildbot/slave/monero-tests-debian-armv8/build/tests/gtest/include/gtest/internal/gtest-port.h:2484:5: warning: "GTEST_OS_WINDOWS" is not defined [-Wundef]
 #if GTEST_OS_WINDOWS
     ^~~~~~~~~~~~~~~~
In file included from /home/buildbot/slave/monero-tests-debian-armv8/build/tests/gtest/include/gtest/internal/gtest-internal.h:63:0,
                 from /home/buildbot/slave/monero-tests-debian-armv8/build/tests/gtest/include/gtest/gtest.h:58,
                 from /home/buildbot/slave/monero-tests-debian-armv8/build/tests/gtest/src/gtest_main.cc:32:
/home/buildbot/slave/monero-tests-debian-armv8/build/tests/gtest/include/gtest/gtest-message.h:105:5: warning: "GTEST_OS_SYMBIAN" is not defined [-Wundef]
 #if GTEST_OS_SYMBIAN
     ^~~~~~~~~~~~~~~~
In file included from /home/buildbot/slave/monero-tests-debian-armv8/build/tests/gtest/include/gtest/internal/gtest-internal.h:40:0,
                 from /home/buildbot/slave/monero-tests-debian-armv8/build/tests/gtest/include/gtest/gtest.h:58,
                 from /home/buildbot/slave/monero-tests-debian-armv8/build/tests/gtest/src/gtest_main.cc:32:
/home/buildbot/slave/monero-tests-debian-armv8/build/tests/gtest/include/gtest/internal/gtest-port.h:522:8: warning: "GTEST_OS_LINUX_ANDROID" is not defined [-Wundef]
     (!(GTEST_OS_LINUX_ANDROID || GTEST_OS_CYGWIN || GTEST_OS_SOLARIS))
        ^
/home/buildbot/slave/monero-tests-debian-armv8/build/tests/gtest/include/gtest/gtest-message.h:180:5: note: in expansion of macro ‘GTEST_HAS_STD_WSTRING’
 #if GTEST_HAS_STD_WSTRING
     ^~~~~~~~~~~~~~~~~~~~~
/home/buildbot/slave/monero-tests-debian-armv8/build/tests/gtest/include/gtest/internal/gtest-port.h:522:34: warning: "GTEST_OS_CYGWIN" is not defined [-Wundef]
     (!(GTEST_OS_LINUX_ANDROID || GTEST_OS_CYGWIN || GTEST_OS_SOLARIS))
                                  ^
/home/buildbot/slave/monero-tests-debian-armv8/build/tests/gtest/include/gtest/gtest-message.h:180:5: note: in expansion of macro ‘GTEST_HAS_STD_WSTRING’
 #if GTEST_HAS_STD_WSTRING
     ^~~~~~~~~~~~~~~~~~~~~
/home/buildbot/slave/monero-tests-debian-armv8/build/tests/gtest/include/gtest/internal/gtest-port.h:522:53: warning: "GTEST_OS_SOLARIS" is not defined [-Wundef]
     (!(GTEST_OS_LINUX_ANDROID || GTEST_OS_CYGWIN || GTEST_OS_SOLARIS))
                                                     ^
/home/buildbot/slave/monero-tests-debian-armv8/build/tests/gtest/include/gtest/gtest-message.h:180:5: note: in expansion of macro ‘GTEST_HAS_STD_WSTRING’
 #if GTEST_HAS_STD_WSTRING
     ^~~~~~~~~~~~~~~~~~~~~
/home/buildbot/slave/monero-tests-debian-armv8/build/tests/gtest/include/gtest/internal/gtest-port.h:522:8: warning: "GTEST_OS_LINUX_ANDROID" is not defined [-Wundef]
     (!(GTEST_OS_LINUX_ANDROID || GTEST_OS_CYGWIN || GTEST_OS_SOLARIS))
        ^
/home/buildbot/slave/monero-tests-debian-armv8/build/tests/gtest/include/gtest/internal/gtest-port.h:530:6: note: in expansion of macro ‘GTEST_HAS_STD_WSTRING’
     (GTEST_HAS_STD_WSTRING && GTEST_HAS_GLOBAL_STRING)
      ^~~~~~~~~~~~~~~~~~~~~
/home/buildbot/slave/monero-tests-debian-armv8/build/tests/gtest/include/gtest/gtest-message.h:186:5: note: in expansion of macro ‘GTEST_HAS_GLOBAL_WSTRING’
 #if GTEST_HAS_GLOBAL_WSTRING
     ^~~~~~~~~~~~~~~~~~~~~~~~
/home/buildbot/slave/monero-tests-debian-armv8/build/tests/gtest/include/gtest/internal/gtest-port.h:522:34: warning: "GTEST_OS_CYGWIN" is not defined [-Wundef]
     (!(GTEST_OS_LINUX_ANDROID || GTEST_OS_CYGWIN || GTEST_OS_SOLARIS))
                                  ^
/home/buildbot/slave/monero-tests-debian-armv8/build/tests/gtest/include/gtest/internal/gtest-port.h:530:6: note: in expansion of macro ‘GTEST_HAS_STD_WSTRING’
     (GTEST_HAS_STD_WSTRING && GTEST_HAS_GLOBAL_STRING)
      ^~~~~~~~~~~~~~~~~~~~~
/home/buildbot/slave/monero-tests-debian-armv8/build/tests/gtest/include/gtest/gtest-message.h:186:5: note: in expansion of macro ‘GTEST_HAS_GLOBAL_WSTRING’
 #if GTEST_HAS_GLOBAL_WSTRING
     ^~~~~~~~~~~~~~~~~~~~~~~~
/home/buildbot/slave/monero-tests-debian-armv8/build/tests/gtest/include/gtest/internal/gtest-port.h:522:53: warning: "GTEST_OS_SOLARIS" is not defined [-Wundef]
     (!(GTEST_OS_LINUX_ANDROID || GTEST_OS_CYGWIN || GTEST_OS_SOLARIS))
                                                     ^
/home/buildbot/slave/monero-tests-debian-armv8/build/tests/gtest/include/gtest/internal/gtest-port.h:530:6: note: in expansion of macro ‘GTEST_HAS_STD_WSTRING’
     (GTEST_HAS_STD_WSTRING && GTEST_HAS_GLOBAL_STRING)
      ^~~~~~~~~~~~~~~~~~~~~
/home/buildbot/slave/monero-tests-debian-armv8/build/tests/gtest/include/gtest/gtest-message.h:186:5: note: in expansion of macro ‘GTEST_HAS_GLOBAL_WSTRING’
 #if GTEST_HAS_GLOBAL_WSTRING
     ^~~~~~~~~~~~~~~~~~~~~~~~
In file included from /home/buildbot/slave/monero-tests-debian-armv8/build/tests/gtest/include/gtest/internal/gtest-internal.h:63:0,
                 from /home/buildbot/slave/monero-tests-debian-armv8/build/tests/gtest/include/gtest/gtest.h:58,
                 from /home/buildbot/slave/monero-tests-debian-armv8/build/tests/gtest/src/gtest_main.cc:32:
/home/buildbot/slave/monero-tests-debian-armv8/build/tests/gtest/include/gtest/gtest-message.h:200:5: warning: "GTEST_OS_SYMBIAN" is not defined [-Wundef]
 #if GTEST_OS_SYMBIAN
     ^~~~~~~~~~~~~~~~
In file included from /home/buildbot/slave/monero-tests-debian-armv8/build/tests/gtest/include/gtest/internal/gtest-internal.h:64:0,
                 from /home/buildbot/slave/monero-tests-debian-armv8/build/tests/gtest/include/gtest/gtest.h:58,
                 from /home/buildbot/slave/monero-tests-debian-armv8/build/tests/gtest/src/gtest_main.cc:32:
/home/buildbot/slave/monero-tests-debian-armv8/build/tests/gtest/include/gtest/internal/gtest-string.h:71:5: warning: "GTEST_OS_WINDOWS_MOBILE" is not defined [-Wundef]
 #if GTEST_OS_WINDOWS_MOBILE
     ^~~~~~~~~~~~~~~~~~~~~~~
In file included from /home/buildbot/slave/monero-tests-debian-armv8/build/tests/gtest/include/gtest/gtest.h:58:0,
                 from /home/buildbot/slave/monero-tests-debian-armv8/build/tests/gtest/src/gtest_main.cc:32:
/home/buildbot/slave/monero-tests-debian-armv8/build/tests/gtest/include/gtest/internal/gtest-internal.h:487:5: warning: "GTEST_OS_WINDOWS" is not defined [-Wundef]
 #if GTEST_OS_WINDOWS
     ^~~~~~~~~~~~~~~~
In file included from /home/buildbot/slave/monero-tests-debian-armv8/build/tests/gtest/include/gtest/gtest.h:60:0,
                 from /home/buildbot/slave/monero-tests-debian-armv8/build/tests/gtest/src/gtest_main.cc:32:
/home/buildbot/slave/monero-tests-debian-armv8/build/tests/gtest/include/gtest/gtest-death-test.h:201:7: warning: "GTEST_OS_WINDOWS" is not defined [-Wundef]
 # if !GTEST_OS_WINDOWS
       ^~~~~~~~~~~~~~~~
In file included from /home/buildbot/slave/monero-tests-debian-armv8/build/tests/gtest/include/gtest/gtest.h:62:0,
                 from /home/buildbot/slave/monero-tests-debian-armv8/build/tests/gtest/src/gtest_main.cc:32:
/home/buildbot/slave/monero-tests-debian-armv8/build/tests/gtest/include/gtest/gtest-param-test.h:184:6: warning: "GTEST_OS_SYMBIAN" is not defined [-Wundef]
 #if !GTEST_OS_SYMBIAN
      ^~~~~~~~~~~~~~~~
In file included from /home/buildbot/slave/monero-tests-debian-armv8/build/tests/gtest/include/gtest/internal/gtest-internal.h:40:0,
                 from /home/buildbot/slave/monero-tests-debian-armv8/build/tests/gtest/include/gtest/gtest.h:58,
                 from /home/buildbot/slave/monero-tests-debian-armv8/build/tests/gtest/src/gtest_main.cc:32:
/home/buildbot/slave/monero-tests-debian-armv8/build/tests/gtest/include/gtest/internal/gtest-port.h:522:8: warning: "GTEST_OS_LINUX_ANDROID" is not defined [-Wundef]
     (!(GTEST_OS_LINUX_ANDROID || GTEST_OS_CYGWIN || GTEST_OS_SOLARIS))
        ^
/home/buildbot/slave/monero-tests-debian-armv8/build/tests/gtest/include/gtest/internal/gtest-port.h:530:6: note: in expansion of macro ‘GTEST_HAS_STD_WSTRING’
     (GTEST_HAS_STD_WSTRING && GTEST_HAS_GLOBAL_STRING)
      ^~~~~~~~~~~~~~~~~~~~~
/home/buildbot/slave/monero-tests-debian-armv8/build/tests/gtest/include/gtest/gtest-printers.h:328:5: note: in expansion of macro ‘GTEST_HAS_GLOBAL_WSTRING’
 #if GTEST_HAS_GLOBAL_WSTRING
     ^~~~~~~~~~~~~~~~~~~~~~~~
/home/buildbot/slave/monero-tests-debian-armv8/build/tests/gtest/include/gtest/internal/gtest-port.h:522:34: warning: "GTEST_OS_CYGWIN" is not defined [-Wundef]
     (!(GTEST_OS_LINUX_ANDROID || GTEST_OS_CYGWIN || GTEST_OS_SOLARIS))
                                  ^
/home/buildbot/slave/monero-tests-debian-armv8/build/tests/gtest/include/gtest/internal/gtest-port.h:530:6: note: in expansion of macro ‘GTEST_HAS_STD_WSTRING’
     (GTEST_HAS_STD_WSTRING && GTEST_HAS_GLOBAL_STRING)
      ^~~~~~~~~~~~~~~~~~~~~
/home/buildbot/slave/monero-tests-debian-armv8/build/tests/gtest/include/gtest/gtest-printers.h:328:5: note: in expansion of macro ‘GTEST_HAS_GLOBAL_WSTRING’
 #if GTEST_HAS_GLOBAL_WSTRING
     ^~~~~~~~~~~~~~~~~~~~~~~~
/home/buildbot/slave/monero-tests-debian-armv8/build/tests/gtest/include/gtest/internal/gtest-port.h:522:53: warning: "GTEST_OS_SOLARIS" is not defined [-Wundef]
     (!(GTEST_OS_LINUX_ANDROID || GTEST_OS_CYGWIN || GTEST_OS_SOLARIS))
                                                     ^
/home/buildbot/slave/monero-tests-debian-armv8/build/tests/gtest/include/gtest/internal/gtest-port.h:530:6: note: in expansion of macro ‘GTEST_HAS_STD_WSTRING’
     (GTEST_HAS_STD_WSTRING && GTEST_HAS_GLOBAL_STRING)
      ^~~~~~~~~~~~~~~~~~~~~
/home/buildbot/slave/monero-tests-debian-armv8/build/tests/gtest/include/gtest/gtest-printers.h:328:5: note: in expansion of macro ‘GTEST_HAS_GLOBAL_WSTRING’
 #if GTEST_HAS_GLOBAL_WSTRING
     ^~~~~~~~~~~~~~~~~~~~~~~~
/home/buildbot/slave/monero-tests-debian-armv8/build/tests/gtest/include/gtest/internal/gtest-port.h:522:8: warning: "GTEST_OS_LINUX_ANDROID" is not defined [-Wundef]
     (!(GTEST_OS_LINUX_ANDROID || GTEST_OS_CYGWIN || GTEST_OS_SOLARIS))
        ^
/home/buildbot/slave/monero-tests-debian-armv8/build/tests/gtest/include/gtest/gtest-printers.h:333:5: note: in expansion of macro ‘GTEST_HAS_STD_WSTRING’
 #if GTEST_HAS_STD_WSTRING
     ^~~~~~~~~~~~~~~~~~~~~
/home/buildbot/slave/monero-tests-debian-armv8/build/tests/gtest/include/gtest/internal/gtest-port.h:522:34: warning: "GTEST_OS_CYGWIN" is not defined [-Wundef]
     (!(GTEST_OS_LINUX_ANDROID || GTEST_OS_CYGWIN || GTEST_OS_SOLARIS))
                                  ^
/home/buildbot/slave/monero-tests-debian-armv8/build/tests/gtest/include/gtest/gtest-printers.h:333:5: note: in expansion of macro ‘GTEST_HAS_STD_WSTRING’
 #if GTEST_HAS_STD_WSTRING
     ^~~~~~~~~~~~~~~~~~~~~
/home/buildbot/slave/monero-tests-debian-armv8/build/tests/gtest/include/gtest/internal/gtest-port.h:522:53: warning: "GTEST_OS_SOLARIS" is not defined [-Wundef]
     (!(GTEST_OS_LINUX_ANDROID || GTEST_OS_CYGWIN || GTEST_OS_SOLARIS))
                                                     ^
/home/buildbot/slave/monero-tests-debian-armv8/build/tests/gtest/include/gtest/gtest-printers.h:333:5: note: in expansion of macro ‘GTEST_HAS_STD_WSTRING’
 #if GTEST_HAS_STD_WSTRING
     ^~~~~~~~~~~~~~~~~~~~~
/home/buildbot/slave/monero-tests-debian-armv8/build/tests/gtest/include/gtest/internal/gtest-port.h:522:8: warning: "GTEST_OS_LINUX_ANDROID" is not defined [-Wundef]
     (!(GTEST_OS_LINUX_ANDROID || GTEST_OS_CYGWIN || GTEST_OS_SOLARIS))
        ^
/home/buildbot/slave/monero-tests-debian-armv8/build/tests/gtest/include/gtest/internal/gtest-port.h:530:6: note: in expansion of macro ‘GTEST_HAS_STD_WSTRING’
     (GTEST_HAS_STD_WSTRING && GTEST_HAS_GLOBAL_STRING)
      ^~~~~~~~~~~~~~~~~~~~~
/home/buildbot/slave/monero-tests-debian-armv8/build/tests/gtest/include/gtest/gtest-printers.h:570:5: note: in expansion of macro ‘GTEST_HAS_GLOBAL_WSTRING’
 #if GTEST_HAS_GLOBAL_WSTRING
     ^~~~~~~~~~~~~~~~~~~~~~~~
/home/buildbot/slave/monero-tests-debian-armv8/build/tests/gtest/include/gtest/internal/gtest-port.h:522:34: warning: "GTEST_OS_CYGWIN" is not defined [-Wundef]
     (!(GTEST_OS_LINUX_ANDROID || GTEST_OS_CYGWIN || GTEST_OS_SOLARIS))
                                  ^
/home/buildbot/slave/monero-tests-debian-armv8/build/tests/gtest/include/gtest/internal/gtest-port.h:530:6: note: in expansion of macro ‘GTEST_HAS_STD_WSTRING’
     (GTEST_HAS_STD_WSTRING && GTEST_HAS_GLOBAL_STRING)
      ^~~~~~~~~~~~~~~~~~~~~
/home/buildbot/slave/monero-tests-debian-armv8/build/tests/gtest/include/gtest/gtest-printers.h:570:5: note: in expansion of macro ‘GTEST_HAS_GLOBAL_WSTRING’
 #if GTEST_HAS_GLOBAL_WSTRING
     ^~~~~~~~~~~~~~~~~~~~~~~~
/home/buildbot/slave/monero-tests-debian-armv8/build/tests/gtest/include/gtest/internal/gtest-port.h:522:53: warning: "GTEST_OS_SOLARIS" is not defined [-Wundef]
     (!(GTEST_OS_LINUX_ANDROID || GTEST_OS_CYGWIN || GTEST_OS_SOLARIS))
                                                     ^
/home/buildbot/slave/monero-tests-debian-armv8/build/tests/gtest/include/gtest/internal/gtest-port.h:530:6: note: in expansion of macro ‘GTEST_HAS_STD_WSTRING’
     (GTEST_HAS_STD_WSTRING && GTEST_HAS_GLOBAL_STRING)
      ^~~~~~~~~~~~~~~~~~~~~
/home/buildbot/slave/monero-tests-debian-armv8/build/tests/gtest/include/gtest/gtest-printers.h:570:5: note: in expansion of macro ‘GTEST_HAS_GLOBAL_WSTRING’
 #if GTEST_HAS_GLOBAL_WSTRING
     ^~~~~~~~~~~~~~~~~~~~~~~~
/home/buildbot/slave/monero-tests-debian-armv8/build/tests/gtest/include/gtest/internal/gtest-port.h:522:8: warning: "GTEST_OS_LINUX_ANDROID" is not defined [-Wundef]
     (!(GTEST_OS_LINUX_ANDROID || GTEST_OS_CYGWIN || GTEST_OS_SOLARIS))
        ^
/home/buildbot/slave/monero-tests-debian-armv8/build/tests/gtest/include/gtest/gtest-printers.h:577:5: note: in expansion of macro ‘GTEST_HAS_STD_WSTRING’
 #if GTEST_HAS_STD_WSTRING
     ^~~~~~~~~~~~~~~~~~~~~
/home/buildbot/slave/monero-tests-debian-armv8/build/tests/gtest/include/gtest/internal/gtest-port.h:522:34: warning: "GTEST_OS_CYGWIN" is not defined [-Wundef]
     (!(GTEST_OS_LINUX_ANDROID || GTEST_OS_CYGWIN || GTEST_OS_SOLARIS))
                                  ^
/home/buildbot/slave/monero-tests-debian-armv8/build/tests/gtest/include/gtest/gtest-printers.h:577:5: note: in expansion of macro ‘GTEST_HAS_STD_WSTRING’
 #if GTEST_HAS_STD_WSTRING
     ^~~~~~~~~~~~~~~~~~~~~
/home/buildbot/slave/monero-tests-debian-armv8/build/tests/gtest/include/gtest/internal/gtest-port.h:522:53: warning: "GTEST_OS_SOLARIS" is not defined [-Wundef]
     (!(GTEST_OS_LINUX_ANDROID || GTEST_OS_CYGWIN || GTEST_OS_SOLARIS))
                                                     ^
/home/buildbot/slave/monero-tests-debian-armv8/build/tests/gtest/include/gtest/gtest-printers.h:577:5: note: in expansion of macro ‘GTEST_HAS_STD_WSTRING’
 #if GTEST_HAS_STD_WSTRING
     ^~~~~~~~~~~~~~~~~~~~~
/home/buildbot/slave/monero-tests-debian-armv8/build/tests/gtest/include/gtest/internal/gtest-port.h:522:8: warning: "GTEST_OS_LINUX_ANDROID" is not defined [-Wundef]
     (!(GTEST_OS_LINUX_ANDROID || GTEST_OS_CYGWIN || GTEST_OS_SOLARIS))
        ^
/home/buildbot/slave/monero-tests-debian-armv8/build/tests/gtest/include/gtest/gtest-printers.h:820:5: note: in expansion of macro ‘GTEST_HAS_STD_WSTRING’
 #if GTEST_HAS_STD_WSTRING
     ^~~~~~~~~~~~~~~~~~~~~
/home/buildbot/slave/monero-tests-debian-armv8/build/tests/gtest/include/gtest/internal/gtest-port.h:522:34: warning: "GTEST_OS_CYGWIN" is not defined [-Wundef]
     (!(GTEST_OS_LINUX_ANDROID || GTEST_OS_CYGWIN || GTEST_OS_SOLARIS))
                                  ^
/home/buildbot/slave/monero-tests-debian-armv8/build/tests/gtest/include/gtest/gtest-printers.h:820:5: note: in expansion of macro ‘GTEST_HAS_STD_WSTRING’
 #if GTEST_HAS_STD_WSTRING
     ^~~~~~~~~~~~~~~~~~~~~
/home/buildbot/slave/monero-tests-debian-armv8/build/tests/gtest/include/gtest/internal/gtest-port.h:522:53: warning: "GTEST_OS_SOLARIS" is not defined [-Wundef]
     (!(GTEST_OS_LINUX_ANDROID || GTEST_OS_CYGWIN || GTEST_OS_SOLARIS))
                                                     ^
/home/buildbot/slave/monero-tests-debian-armv8/build/tests/gtest/include/gtest/gtest-printers.h:820:5: note: in expansion of macro ‘GTEST_HAS_STD_WSTRING’
 #if GTEST_HAS_STD_WSTRING
     ^~~~~~~~~~~~~~~~~~~~~
/home/buildbot/slave/monero-tests-debian-armv8/build/tests/gtest/include/gtest/internal/gtest-port.h:522:8: warning: "GTEST_OS_LINUX_ANDROID" is not defined [-Wundef]
     (!(GTEST_OS_LINUX_ANDROID || GTEST_OS_CYGWIN || GTEST_OS_SOLARIS))
        ^
/home/buildbot/slave/monero-tests-debian-armv8/build/tests/gtest/include/gtest/gtest.h:1616:5: note: in expansion of macro ‘GTEST_HAS_STD_WSTRING’
 #if GTEST_HAS_STD_WSTRING
     ^~~~~~~~~~~~~~~~~~~~~
/home/buildbot/slave/monero-tests-debian-armv8/build/tests/gtest/include/gtest/internal/gtest-port.h:522:34: warning: "GTEST_OS_CYGWIN" is not defined [-Wundef]
     (!(GTEST_OS_LINUX_ANDROID || GTEST_OS_CYGWIN || GTEST_OS_SOLARIS))
                                  ^
/home/buildbot/slave/monero-tests-debian-armv8/build/tests/gtest/include/gtest/gtest.h:1616:5: note: in expansion of macro ‘GTEST_HAS_STD_WSTRING’
 #if GTEST_HAS_STD_WSTRING
     ^~~~~~~~~~~~~~~~~~~~~
/home/buildbot/slave/monero-tests-debian-armv8/build/tests/gtest/include/gtest/internal/gtest-port.h:522:53: warning: "GTEST_OS_SOLARIS" is not defined [-Wundef]
     (!(GTEST_OS_LINUX_ANDROID || GTEST_OS_CYGWIN || GTEST_OS_SOLARIS))
                                                     ^
/home/buildbot/slave/monero-tests-debian-armv8/build/tests/gtest/include/gtest/gtest.h:1616:5: note: in expansion of macro ‘GTEST_HAS_STD_WSTRING’
 #if GTEST_HAS_STD_WSTRING
     ^~~~~~~~~~~~~~~~~~~~~
In file included from /home/buildbot/slave/monero-tests-debian-armv8/build/tests/gtest/src/gtest_main.cc:32:0:
/home/buildbot/slave/monero-tests-debian-armv8/build/tests/gtest/include/gtest/gtest.h:1825:6: warning: "GTEST_DONT_DEFINE_FAIL" is not defined [-Wundef]
 #if !GTEST_DONT_DEFINE_FAIL
      ^~~~~~~~~~~~~~~~~~~~~~
/home/buildbot/slave/monero-tests-debian-armv8/build/tests/gtest/include/gtest/gtest.h:1834:6: warning: "GTEST_DONT_DEFINE_SUCCEED" is not defined [-Wundef]
 #if !GTEST_DONT_DEFINE_SUCCEED
      ^~~~~~~~~~~~~~~~~~~~~~~~~
In file included from /home/buildbot/slave/monero-tests-debian-armv8/build/tests/gtest/src/gtest_main.cc:32:0:
/home/buildbot/slave/monero-tests-debian-armv8/build/tests/gtest/include/gtest/gtest.h:1959:6: warning: "GTEST_DONT_DEFINE_ASSERT_EQ" is not defined [-Wundef]
 #if !GTEST_DONT_DEFINE_ASSERT_EQ
      ^~~~~~~~~~~~~~~~~~~~~~~~~~~
/home/buildbot/slave/monero-tests-debian-armv8/build/tests/gtest/include/gtest/gtest.h:1963:6: warning: "GTEST_DONT_DEFINE_ASSERT_NE" is not defined [-Wundef]
 #if !GTEST_DONT_DEFINE_ASSERT_NE
      ^~~~~~~~~~~~~~~~~~~~~~~~~~~
/home/buildbot/slave/monero-tests-debian-armv8/build/tests/gtest/include/gtest/gtest.h:1967:6: warning: "GTEST_DONT_DEFINE_ASSERT_LE" is not defined [-Wundef]
 #if !GTEST_DONT_DEFINE_ASSERT_LE
      ^~~~~~~~~~~~~~~~~~~~~~~~~~~
/home/buildbot/slave/monero-tests-debian-armv8/build/tests/gtest/include/gtest/gtest.h:1971:6: warning: "GTEST_DONT_DEFINE_ASSERT_LT" is not defined [-Wundef]
 #if !GTEST_DONT_DEFINE_ASSERT_LT
      ^~~~~~~~~~~~~~~~~~~~~~~~~~~
/home/buildbot/slave/monero-tests-debian-armv8/build/tests/gtest/include/gtest/gtest.h:1975:6: warning: "GTEST_DONT_DEFINE_ASSERT_GE" is not defined [-Wundef]
 #if !GTEST_DONT_DEFINE_ASSERT_GE
      ^~~~~~~~~~~~~~~~~~~~~~~~~~~
/home/buildbot/slave/monero-tests-debian-armv8/build/tests/gtest/include/gtest/gtest.h:1979:6: warning: "GTEST_DONT_DEFINE_ASSERT_GT" is not defined [-Wundef]
 #if !GTEST_DONT_DEFINE_ASSERT_GT
      ^~~~~~~~~~~~~~~~~~~~~~~~~~~
/home/buildbot/slave/monero-tests-debian-armv8/build/tests/gtest/include/gtest/gtest.h:2068:5: warning: "GTEST_OS_WINDOWS" is not defined [-Wundef]
 #if GTEST_OS_WINDOWS
     ^~~~~~~~~~~~~~~~
/home/buildbot/slave/monero-tests-debian-armv8/build/tests/gtest/include/gtest/gtest.h:2190:6: warning: "GTEST_DONT_DEFINE_TEST" is not defined [-Wundef]
 #if !GTEST_DONT_DEFINE_TEST
      ^~~~~~~~~~~~~~~~~~~~~~
[ 77%] Linking CXX static library libgtest_main.a
make[3]: Leaving directory '/home/buildbot/slave/monero-tests-debian-armv8/build/build/debug'
[ 77%] Built target gtest_main
make[3]: Entering directory '/home/buildbot/slave/monero-tests-debian-armv8/build/build/debug'
Scanning dependencies of target coretests
make[3]: Leaving directory '/home/buildbot/slave/monero-tests-debian-armv8/build/build/debug'
make[3]: Entering directory '/home/buildbot/slave/monero-tests-debian-armv8/build/build/debug'
[ 78%] Building CXX object tests/core_tests/CMakeFiles/coretests.dir/block_reward.cpp.o
[ 78%] Building CXX object tests/core_tests/CMakeFiles/coretests.dir/block_validation.cpp.o
[ 79%] Building CXX object tests/core_tests/CMakeFiles/coretests.dir/chain_split_1.cpp.o
[ 79%] Building CXX object tests/core_tests/CMakeFiles/coretests.dir/chain_switch_1.cpp.o
[ 79%] Building CXX object tests/core_tests/CMakeFiles/coretests.dir/chaingen.cpp.o
[ 80%] Building CXX object tests/core_tests/CMakeFiles/coretests.dir/chaingen001.cpp.o
[ 80%] Building CXX object tests/core_tests/CMakeFiles/coretests.dir/chaingen_main.cpp.o
[ 81%] Building CXX object tests/core_tests/CMakeFiles/coretests.dir/double_spend.cpp.o
[ 81%] Building CXX object tests/core_tests/CMakeFiles/coretests.dir/integer_overflow.cpp.o
[ 81%] Building CXX object tests/core_tests/CMakeFiles/coretests.dir/ring_signature_1.cpp.o
[ 82%] Building CXX object tests/core_tests/CMakeFiles/coretests.dir/transaction_tests.cpp.o
[ 82%] Building CXX object tests/core_tests/CMakeFiles/coretests.dir/tx_validation.cpp.o
[ 82%] Building CXX object tests/core_tests/CMakeFiles/coretests.dir/v2_tests.cpp.o
[ 83%] Building CXX object tests/core_tests/CMakeFiles/coretests.dir/rct.cpp.o
[ 83%] Linking CXX executable coretests
make[3]: Leaving directory '/home/buildbot/slave/monero-tests-debian-armv8/build/build/debug'
[ 83%] Built target coretests
make[3]: Entering directory '/home/buildbot/slave/monero-tests-debian-armv8/build/build/debug'
Scanning dependencies of target crypto-tests
make[3]: Leaving directory '/home/buildbot/slave/monero-tests-debian-armv8/build/build/debug'
make[3]: Entering directory '/home/buildbot/slave/monero-tests-debian-armv8/build/build/debug'
[ 83%] Building C object tests/crypto/CMakeFiles/crypto-tests.dir/crypto-ops-data.c.o
[ 83%] Building C object tests/crypto/CMakeFiles/crypto-tests.dir/crypto-ops.c.o
[ 84%] Building CXX object tests/crypto/CMakeFiles/crypto-tests.dir/crypto.cpp.o
[ 84%] Building C object tests/crypto/CMakeFiles/crypto-tests.dir/hash.c.o
[ 85%] Building CXX object tests/crypto/CMakeFiles/crypto-tests.dir/main.cpp.o
[ 85%] Building C object tests/crypto/CMakeFiles/crypto-tests.dir/random.c.o
[ 85%] Linking CXX executable crypto-tests
make[3]: Leaving directory '/home/buildbot/slave/monero-tests-debian-armv8/build/build/debug'
[ 85%] Built target crypto-tests
make[3]: Entering directory '/home/buildbot/slave/monero-tests-debian-armv8/build/build/debug'
Scanning dependencies of target functional_tests
make[3]: Leaving directory '/home/buildbot/slave/monero-tests-debian-armv8/build/build/debug'
make[3]: Entering directory '/home/buildbot/slave/monero-tests-debian-armv8/build/build/debug'
[ 85%] Building CXX object tests/functional_tests/CMakeFiles/functional_tests.dir/main.cpp.o
[ 86%] Building CXX object tests/functional_tests/CMakeFiles/functional_tests.dir/transactions_flow_test.cpp.o
[ 86%] Building CXX object tests/functional_tests/CMakeFiles/functional_tests.dir/transactions_generation_from_blockchain.cpp.o
[ 86%] Linking CXX executable functional_tests
make[3]: Leaving directory '/home/buildbot/slave/monero-tests-debian-armv8/build/build/debug'
[ 86%] Built target functional_tests
make[3]: Entering directory '/home/buildbot/slave/monero-tests-debian-armv8/build/build/debug'
Scanning dependencies of target performance_tests
make[3]: Leaving directory '/home/buildbot/slave/monero-tests-debian-armv8/build/build/debug'
make[3]: Entering directory '/home/buildbot/slave/monero-tests-debian-armv8/build/build/debug'
[ 86%] Building CXX object tests/performance_tests/CMakeFiles/performance_tests.dir/main.cpp.o
[ 86%] Linking CXX executable performance_tests
make[3]: Leaving directory '/home/buildbot/slave/monero-tests-debian-armv8/build/build/debug'
[ 86%] Built target performance_tests
make[3]: Entering directory '/home/buildbot/slave/monero-tests-debian-armv8/build/build/debug'
Scanning dependencies of target core_proxy
make[3]: Leaving directory '/home/buildbot/slave/monero-tests-debian-armv8/build/build/debug'
make[3]: Entering directory '/home/buildbot/slave/monero-tests-debian-armv8/build/build/debug'
[ 86%] Building CXX object tests/core_proxy/CMakeFiles/core_proxy.dir/core_proxy.cpp.o
/tmp/cct0MGDA.s: Assembler messages:
/tmp/cct0MGDA.s: Fatal error: can't close CMakeFiles/core_proxy.dir/core_proxy.cpp.o: No space left on device
tests/core_proxy/CMakeFiles/core_proxy.dir/build.make:62: recipe for target 'tests/core_proxy/CMakeFiles/core_proxy.dir/core_proxy.cpp.o' failed
make[3]: Leaving directory '/home/buildbot/slave/monero-tests-debian-armv8/build/build/debug'
make[3]: *** [tests/core_proxy/CMakeFiles/core_proxy.dir/core_proxy.cpp.o] Error 1
CMakeFiles/Makefile2:2390: recipe for target 'tests/core_proxy/CMakeFiles/core_proxy.dir/all' failed
make[2]: *** [tests/core_proxy/CMakeFiles/core_proxy.dir/all] Error 2
make[2]: Leaving directory '/home/buildbot/slave/monero-tests-debian-armv8/build/build/debug'
Makefile:138: recipe for target 'all' failed
make[1]: *** [all] Error 2
make[1]: Leaving directory '/home/buildbot/slave/monero-tests-debian-armv8/build/build/debug'
Makefile:39: recipe for target 'debug-test' failed
make: *** [debug-test] Error 2
program finished with exit code 2
elapsedTime=23831.517328