(view as text)
make debug-test
 in dir /home/buildbot/slave/monero-tests-debian-armv8/build
 watching logfiles {'LastTest.log': 'build/debug/Testing/Temporary/LastTest.log', 'coretests.log': 'build/debug/tests/core_tests/coretests.log', 'CTestCostData.txt': 'build/debug/Testing/Temporary/CTestCostData.txt'}
 argv: ['make', 'debug-test']
 environment:
  HOME=/home/buildbot
  JAVA_TOOL_OPTIONS=-Dgnu.io.rxtx.SerialPorts=/dev/tty96B0
  LANG=C.UTF-8
  LOGNAME=buildbot
  LS_COLORS=rs=0:di=01;34:ln=01;36:mh=00:pi=40;33:so=01;35:do=01;35:bd=40;33;01:cd=40;33;01:or=40;31;01:mi=00:su=37;41:sg=30;43:ca=30;41:tw=30;42:ow=34;42:st=37;44:ex=01;32:*.tar=01;31:*.tgz=01;31:*.arc=01;31:*.arj=01;31:*.taz=01;31:*.lha=01;31:*.lz4=01;31:*.lzh=01;31:*.lzma=01;31:*.tlz=01;31:*.txz=01;31:*.tzo=01;31:*.t7z=01;31:*.zip=01;31:*.z=01;31:*.Z=01;31:*.dz=01;31:*.gz=01;31:*.lrz=01;31:*.lz=01;31:*.lzo=01;31:*.xz=01;31:*.bz2=01;31:*.bz=01;31:*.tbz=01;31:*.tbz2=01;31:*.tz=01;31:*.deb=01;31:*.rpm=01;31:*.jar=01;31:*.war=01;31:*.ear=01;31:*.sar=01;31:*.rar=01;31:*.alz=01;31:*.ace=01;31:*.zoo=01;31:*.cpio=01;31:*.7z=01;31:*.rz=01;31:*.cab=01;31:*.jpg=01;35:*.jpeg=01;35:*.gif=01;35:*.bmp=01;35:*.pbm=01;35:*.pgm=01;35:*.ppm=01;35:*.tga=01;35:*.xbm=01;35:*.xpm=01;35:*.tif=01;35:*.tiff=01;35:*.png=01;35:*.svg=01;35:*.svgz=01;35:*.mng=01;35:*.pcx=01;35:*.mov=01;35:*.mpg=01;35:*.mpeg=01;35:*.m2v=01;35:*.mkv=01;35:*.webm=01;35:*.ogm=01;35:*.mp4=01;35:*.m4v=01;35:*.mp4v=01;35:*.vob=01;35:*.qt=01;35:*.nuv=01;35:*.wmv=01;35:*.asf=01;35:*.rm=01;35:*.rmvb=01;35:*.flc=01;35:*.avi=01;35:*.fli=01;35:*.flv=01;35:*.gl=01;35:*.dl=01;35:*.xcf=01;35:*.xwd=01;35:*.yuv=01;35:*.cgm=01;35:*.emf=01;35:*.ogv=01;35:*.ogx=01;35:*.aac=00;36:*.au=00;36:*.flac=00;36:*.m4a=00;36:*.mid=00;36:*.midi=00;36:*.mka=00;36:*.mp3=00;36:*.mpc=00;36:*.ogg=00;36:*.ra=00;36:*.wav=00;36:*.oga=00;36:*.opus=00;36:*.spx=00;36:*.xspf=00;36:
  MAIL=/var/mail/buildbot
  MONITOR_PORT=/dev/tty96B0
  PATH=/usr/local/bin:/usr/bin:/bin:/usr/local/games:/usr/games
  PWD=/home/buildbot/slave/monero-tests-debian-armv8/build
  SHELL=/bin/bash
  SHLVL=1
  TERM=xterm
  USER=buildbot
  _=/usr/local/bin/buildslave
 using PTY: False
mkdir -p build/debug
cd build/debug && cmake -D BUILD_TESTS=ON -D CMAKE_BUILD_TYPE=Debug ../.. && make && make test
-- The C compiler identification is GNU 6.2.0
-- The CXX compiler identification is GNU 6.2.0
-- Check for working C compiler: /usr/bin/cc
-- Check for working C compiler: /usr/bin/cc -- works
-- Detecting C compiler ABI info
-- Detecting C compiler ABI info - done
-- Detecting C compile features
-- Detecting C compile features - done
-- Check for working CXX compiler: /usr/bin/c++
-- Check for working CXX compiler: /usr/bin/c++ -- works
-- Detecting CXX compiler ABI info
-- Detecting CXX compiler ABI info - done
-- Detecting CXX compile features
-- Detecting CXX compile features - done
-- Could not find DEVELOPER_LOCAL_TOOLS in env (not required)
-- BOOST_IGNORE_SYSTEM_PATHS defaults to OFF
-- Could not find DEVELOPER_LIBUNBOUND_OLD in env (not required)
-- Building for a 64-bit system
-- Building internal libraries as shared
-- Could not find DATABASE in env (not required unless you want to change database type from default: lmdb)
-- Using LMDB as default DB type
-- Could not find libunwind (missing:  LIBUNWIND_INCLUDE_DIR LIBUNWIND_LIBRARIES) 
-- Stack trace on exception disabled
-- Looking for pthread.h
-- Looking for pthread.h - found
-- Looking for pthread_create
-- Looking for pthread_create - not found
-- Check if compiler accepts -pthread
-- Check if compiler accepts -pthread - yes
-- Found Threads: TRUE  
-- Found the miniupnpc libraries at /usr/lib/aarch64-linux-gnu/libminiupnpc.so
-- Found the miniupnpc headers at /usr/include/miniupnpc
-- Detecting version of miniupnpc in path: /usr/include/miniupnpc
-- Performing Test MINIUPNPC_VERSION_1_7_OR_HIGHER
-- Performing Test MINIUPNPC_VERSION_1_7_OR_HIGHER - Success
-- Found miniupnpc version is v1.7 or higher
-- Using shared miniupnpc found at /usr/include/miniupnpc
-- Looking for libunbound
-- Found OpenSSL: /usr/lib/aarch64-linux-gnu/libssl.so;/usr/lib/aarch64-linux-gnu/libcrypto.so (found version "1.0.2j") 
-- Looking for arpa/inet.h
-- Looking for arpa/inet.h - found
-- Looking for endian.h
-- Looking for endian.h - found
-- Looking for dlfcn.h
-- Looking for dlfcn.h - found
-- Looking for event.h
-- Looking for event.h - found
-- Looking for getopt.h
-- Looking for getopt.h - found
-- Looking for glob.h
-- Looking for glob.h - found
-- Looking for grp.h
-- Looking for grp.h - found
-- Looking for inttypes.h
-- Looking for inttypes.h - found
-- Looking for iphlpapi.h
-- Looking for iphlpapi.h - not found
-- Looking for login_cap.h
-- Looking for login_cap.h - not found
-- Looking for memory.h
-- Looking for memory.h - found
-- Looking for netdb.h
-- Looking for netdb.h - found
-- Looking for netinet/in.h
-- Looking for netinet/in.h - found
-- Looking for pwd.h
-- Looking for pwd.h - found
-- Looking for stdarg.h
-- Looking for stdarg.h - found
-- Looking for stdbool.h
-- Looking for stdbool.h - found
-- Looking for stdint.h
-- Looking for stdint.h - found
-- Looking for stdlib.h
-- Looking for stdlib.h - found
-- Looking for strings.h
-- Looking for strings.h - found
-- Looking for string.h
-- Looking for string.h - found
-- Looking for sys/param.h
-- Looking for sys/param.h - found
-- Looking for sys/resource.h
-- Looking for sys/resource.h - found
-- Looking for sys/sha2.h
-- Looking for sys/sha2.h - not found
-- Looking for sys/socket.h
-- Looking for sys/socket.h - found
-- Looking for sys/stat.h
-- Looking for sys/stat.h - found
-- Looking for sys/sysctl.h
-- Looking for sys/sysctl.h - found
-- Looking for sys/types.h
-- Looking for sys/types.h - found
-- Looking for sys/uio.h
-- Looking for sys/uio.h - found
-- Looking for sys/un.h
-- Looking for sys/un.h - found
-- Looking for sys/wait.h
-- Looking for sys/wait.h - found
-- Looking for syslog.h
-- Looking for syslog.h - found
-- Looking for time.h
-- Looking for time.h - found
-- Looking for unistd.h
-- Looking for unistd.h - found
-- Looking for vfork.h
-- Looking for vfork.h - not found
-- Looking for windows.h
-- Looking for windows.h - not found
-- Looking for winsock2.h
-- Looking for winsock2.h - not found
-- Looking for ws2tcpip.h
-- Looking for ws2tcpip.h - not found
-- Looking for _beginthreadex
-- Looking for _beginthreadex - not found
-- Looking for arc4random
-- Looking for arc4random - not found
-- Looking for arc4random_uniform
-- Looking for arc4random_uniform - not found
-- Looking for chown
-- Looking for chown - found
-- Looking for chroot
-- Looking for chroot - found
-- Looking for ctime_r
-- Looking for ctime_r - found
-- Looking for daemon
-- Looking for daemon - found
-- Looking for endprotoent
-- Looking for endprotoent - found
-- Looking for endservent
-- Looking for endservent - found
-- Looking for fork
-- Looking for fork - found
-- Looking for fseeko
-- Looking for fseeko - found
-- Looking for fsync
-- Looking for fsync - found
-- Looking for getauxval
-- Looking for getauxval - found
-- Looking for getentropy
-- Looking for getentropy - not found
-- Looking for getpwnam
-- Looking for getpwnam - found
-- Looking for getrlimit
-- Looking for getrlimit - found
-- Looking for glob
-- Looking for glob - found
-- Looking for gmtime_r
-- Looking for gmtime_r - found
-- Looking for fcntl
-- Looking for fcntl - found
-- Looking for inet_aton
-- Looking for inet_aton - found
-- Looking for inet_ntop
-- Looking for inet_ntop - found
-- Looking for inet_pton
-- Looking for inet_pton - found
-- Looking for initgroups
-- Looking for initgroups - found
-- Looking for ioctlsocket
-- Looking for ioctlsocket - not found
-- Looking for isblank
-- Looking for isblank - found
-- Looking for kill
-- Looking for kill - found
-- Looking for localtime_r
-- Looking for localtime_r - found
-- Looking for malloc
-- Looking for malloc - found
-- Looking for memmove
-- Looking for memmove - found
-- Looking for random
-- Looking for random - found
-- Looking for reallocarray
-- Looking for reallocarray - not found
-- Looking for recvmsg
-- Looking for recvmsg - found
-- Looking for sbrk
-- Looking for sbrk - found
-- Looking for sendmsg
-- Looking for sendmsg - found
-- Looking for setregid
-- Looking for setregid - found
-- Looking for setresgid
-- Looking for setresgid - found
-- Looking for setresuid
-- Looking for setresuid - found
-- Looking for setreuid
-- Looking for setreuid - found
-- Looking for setrlimit
-- Looking for setrlimit - found
-- Looking for setsid
-- Looking for setsid - found
-- Looking for setusercontent
-- Looking for setusercontent - not found
-- Looking for sigprocmask
-- Looking for sigprocmask - found
-- Looking for sleep
-- Looking for sleep - found
-- Looking for snprintf
-- Looking for snprintf - found
-- Looking for socketpair
-- Looking for socketpair - found
-- Looking for srandom
-- Looking for srandom - found
-- Looking for strftime
-- Looking for strftime - found
-- Looking for strlcat
-- Looking for strlcat - not found
-- Looking for strlcpy
-- Looking for strlcpy - not found
-- Looking for strptime
-- Looking for strptime - found
-- Looking for tzset
-- Looking for tzset - found
-- Looking for usleep
-- Looking for usleep - found
-- Looking for writev
-- Looking for writev - found
-- Looking for getaddrinfo
-- Looking for getaddrinfo - found
-- Looking for stddef.h
-- Looking for stddef.h - found
-- Check size of time_t
-- Check size of time_t - done
-- Check size of gid_t
-- Check size of gid_t - done
-- Check size of in_addr_t
-- Check size of in_addr_t - done
-- Check size of in_port_t
-- Check size of in_port_t - done
-- Check size of int16_t
-- Check size of int16_t - done
-- Check size of int32_t
-- Check size of int32_t - done
-- Check size of int64_t
-- Check size of int64_t - done
-- Check size of int8_t
-- Check size of int8_t - done
-- Check size of pid_t
-- Check size of pid_t - done
-- Check size of rlim_t
-- Check size of rlim_t - done
-- Check size of ssize_t
-- Check size of ssize_t - done
-- Check size of uid_t
-- Check size of uid_t - done
-- Check size of uint16_t
-- Check size of uint16_t - done
-- Check size of uint32_t
-- Check size of uint32_t - done
-- Check size of uint64_t
-- Check size of uint64_t - done
-- Check size of uint8_t
-- Check size of uint8_t - done
-- Looking for PTHREAD_PRIO_INHERIT
-- Looking for PTHREAD_PRIO_INHERIT - not found
-- Looking for pthread_rwlock_t
-- Looking for pthread_rwlock_t - not found
-- Looking for pthread_spinlock_t
-- Looking for pthread_spinlock_t - not found
-- Looking for openssl/conf.h
-- Looking for openssl/conf.h - found
-- Looking for openssl/engine.h
-- Looking for openssl/engine.h - found
-- Looking for openssl/err.h
-- Looking for openssl/err.h - found
-- Looking for openssl/rand.h
-- Looking for openssl/rand.h - found
-- Looking for openssl/ssl.h
-- Looking for openssl/ssl.h - found
-- Looking for NID_secp384r1
-- Looking for NID_secp384r1 - found
-- Looking for NID_X9_62_prime256v1
-- Looking for NID_X9_62_prime256v1 - found
-- Looking for sk_SSL_COMP_pop_free
-- Looking for sk_SSL_COMP_pop_free - found
-- Looking for SSL_COMP_get_compression_methods
-- Looking for SSL_COMP_get_compression_methods - not found
-- Looking for EVP_sha1
-- Looking for EVP_sha1 - found
-- Looking for EVP_sha256
-- Looking for EVP_sha256 - found
-- Looking for EVP_sha512
-- Looking for EVP_sha512 - found
-- Looking for FIPS_mode
-- Looking for FIPS_mode - found
-- Looking for HMAC_CTX_init
-- Looking for HMAC_CTX_init - found
-- Looking for OPENSSL_config
-- Looking for OPENSSL_config - found
-- Looking for SHA512_Update
-- Looking for SHA512_Update - found
-- Found PkgConfig: /usr/bin/pkg-config (found version "0.29") 
-- Using 64-bit LMDB from source tree
-- Building on aarch64 for native
-- Checking to see if CXX compiler accepts flag -march=native+crypto
-- Checking to see if CXX compiler accepts flag -march=native+crypto - no
-- Crypto extensions unavailable on your ARMv8 device
-- Setting FPU Flags for ARM Processors
-- Checking to see if CXX compiler accepts flag -mfix-cortex-a53-835769
-- Checking to see if CXX compiler accepts flag -mfix-cortex-a53-835769 - yes
-- Checking to see if CXX compiler accepts flag -mfix-cortex-a53-843419
-- Checking to see if CXX compiler accepts flag -mfix-cortex-a53-843419 - yes
-- Enabling Cortex-A53 workaround 835769
-- Enabling Cortex-A53 workaround 843419
CMake Warning at /usr/share/cmake-3.6/Modules/FindBoost.cmake:743 (message):
  Imported targets not available for Boost version 106200
Call Stack (most recent call first):
  /usr/share/cmake-3.6/Modules/FindBoost.cmake:842 (_Boost_COMPONENT_DEPENDENCIES)
  /usr/share/cmake-3.6/Modules/FindBoost.cmake:1411 (_Boost_MISSING_DEPENDENCIES)
  CMakeLists.txt:570 (find_package)


CMake Warning at /usr/share/cmake-3.6/Modules/FindBoost.cmake:743 (message):
  Imported targets not available for Boost version 106200
Call Stack (most recent call first):
  /usr/share/cmake-3.6/Modules/FindBoost.cmake:842 (_Boost_COMPONENT_DEPENDENCIES)
  /usr/share/cmake-3.6/Modules/FindBoost.cmake:1411 (_Boost_MISSING_DEPENDENCIES)
  CMakeLists.txt:570 (find_package)


CMake Warning at /usr/share/cmake-3.6/Modules/FindBoost.cmake:743 (message):
  Imported targets not available for Boost version 106200
Call Stack (most recent call first):
  /usr/share/cmake-3.6/Modules/FindBoost.cmake:842 (_Boost_COMPONENT_DEPENDENCIES)
  /usr/share/cmake-3.6/Modules/FindBoost.cmake:1411 (_Boost_MISSING_DEPENDENCIES)
  CMakeLists.txt:570 (find_package)


CMake Warning at /usr/share/cmake-3.6/Modules/FindBoost.cmake:743 (message):
  Imported targets not available for Boost version 106200
Call Stack (most recent call first):
  /usr/share/cmake-3.6/Modules/FindBoost.cmake:842 (_Boost_COMPONENT_DEPENDENCIES)
  /usr/share/cmake-3.6/Modules/FindBoost.cmake:1411 (_Boost_MISSING_DEPENDENCIES)
  CMakeLists.txt:570 (find_package)


CMake Warning at /usr/share/cmake-3.6/Modules/FindBoost.cmake:743 (message):
  Imported targets not available for Boost version 106200
Call Stack (most recent call first):
  /usr/share/cmake-3.6/Modules/FindBoost.cmake:842 (_Boost_COMPONENT_DEPENDENCIES)
  /usr/share/cmake-3.6/Modules/FindBoost.cmake:1411 (_Boost_MISSING_DEPENDENCIES)
  CMakeLists.txt:570 (find_package)


CMake Warning at /usr/share/cmake-3.6/Modules/FindBoost.cmake:743 (message):
  Imported targets not available for Boost version 106200
Call Stack (most recent call first):
  /usr/share/cmake-3.6/Modules/FindBoost.cmake:842 (_Boost_COMPONENT_DEPENDENCIES)
  /usr/share/cmake-3.6/Modules/FindBoost.cmake:1411 (_Boost_MISSING_DEPENDENCIES)
  CMakeLists.txt:570 (find_package)


CMake Warning at /usr/share/cmake-3.6/Modules/FindBoost.cmake:743 (message):
  Imported targets not available for Boost version 106200
Call Stack (most recent call first):
  /usr/share/cmake-3.6/Modules/FindBoost.cmake:842 (_Boost_COMPONENT_DEPENDENCIES)
  /usr/share/cmake-3.6/Modules/FindBoost.cmake:1411 (_Boost_MISSING_DEPENDENCIES)
  CMakeLists.txt:570 (find_package)


CMake Warning at /usr/share/cmake-3.6/Modules/FindBoost.cmake:743 (message):
  Imported targets not available for Boost version 106200
Call Stack (most recent call first):
  /usr/share/cmake-3.6/Modules/FindBoost.cmake:842 (_Boost_COMPONENT_DEPENDENCIES)
  /usr/share/cmake-3.6/Modules/FindBoost.cmake:1411 (_Boost_MISSING_DEPENDENCIES)
  CMakeLists.txt:570 (find_package)


-- Found Boost Version: 106200
-- Found Git: /usr/bin/git
-- Could NOT find GTest (missing:  GTEST_LIBRARY GTEST_INCLUDE_DIR GTEST_MAIN_LIBRARY) 
-- GTest not found on the system: will use GTest bundled with this source
-- Found PythonInterp: /usr/bin/python (found version "2.7.12") 
-- Found Doxygen: /usr/bin/doxygen (found version "1.8.12") 
-- Configuring done
-- Generating done
-- Build files have been written to: /home/buildbot/slave/monero-tests-debian-armv8/build/build/debug
make[1]: Entering directory '/home/buildbot/slave/monero-tests-debian-armv8/build/build/debug'
make[2]: Entering directory '/home/buildbot/slave/monero-tests-debian-armv8/build/build/debug'
make[3]: Entering directory '/home/buildbot/slave/monero-tests-debian-armv8/build/build/debug'
Scanning dependencies of target version
make[3]: Leaving directory '/home/buildbot/slave/monero-tests-debian-armv8/build/build/debug'
make[3]: Entering directory '/home/buildbot/slave/monero-tests-debian-armv8/build/build/debug'
[  0%] Generating version/version.h
-- You are currently on commit e8a55db
-- The most recent tag was at 53e18ca
-- You are ahead of or behind a tagged release
make[3]: Leaving directory '/home/buildbot/slave/monero-tests-debian-armv8/build/build/debug'
[  0%] Built target version
make[3]: Entering directory '/home/buildbot/slave/monero-tests-debian-armv8/build/build/debug'
Scanning dependencies of target unbound
make[3]: Leaving directory '/home/buildbot/slave/monero-tests-debian-armv8/build/build/debug'
make[3]: Entering directory '/home/buildbot/slave/monero-tests-debian-armv8/build/build/debug'
[  1%] Building C object external/unbound/CMakeFiles/unbound.dir/services/cache/dns.c.o
[  1%] Building C object external/unbound/CMakeFiles/unbound.dir/services/cache/infra.c.o
[  1%] Building C object external/unbound/CMakeFiles/unbound.dir/services/cache/rrset.c.o
[  2%] Building C object external/unbound/CMakeFiles/unbound.dir/util/data/dname.c.o
[  2%] Building C object external/unbound/CMakeFiles/unbound.dir/util/data/msgencode.c.o
[  3%] Building C object external/unbound/CMakeFiles/unbound.dir/util/data/msgparse.c.o
[  3%] Building C object external/unbound/CMakeFiles/unbound.dir/util/data/msgreply.c.o
[  3%] Building C object external/unbound/CMakeFiles/unbound.dir/util/data/packed_rrset.c.o
[  4%] Building C object external/unbound/CMakeFiles/unbound.dir/iterator/iterator.c.o
[  4%] Building C object external/unbound/CMakeFiles/unbound.dir/iterator/iter_delegpt.c.o
[  5%] Building C object external/unbound/CMakeFiles/unbound.dir/iterator/iter_donotq.c.o
[  5%] Building C object external/unbound/CMakeFiles/unbound.dir/iterator/iter_fwd.c.o
[  5%] Building C object external/unbound/CMakeFiles/unbound.dir/iterator/iter_hints.c.o
[  6%] Building C object external/unbound/CMakeFiles/unbound.dir/iterator/iter_priv.c.o
[  6%] Building C object external/unbound/CMakeFiles/unbound.dir/iterator/iter_resptype.c.o
[  7%] Building C object external/unbound/CMakeFiles/unbound.dir/iterator/iter_scrub.c.o
[  7%] Building C object external/unbound/CMakeFiles/unbound.dir/iterator/iter_utils.c.o
[  7%] Building C object external/unbound/CMakeFiles/unbound.dir/services/listen_dnsport.c.o
[  8%] Building C object external/unbound/CMakeFiles/unbound.dir/services/localzone.c.o
[  8%] Building C object external/unbound/CMakeFiles/unbound.dir/services/mesh.c.o
[  9%] Building C object external/unbound/CMakeFiles/unbound.dir/services/modstack.c.o
[  9%] Building C object external/unbound/CMakeFiles/unbound.dir/services/outbound_list.c.o
[  9%] Building C object external/unbound/CMakeFiles/unbound.dir/services/outside_network.c.o
[ 10%] Building C object external/unbound/CMakeFiles/unbound.dir/util/alloc.c.o
[ 10%] Building C object external/unbound/CMakeFiles/unbound.dir/util/config_file.c.o
[ 10%] Building C object external/unbound/CMakeFiles/unbound.dir/util/configlexer.c.o
[ 11%] Building C object external/unbound/CMakeFiles/unbound.dir/util/configparser.c.o
[ 11%] Building C object external/unbound/CMakeFiles/unbound.dir/util/fptr_wlist.c.o
[ 12%] Building C object external/unbound/CMakeFiles/unbound.dir/util/locks.c.o
[ 12%] Building C object external/unbound/CMakeFiles/unbound.dir/util/log.c.o
[ 12%] Building C object external/unbound/CMakeFiles/unbound.dir/util/mini_event.c.o
[ 13%] Building C object external/unbound/CMakeFiles/unbound.dir/util/module.c.o
[ 13%] Building C object external/unbound/CMakeFiles/unbound.dir/util/netevent.c.o
[ 14%] Building C object external/unbound/CMakeFiles/unbound.dir/util/net_help.c.o
[ 14%] Building C object external/unbound/CMakeFiles/unbound.dir/util/random.c.o
[ 14%] Building C object external/unbound/CMakeFiles/unbound.dir/util/rbtree.c.o
[ 15%] Building C object external/unbound/CMakeFiles/unbound.dir/util/regional.c.o
[ 15%] Building C object external/unbound/CMakeFiles/unbound.dir/util/rtt.c.o
[ 16%] Building C object external/unbound/CMakeFiles/unbound.dir/util/storage/dnstree.c.o
[ 16%] Building C object external/unbound/CMakeFiles/unbound.dir/util/storage/lookup3.c.o
[ 16%] Building C object external/unbound/CMakeFiles/unbound.dir/util/storage/lruhash.c.o
[ 17%] Building C object external/unbound/CMakeFiles/unbound.dir/util/storage/slabhash.c.o
[ 17%] Building C object external/unbound/CMakeFiles/unbound.dir/util/timehist.c.o
[ 18%] Building C object external/unbound/CMakeFiles/unbound.dir/util/tube.c.o
[ 18%] Building C object external/unbound/CMakeFiles/unbound.dir/util/winsock_event.c.o
[ 18%] Building C object external/unbound/CMakeFiles/unbound.dir/validator/autotrust.c.o
[ 19%] Building C object external/unbound/CMakeFiles/unbound.dir/validator/val_anchor.c.o
[ 19%] Building C object external/unbound/CMakeFiles/unbound.dir/validator/validator.c.o
[ 19%] Building C object external/unbound/CMakeFiles/unbound.dir/validator/val_kcache.c.o
[ 20%] Building C object external/unbound/CMakeFiles/unbound.dir/validator/val_kentry.c.o
[ 20%] Building C object external/unbound/CMakeFiles/unbound.dir/validator/val_neg.c.o
[ 21%] Building C object external/unbound/CMakeFiles/unbound.dir/validator/val_nsec3.c.o
[ 21%] Building C object external/unbound/CMakeFiles/unbound.dir/validator/val_nsec.c.o
[ 21%] Building C object external/unbound/CMakeFiles/unbound.dir/validator/val_secalgo.c.o
[ 22%] Building C object external/unbound/CMakeFiles/unbound.dir/validator/val_sigcrypt.c.o
[ 22%] Building C object external/unbound/CMakeFiles/unbound.dir/validator/val_utils.c.o
[ 23%] Building C object external/unbound/CMakeFiles/unbound.dir/dns64/dns64.c.o
[ 23%] Building C object external/unbound/CMakeFiles/unbound.dir/testcode/checklocks.c.o
[ 23%] Building C object external/unbound/CMakeFiles/unbound.dir/sldns/keyraw.c.o
[ 24%] Building C object external/unbound/CMakeFiles/unbound.dir/sldns/sbuffer.c.o
[ 24%] Building C object external/unbound/CMakeFiles/unbound.dir/sldns/wire2str.c.o
[ 25%] Building C object external/unbound/CMakeFiles/unbound.dir/sldns/parse.c.o
[ 25%] Building C object external/unbound/CMakeFiles/unbound.dir/sldns/parseutil.c.o
[ 25%] Building C object external/unbound/CMakeFiles/unbound.dir/sldns/rrdef.c.o
[ 26%] Building C object external/unbound/CMakeFiles/unbound.dir/sldns/str2wire.c.o
[ 26%] Building C object external/unbound/CMakeFiles/unbound.dir/compat/strlcat.c.o
[ 26%] Building C object external/unbound/CMakeFiles/unbound.dir/compat/strlcpy.c.o
[ 27%] Building C object external/unbound/CMakeFiles/unbound.dir/compat/explicit_bzero.c.o
[ 27%] Building C object external/unbound/CMakeFiles/unbound.dir/compat/arc4random.c.o
[ 28%] Building C object external/unbound/CMakeFiles/unbound.dir/compat/arc4random_uniform.c.o
[ 28%] Building C object external/unbound/CMakeFiles/unbound.dir/compat/reallocarray.c.o
[ 28%] Building C object external/unbound/CMakeFiles/unbound.dir/compat/arc4_lock.c.o
[ 29%] Building C object external/unbound/CMakeFiles/unbound.dir/compat/getentropy_linux.c.o
[ 29%] Building C object external/unbound/CMakeFiles/unbound.dir/libunbound/context.c.o
[ 30%] Building C object external/unbound/CMakeFiles/unbound.dir/libunbound/libunbound.c.o
[ 30%] Building C object external/unbound/CMakeFiles/unbound.dir/libunbound/libworker.c.o
[ 30%] Linking C shared library libunbound.so
make[3]: Leaving directory '/home/buildbot/slave/monero-tests-debian-armv8/build/build/debug'
[ 30%] Built target unbound
make[3]: Entering directory '/home/buildbot/slave/monero-tests-debian-armv8/build/build/debug'
Scanning dependencies of target lmdb
make[3]: Leaving directory '/home/buildbot/slave/monero-tests-debian-armv8/build/build/debug'
make[3]: Entering directory '/home/buildbot/slave/monero-tests-debian-armv8/build/build/debug'
[ 31%] Building C object external/db_drivers/liblmdb/CMakeFiles/lmdb.dir/mdb.c.o
[ 31%] Building C object external/db_drivers/liblmdb/CMakeFiles/lmdb.dir/midl.c.o
[ 32%] Linking C shared library liblmdb.so
make[3]: Leaving directory '/home/buildbot/slave/monero-tests-debian-armv8/build/build/debug'
[ 32%] Built target lmdb
make[3]: Entering directory '/home/buildbot/slave/monero-tests-debian-armv8/build/build/debug'
Scanning dependencies of target otshell_utils
make[3]: Leaving directory '/home/buildbot/slave/monero-tests-debian-armv8/build/build/debug'
make[3]: Entering directory '/home/buildbot/slave/monero-tests-debian-armv8/build/build/debug'
[ 33%] Building CXX object contrib/otshell_utils/CMakeFiles/otshell_utils.dir/ccolor.cpp.o
[ 33%] Building CXX object contrib/otshell_utils/CMakeFiles/otshell_utils.dir/runoptions.cpp.o
[ 33%] Building CXX object contrib/otshell_utils/CMakeFiles/otshell_utils.dir/utils.cpp.o
[ 34%] Building CXX object contrib/otshell_utils/CMakeFiles/otshell_utils.dir/windows_stream.cpp.o
[ 34%] Linking CXX shared library libotshell_utils.so
make[3]: Leaving directory '/home/buildbot/slave/monero-tests-debian-armv8/build/build/debug'
[ 34%] Built target otshell_utils
make[3]: Entering directory '/home/buildbot/slave/monero-tests-debian-armv8/build/build/debug'
Scanning dependencies of target obj_common
make[3]: Leaving directory '/home/buildbot/slave/monero-tests-debian-armv8/build/build/debug'
make[3]: Entering directory '/home/buildbot/slave/monero-tests-debian-armv8/build/build/debug'
[ 35%] Building CXX object src/common/CMakeFiles/obj_common.dir/base58.cpp.o
[ 35%] Building CXX object src/common/CMakeFiles/obj_common.dir/command_line.cpp.o
[ 36%] Building CXX object src/common/CMakeFiles/obj_common.dir/dns_utils.cpp.o
[ 36%] Building CXX object src/common/CMakeFiles/obj_common.dir/util.cpp.o
[ 36%] Building CXX object src/common/CMakeFiles/obj_common.dir/i18n.cpp.o
[ 37%] Building CXX object src/common/CMakeFiles/obj_common.dir/perf_timer.cpp.o
[ 37%] Building CXX object src/common/CMakeFiles/obj_common.dir/thread_group.cpp.o
In file included from /home/buildbot/slave/monero-tests-debian-armv8/build/contrib/epee/include/misc_log_ex.h:79:0,
                 from /home/buildbot/slave/monero-tests-debian-armv8/build/contrib/epee/include/serialization/keyvalue_serialization.h:31,
                 from /home/buildbot/slave/monero-tests-debian-armv8/build/src/p2p/p2p_protocol_defs.h:34,
                 from /home/buildbot/slave/monero-tests-debian-armv8/build/src/common/util.h:40,
                 from /home/buildbot/slave/monero-tests-debian-armv8/build/src/common/thread_group.cpp:34:
/home/buildbot/slave/monero-tests-debian-armv8/build/src/common/thread_group.cpp: In member function ‘void tools::thread_group::data::dispatch(std::function<void()>)’:
/home/buildbot/slave/monero-tests-debian-armv8/build/src/common/thread_group.cpp:154:18: error: ‘struct tools::thread_group::data::node’ has no member named ‘next’
     assert(last->next == nullptr);
                  ^
src/common/CMakeFiles/obj_common.dir/build.make:206: recipe for target 'src/common/CMakeFiles/obj_common.dir/thread_group.cpp.o' failed
make[3]: Leaving directory '/home/buildbot/slave/monero-tests-debian-armv8/build/build/debug'
make[3]: *** [src/common/CMakeFiles/obj_common.dir/thread_group.cpp.o] Error 1
CMakeFiles/Makefile2:438: recipe for target 'src/common/CMakeFiles/obj_common.dir/all' failed
make[2]: Leaving directory '/home/buildbot/slave/monero-tests-debian-armv8/build/build/debug'
make[2]: *** [src/common/CMakeFiles/obj_common.dir/all] Error 2
Makefile:138: recipe for target 'all' failed
make[1]: Leaving directory '/home/buildbot/slave/monero-tests-debian-armv8/build/build/debug'
make[1]: *** [all] Error 2
Makefile:39: recipe for target 'debug-test' failed
make: *** [debug-test] Error 2
program finished with exit code 2
elapsedTime=410.419911