(view as text)
Determining if the function memset_s exists in the c failed with the following output:
Change Dir: C:/msys64/home/vagrant/slave/monero-static-win64/build/build/release/CMakeFiles/CMakeTmp

Run Build Command:"C:/msys64/usr/bin/make.exe" "cmTC_99c7b/fast"
make[1]: Entering directory '/home/vagrant/slave/monero-static-win64/build/build/release/CMakeFiles/CMakeTmp'
/usr/bin/make -f CMakeFiles/cmTC_99c7b.dir/build.make CMakeFiles/cmTC_99c7b.dir/build
make[2]: Entering directory '/home/vagrant/slave/monero-static-win64/build/build/release/CMakeFiles/CMakeTmp'
Building C object CMakeFiles/cmTC_99c7b.dir/CheckFunctionExists.c.obj

/C/msys64/mingw64/bin/x86_64-w64-mingw32-gcc.exe   -DCHECK_FUNCTION_EXISTS=memset_s   -o CMakeFiles/cmTC_99c7b.dir/CheckFunctionExists.c.obj   -c /C/msys64/mingw64/share/cmake-3.12/Modules/CheckFunctionExists.c
Linking C executable cmTC_99c7b.exe

/C/msys64/mingw64/bin/cmake.exe -E remove -f CMakeFiles/cmTC_99c7b.dir/objects.a
ar cr CMakeFiles/cmTC_99c7b.dir/objects.a "CMakeFiles/cmTC_99c7b.dir/CheckFunctionExists.c.obj" 
/C/msys64/mingw64/bin/x86_64-w64-mingw32-gcc.exe  -DCHECK_FUNCTION_EXISTS=memset_s    -Wl,--whole-archive CMakeFiles/cmTC_99c7b.dir/objects.a -Wl,--no-whole-archive  -o cmTC_99c7b.exe -Wl,--major-image-version,0,--minor-image-version,0  -L/C/msys64/home/vagrant/slave/monero-static-win64/build/build/release/CMakeFiles/CMakeTmp/string.h -lc -lkernel32 -luser32 -lgdi32 -lwinspool -lshell32 -lole32 -loleaut32 -luuid -lcomdlg32 -ladvapi32 
C:/msys64/mingw64/bin/../lib/gcc/x86_64-w64-mingw32/8.2.1/../../../../x86_64-w64-mingw32/bin/ld.exe: cannot find -lc

collect2.exe: error: ld returned 1 exit status
make[2]: *** [CMakeFiles/cmTC_99c7b.dir/build.make:88: cmTC_99c7b.exe] Error 1
make[2]: Leaving directory '/home/vagrant/slave/monero-static-win64/build/build/release/CMakeFiles/CMakeTmp'
make[1]: *** [Makefile:121: cmTC_99c7b/fast] Error 2
make[1]: Leaving directory '/home/vagrant/slave/monero-static-win64/build/build/release/CMakeFiles/CMakeTmp'


Determining if the function explicit_bzero exists in the c failed with the following output:
Change Dir: C:/msys64/home/vagrant/slave/monero-static-win64/build/build/release/CMakeFiles/CMakeTmp

Run Build Command:"C:/msys64/usr/bin/make.exe" "cmTC_52c68/fast"
make[1]: Entering directory '/home/vagrant/slave/monero-static-win64/build/build/release/CMakeFiles/CMakeTmp'
/usr/bin/make -f CMakeFiles/cmTC_52c68.dir/build.make CMakeFiles/cmTC_52c68.dir/build
make[2]: Entering directory '/home/vagrant/slave/monero-static-win64/build/build/release/CMakeFiles/CMakeTmp'
Building C object CMakeFiles/cmTC_52c68.dir/CheckFunctionExists.c.obj

/C/msys64/mingw64/bin/x86_64-w64-mingw32-gcc.exe   -DCHECK_FUNCTION_EXISTS=explicit_bzero   -o CMakeFiles/cmTC_52c68.dir/CheckFunctionExists.c.obj   -c /C/msys64/mingw64/share/cmake-3.12/Modules/CheckFunctionExists.c
Linking C executable cmTC_52c68.exe

/C/msys64/mingw64/bin/cmake.exe -E remove -f CMakeFiles/cmTC_52c68.dir/objects.a
ar cr CMakeFiles/cmTC_52c68.dir/objects.a "CMakeFiles/cmTC_52c68.dir/CheckFunctionExists.c.obj" 
/C/msys64/mingw64/bin/x86_64-w64-mingw32-gcc.exe  -DCHECK_FUNCTION_EXISTS=explicit_bzero    -Wl,--whole-archive CMakeFiles/cmTC_52c68.dir/objects.a -Wl,--no-whole-archive  -o cmTC_52c68.exe -Wl,--major-image-version,0,--minor-image-version,0  -L/C/msys64/home/vagrant/slave/monero-static-win64/build/build/release/CMakeFiles/CMakeTmp/strings.h -lc -lkernel32 -luser32 -lgdi32 -lwinspool -lshell32 -lole32 -loleaut32 -luuid -lcomdlg32 -ladvapi32 
C:/msys64/mingw64/bin/../lib/gcc/x86_64-w64-mingw32/8.2.1/../../../../x86_64-w64-mingw32/bin/ld.exe: cannot find -lc

collect2.exe: error: ld returned 1 exit status
make[2]: *** [CMakeFiles/cmTC_52c68.dir/build.make:88: cmTC_52c68.exe] Error 1
make[2]: Leaving directory '/home/vagrant/slave/monero-static-win64/build/build/release/CMakeFiles/CMakeTmp'
make[1]: *** [Makefile:121: cmTC_52c68/fast] Error 2
make[1]: Leaving directory '/home/vagrant/slave/monero-static-win64/build/build/release/CMakeFiles/CMakeTmp'


Determining if the function strptime exists failed with the following output:
Change Dir: C:/msys64/home/vagrant/slave/monero-static-win64/build/build/release/CMakeFiles/CMakeTmp

Run Build Command:"C:/msys64/usr/bin/make.exe" "cmTC_e419f/fast"
make[1]: Entering directory '/home/vagrant/slave/monero-static-win64/build/build/release/CMakeFiles/CMakeTmp'
/usr/bin/make -f CMakeFiles/cmTC_e419f.dir/build.make CMakeFiles/cmTC_e419f.dir/build
make[2]: Entering directory '/home/vagrant/slave/monero-static-win64/build/build/release/CMakeFiles/CMakeTmp'
Building C object CMakeFiles/cmTC_e419f.dir/CheckFunctionExists.c.obj

/C/msys64/mingw64/bin/x86_64-w64-mingw32-gcc.exe   -DCHECK_FUNCTION_EXISTS=strptime   -o CMakeFiles/cmTC_e419f.dir/CheckFunctionExists.c.obj   -c /C/msys64/mingw64/share/cmake-3.12/Modules/CheckFunctionExists.c
Linking C executable cmTC_e419f.exe

/C/msys64/mingw64/bin/cmake.exe -E remove -f CMakeFiles/cmTC_e419f.dir/objects.a
ar cr CMakeFiles/cmTC_e419f.dir/objects.a "CMakeFiles/cmTC_e419f.dir/CheckFunctionExists.c.obj" 
/C/msys64/mingw64/bin/x86_64-w64-mingw32-gcc.exe  -DCHECK_FUNCTION_EXISTS=strptime    -Wl,--whole-archive CMakeFiles/cmTC_e419f.dir/objects.a -Wl,--no-whole-archive  -o cmTC_e419f.exe -Wl,--major-image-version,0,--minor-image-version,0 -lkernel32 -luser32 -lgdi32 -lwinspool -lshell32 -lole32 -loleaut32 -luuid -lcomdlg32 -ladvapi32 
CMakeFiles/cmTC_e419f.dir/objects.a(CheckFunctionExists.c.obj):CheckFunctionExists.c:(.text+0x15): undefined reference to `strptime'

collect2.exe: error: ld returned 1 exit status
make[2]: *** [CMakeFiles/cmTC_e419f.dir/build.make:88: cmTC_e419f.exe] Error 1
make[2]: Leaving directory '/home/vagrant/slave/monero-static-win64/build/build/release/CMakeFiles/CMakeTmp'
make[1]: *** [Makefile:121: cmTC_e419f/fast] Error 2
make[1]: Leaving directory '/home/vagrant/slave/monero-static-win64/build/build/release/CMakeFiles/CMakeTmp'


Determining if the include file arpa/inet.h exists failed with the following output:
Change Dir: C:/msys64/home/vagrant/slave/monero-static-win64/build/build/release/CMakeFiles/CMakeTmp

Run Build Command:"C:/msys64/usr/bin/make.exe" "cmTC_d8d73/fast"
make[1]: Entering directory '/home/vagrant/slave/monero-static-win64/build/build/release/CMakeFiles/CMakeTmp'
/usr/bin/make -f CMakeFiles/cmTC_d8d73.dir/build.make CMakeFiles/cmTC_d8d73.dir/build
make[2]: Entering directory '/home/vagrant/slave/monero-static-win64/build/build/release/CMakeFiles/CMakeTmp'
Building C object CMakeFiles/cmTC_d8d73.dir/CheckIncludeFile.c.obj

/C/msys64/mingw64/bin/x86_64-w64-mingw32-gcc.exe    -o CMakeFiles/cmTC_d8d73.dir/CheckIncludeFile.c.obj   -c /C/msys64/home/vagrant/slave/monero-static-win64/build/build/release/CMakeFiles/CMakeTmp/CheckIncludeFile.c
C:/msys64/home/vagrant/slave/monero-static-win64/build/build/release/CMakeFiles/CMakeTmp/CheckIncludeFile.c:1:10: fatal error: arpa/inet.h: No such file or directory
 #include <arpa/inet.h>
          ^~~~~~~~~~~~~
compilation terminated.

make[2]: *** [CMakeFiles/cmTC_d8d73.dir/build.make:66: CMakeFiles/cmTC_d8d73.dir/CheckIncludeFile.c.obj] Error 1
make[2]: Leaving directory '/home/vagrant/slave/monero-static-win64/build/build/release/CMakeFiles/CMakeTmp'
make[1]: *** [Makefile:121: cmTC_d8d73/fast] Error 2
make[1]: Leaving directory '/home/vagrant/slave/monero-static-win64/build/build/release/CMakeFiles/CMakeTmp'


Determining if the include file endian.h exists failed with the following output:
Change Dir: C:/msys64/home/vagrant/slave/monero-static-win64/build/build/release/CMakeFiles/CMakeTmp

Run Build Command:"C:/msys64/usr/bin/make.exe" "cmTC_34a21/fast"
make[1]: Entering directory '/home/vagrant/slave/monero-static-win64/build/build/release/CMakeFiles/CMakeTmp'
/usr/bin/make -f CMakeFiles/cmTC_34a21.dir/build.make CMakeFiles/cmTC_34a21.dir/build
make[2]: Entering directory '/home/vagrant/slave/monero-static-win64/build/build/release/CMakeFiles/CMakeTmp'
Building C object CMakeFiles/cmTC_34a21.dir/CheckIncludeFile.c.obj

/C/msys64/mingw64/bin/x86_64-w64-mingw32-gcc.exe    -o CMakeFiles/cmTC_34a21.dir/CheckIncludeFile.c.obj   -c /C/msys64/home/vagrant/slave/monero-static-win64/build/build/release/CMakeFiles/CMakeTmp/CheckIncludeFile.c
C:/msys64/home/vagrant/slave/monero-static-win64/build/build/release/CMakeFiles/CMakeTmp/CheckIncludeFile.c:1:10: fatal error: endian.h: No such file or directory
 #include <endian.h>
          ^~~~~~~~~~
compilation terminated.

make[2]: *** [CMakeFiles/cmTC_34a21.dir/build.make:66: CMakeFiles/cmTC_34a21.dir/CheckIncludeFile.c.obj] Error 1
make[2]: Leaving directory '/home/vagrant/slave/monero-static-win64/build/build/release/CMakeFiles/CMakeTmp'
make[1]: *** [Makefile:121: cmTC_34a21/fast] Error 2
make[1]: Leaving directory '/home/vagrant/slave/monero-static-win64/build/build/release/CMakeFiles/CMakeTmp'


Determining if the include file dlfcn.h exists failed with the following output:
Change Dir: C:/msys64/home/vagrant/slave/monero-static-win64/build/build/release/CMakeFiles/CMakeTmp

Run Build Command:"C:/msys64/usr/bin/make.exe" "cmTC_887f7/fast"
make[1]: Entering directory '/home/vagrant/slave/monero-static-win64/build/build/release/CMakeFiles/CMakeTmp'
/usr/bin/make -f CMakeFiles/cmTC_887f7.dir/build.make CMakeFiles/cmTC_887f7.dir/build
make[2]: Entering directory '/home/vagrant/slave/monero-static-win64/build/build/release/CMakeFiles/CMakeTmp'
Building C object CMakeFiles/cmTC_887f7.dir/CheckIncludeFile.c.obj

/C/msys64/mingw64/bin/x86_64-w64-mingw32-gcc.exe    -o CMakeFiles/cmTC_887f7.dir/CheckIncludeFile.c.obj   -c /C/msys64/home/vagrant/slave/monero-static-win64/build/build/release/CMakeFiles/CMakeTmp/CheckIncludeFile.c
C:/msys64/home/vagrant/slave/monero-static-win64/build/build/release/CMakeFiles/CMakeTmp/CheckIncludeFile.c:1:10: fatal error: dlfcn.h: No such file or directory
 #include <dlfcn.h>
          ^~~~~~~~~
compilation terminated.

make[2]: *** [CMakeFiles/cmTC_887f7.dir/build.make:66: CMakeFiles/cmTC_887f7.dir/CheckIncludeFile.c.obj] Error 1
make[2]: Leaving directory '/home/vagrant/slave/monero-static-win64/build/build/release/CMakeFiles/CMakeTmp'
make[1]: *** [Makefile:121: cmTC_887f7/fast] Error 2
make[1]: Leaving directory '/home/vagrant/slave/monero-static-win64/build/build/release/CMakeFiles/CMakeTmp'


Determining if the include file event.h exists failed with the following output:
Change Dir: C:/msys64/home/vagrant/slave/monero-static-win64/build/build/release/CMakeFiles/CMakeTmp

Run Build Command:"C:/msys64/usr/bin/make.exe" "cmTC_932a6/fast"
make[1]: Entering directory '/home/vagrant/slave/monero-static-win64/build/build/release/CMakeFiles/CMakeTmp'
/usr/bin/make -f CMakeFiles/cmTC_932a6.dir/build.make CMakeFiles/cmTC_932a6.dir/build
make[2]: Entering directory '/home/vagrant/slave/monero-static-win64/build/build/release/CMakeFiles/CMakeTmp'
Building C object CMakeFiles/cmTC_932a6.dir/CheckIncludeFile.c.obj

/C/msys64/mingw64/bin/x86_64-w64-mingw32-gcc.exe    -o CMakeFiles/cmTC_932a6.dir/CheckIncludeFile.c.obj   -c /C/msys64/home/vagrant/slave/monero-static-win64/build/build/release/CMakeFiles/CMakeTmp/CheckIncludeFile.c
C:/msys64/home/vagrant/slave/monero-static-win64/build/build/release/CMakeFiles/CMakeTmp/CheckIncludeFile.c:1:10: fatal error: event.h: No such file or directory
 #include <event.h>
          ^~~~~~~~~
compilation terminated.

make[2]: *** [CMakeFiles/cmTC_932a6.dir/build.make:66: CMakeFiles/cmTC_932a6.dir/CheckIncludeFile.c.obj] Error 1
make[2]: Leaving directory '/home/vagrant/slave/monero-static-win64/build/build/release/CMakeFiles/CMakeTmp'
make[1]: *** [Makefile:121: cmTC_932a6/fast] Error 2
make[1]: Leaving directory '/home/vagrant/slave/monero-static-win64/build/build/release/CMakeFiles/CMakeTmp'


Determining if the include file glob.h exists failed with the following output:
Change Dir: C:/msys64/home/vagrant/slave/monero-static-win64/build/build/release/CMakeFiles/CMakeTmp

Run Build Command:"C:/msys64/usr/bin/make.exe" "cmTC_7c124/fast"
make[1]: Entering directory '/home/vagrant/slave/monero-static-win64/build/build/release/CMakeFiles/CMakeTmp'
/usr/bin/make -f CMakeFiles/cmTC_7c124.dir/build.make CMakeFiles/cmTC_7c124.dir/build
make[2]: Entering directory '/home/vagrant/slave/monero-static-win64/build/build/release/CMakeFiles/CMakeTmp'
Building C object CMakeFiles/cmTC_7c124.dir/CheckIncludeFile.c.obj

/C/msys64/mingw64/bin/x86_64-w64-mingw32-gcc.exe    -o CMakeFiles/cmTC_7c124.dir/CheckIncludeFile.c.obj   -c /C/msys64/home/vagrant/slave/monero-static-win64/build/build/release/CMakeFiles/CMakeTmp/CheckIncludeFile.c
C:/msys64/home/vagrant/slave/monero-static-win64/build/build/release/CMakeFiles/CMakeTmp/CheckIncludeFile.c:1:10: fatal error: glob.h: No such file or directory
 #include <glob.h>
          ^~~~~~~~
compilation terminated.

make[2]: *** [CMakeFiles/cmTC_7c124.dir/build.make:66: CMakeFiles/cmTC_7c124.dir/CheckIncludeFile.c.obj] Error 1
make[2]: Leaving directory '/home/vagrant/slave/monero-static-win64/build/build/release/CMakeFiles/CMakeTmp'
make[1]: *** [Makefile:121: cmTC_7c124/fast] Error 2
make[1]: Leaving directory '/home/vagrant/slave/monero-static-win64/build/build/release/CMakeFiles/CMakeTmp'


Determining if the include file grp.h exists failed with the following output:
Change Dir: C:/msys64/home/vagrant/slave/monero-static-win64/build/build/release/CMakeFiles/CMakeTmp

Run Build Command:"C:/msys64/usr/bin/make.exe" "cmTC_33d5e/fast"
make[1]: Entering directory '/home/vagrant/slave/monero-static-win64/build/build/release/CMakeFiles/CMakeTmp'
/usr/bin/make -f CMakeFiles/cmTC_33d5e.dir/build.make CMakeFiles/cmTC_33d5e.dir/build
make[2]: Entering directory '/home/vagrant/slave/monero-static-win64/build/build/release/CMakeFiles/CMakeTmp'
Building C object CMakeFiles/cmTC_33d5e.dir/CheckIncludeFile.c.obj

/C/msys64/mingw64/bin/x86_64-w64-mingw32-gcc.exe    -o CMakeFiles/cmTC_33d5e.dir/CheckIncludeFile.c.obj   -c /C/msys64/home/vagrant/slave/monero-static-win64/build/build/release/CMakeFiles/CMakeTmp/CheckIncludeFile.c
C:/msys64/home/vagrant/slave/monero-static-win64/build/build/release/CMakeFiles/CMakeTmp/CheckIncludeFile.c:1:10: fatal error: grp.h: No such file or directory
 #include <grp.h>
          ^~~~~~~
compilation terminated.

make[2]: *** [CMakeFiles/cmTC_33d5e.dir/build.make:66: CMakeFiles/cmTC_33d5e.dir/CheckIncludeFile.c.obj] Error 1
make[2]: Leaving directory '/home/vagrant/slave/monero-static-win64/build/build/release/CMakeFiles/CMakeTmp'
make[1]: *** [Makefile:121: cmTC_33d5e/fast] Error 2
make[1]: Leaving directory '/home/vagrant/slave/monero-static-win64/build/build/release/CMakeFiles/CMakeTmp'


Determining if the include file login_cap.h exists failed with the following output:
Change Dir: C:/msys64/home/vagrant/slave/monero-static-win64/build/build/release/CMakeFiles/CMakeTmp

Run Build Command:"C:/msys64/usr/bin/make.exe" "cmTC_a15a4/fast"
make[1]: Entering directory '/home/vagrant/slave/monero-static-win64/build/build/release/CMakeFiles/CMakeTmp'
/usr/bin/make -f CMakeFiles/cmTC_a15a4.dir/build.make CMakeFiles/cmTC_a15a4.dir/build
make[2]: Entering directory '/home/vagrant/slave/monero-static-win64/build/build/release/CMakeFiles/CMakeTmp'
Building C object CMakeFiles/cmTC_a15a4.dir/CheckIncludeFile.c.obj

/C/msys64/mingw64/bin/x86_64-w64-mingw32-gcc.exe    -o CMakeFiles/cmTC_a15a4.dir/CheckIncludeFile.c.obj   -c /C/msys64/home/vagrant/slave/monero-static-win64/build/build/release/CMakeFiles/CMakeTmp/CheckIncludeFile.c
C:/msys64/home/vagrant/slave/monero-static-win64/build/build/release/CMakeFiles/CMakeTmp/CheckIncludeFile.c:1:10: fatal error: login_cap.h: No such file or directory
 #include <login_cap.h>
          ^~~~~~~~~~~~~
compilation terminated.

make[2]: *** [CMakeFiles/cmTC_a15a4.dir/build.make:66: CMakeFiles/cmTC_a15a4.dir/CheckIncludeFile.c.obj] Error 1
make[2]: Leaving directory '/home/vagrant/slave/monero-static-win64/build/build/release/CMakeFiles/CMakeTmp'
make[1]: *** [Makefile:121: cmTC_a15a4/fast] Error 2
make[1]: Leaving directory '/home/vagrant/slave/monero-static-win64/build/build/release/CMakeFiles/CMakeTmp'


Determining if the include file netdb.h exists failed with the following output:
Change Dir: C:/msys64/home/vagrant/slave/monero-static-win64/build/build/release/CMakeFiles/CMakeTmp

Run Build Command:"C:/msys64/usr/bin/make.exe" "cmTC_d063d/fast"
make[1]: Entering directory '/home/vagrant/slave/monero-static-win64/build/build/release/CMakeFiles/CMakeTmp'
/usr/bin/make -f CMakeFiles/cmTC_d063d.dir/build.make CMakeFiles/cmTC_d063d.dir/build
make[2]: Entering directory '/home/vagrant/slave/monero-static-win64/build/build/release/CMakeFiles/CMakeTmp'
Building C object CMakeFiles/cmTC_d063d.dir/CheckIncludeFile.c.obj

/C/msys64/mingw64/bin/x86_64-w64-mingw32-gcc.exe    -o CMakeFiles/cmTC_d063d.dir/CheckIncludeFile.c.obj   -c /C/msys64/home/vagrant/slave/monero-static-win64/build/build/release/CMakeFiles/CMakeTmp/CheckIncludeFile.c
C:/msys64/home/vagrant/slave/monero-static-win64/build/build/release/CMakeFiles/CMakeTmp/CheckIncludeFile.c:1:10: fatal error: netdb.h: No such file or directory
 #include <netdb.h>
          ^~~~~~~~~
compilation terminated.

make[2]: *** [CMakeFiles/cmTC_d063d.dir/build.make:66: CMakeFiles/cmTC_d063d.dir/CheckIncludeFile.c.obj] Error 1
make[2]: Leaving directory '/home/vagrant/slave/monero-static-win64/build/build/release/CMakeFiles/CMakeTmp'
make[1]: *** [Makefile:121: cmTC_d063d/fast] Error 2
make[1]: Leaving directory '/home/vagrant/slave/monero-static-win64/build/build/release/CMakeFiles/CMakeTmp'


Determining if the include file netinet/in.h exists failed with the following output:
Change Dir: C:/msys64/home/vagrant/slave/monero-static-win64/build/build/release/CMakeFiles/CMakeTmp

Run Build Command:"C:/msys64/usr/bin/make.exe" "cmTC_5c6c5/fast"
make[1]: Entering directory '/home/vagrant/slave/monero-static-win64/build/build/release/CMakeFiles/CMakeTmp'
/usr/bin/make -f CMakeFiles/cmTC_5c6c5.dir/build.make CMakeFiles/cmTC_5c6c5.dir/build
make[2]: Entering directory '/home/vagrant/slave/monero-static-win64/build/build/release/CMakeFiles/CMakeTmp'
Building C object CMakeFiles/cmTC_5c6c5.dir/CheckIncludeFile.c.obj

/C/msys64/mingw64/bin/x86_64-w64-mingw32-gcc.exe    -o CMakeFiles/cmTC_5c6c5.dir/CheckIncludeFile.c.obj   -c /C/msys64/home/vagrant/slave/monero-static-win64/build/build/release/CMakeFiles/CMakeTmp/CheckIncludeFile.c
C:/msys64/home/vagrant/slave/monero-static-win64/build/build/release/CMakeFiles/CMakeTmp/CheckIncludeFile.c:1:10: fatal error: netinet/in.h: No such file or directory
 #include <netinet/in.h>
          ^~~~~~~~~~~~~~
compilation terminated.

make[2]: *** [CMakeFiles/cmTC_5c6c5.dir/build.make:66: CMakeFiles/cmTC_5c6c5.dir/CheckIncludeFile.c.obj] Error 1
make[2]: Leaving directory '/home/vagrant/slave/monero-static-win64/build/build/release/CMakeFiles/CMakeTmp'
make[1]: *** [Makefile:121: cmTC_5c6c5/fast] Error 2
make[1]: Leaving directory '/home/vagrant/slave/monero-static-win64/build/build/release/CMakeFiles/CMakeTmp'


Determining if the include file pwd.h exists failed with the following output:
Change Dir: C:/msys64/home/vagrant/slave/monero-static-win64/build/build/release/CMakeFiles/CMakeTmp

Run Build Command:"C:/msys64/usr/bin/make.exe" "cmTC_4aa34/fast"
make[1]: Entering directory '/home/vagrant/slave/monero-static-win64/build/build/release/CMakeFiles/CMakeTmp'
/usr/bin/make -f CMakeFiles/cmTC_4aa34.dir/build.make CMakeFiles/cmTC_4aa34.dir/build
make[2]: Entering directory '/home/vagrant/slave/monero-static-win64/build/build/release/CMakeFiles/CMakeTmp'
Building C object CMakeFiles/cmTC_4aa34.dir/CheckIncludeFile.c.obj

/C/msys64/mingw64/bin/x86_64-w64-mingw32-gcc.exe    -o CMakeFiles/cmTC_4aa34.dir/CheckIncludeFile.c.obj   -c /C/msys64/home/vagrant/slave/monero-static-win64/build/build/release/CMakeFiles/CMakeTmp/CheckIncludeFile.c
C:/msys64/home/vagrant/slave/monero-static-win64/build/build/release/CMakeFiles/CMakeTmp/CheckIncludeFile.c:1:10: fatal error: pwd.h: No such file or directory
 #include <pwd.h>
          ^~~~~~~
compilation terminated.

make[2]: *** [CMakeFiles/cmTC_4aa34.dir/build.make:66: CMakeFiles/cmTC_4aa34.dir/CheckIncludeFile.c.obj] Error 1
make[2]: Leaving directory '/home/vagrant/slave/monero-static-win64/build/build/release/CMakeFiles/CMakeTmp'
make[1]: *** [Makefile:121: cmTC_4aa34/fast] Error 2
make[1]: Leaving directory '/home/vagrant/slave/monero-static-win64/build/build/release/CMakeFiles/CMakeTmp'


Determining if the include file sys/resource.h exists failed with the following output:
Change Dir: C:/msys64/home/vagrant/slave/monero-static-win64/build/build/release/CMakeFiles/CMakeTmp

Run Build Command:"C:/msys64/usr/bin/make.exe" "cmTC_559c0/fast"
make[1]: Entering directory '/home/vagrant/slave/monero-static-win64/build/build/release/CMakeFiles/CMakeTmp'
/usr/bin/make -f CMakeFiles/cmTC_559c0.dir/build.make CMakeFiles/cmTC_559c0.dir/build
make[2]: Entering directory '/home/vagrant/slave/monero-static-win64/build/build/release/CMakeFiles/CMakeTmp'
Building C object CMakeFiles/cmTC_559c0.dir/CheckIncludeFile.c.obj

/C/msys64/mingw64/bin/x86_64-w64-mingw32-gcc.exe    -o CMakeFiles/cmTC_559c0.dir/CheckIncludeFile.c.obj   -c /C/msys64/home/vagrant/slave/monero-static-win64/build/build/release/CMakeFiles/CMakeTmp/CheckIncludeFile.c
C:/msys64/home/vagrant/slave/monero-static-win64/build/build/release/CMakeFiles/CMakeTmp/CheckIncludeFile.c:1:10: fatal error: sys/resource.h: No such file or directory
 #include <sys/resource.h>
          ^~~~~~~~~~~~~~~~
compilation terminated.

make[2]: *** [CMakeFiles/cmTC_559c0.dir/build.make:66: CMakeFiles/cmTC_559c0.dir/CheckIncludeFile.c.obj] Error 1
make[2]: Leaving directory '/home/vagrant/slave/monero-static-win64/build/build/release/CMakeFiles/CMakeTmp'
make[1]: *** [Makefile:121: cmTC_559c0/fast] Error 2
make[1]: Leaving directory '/home/vagrant/slave/monero-static-win64/build/build/release/CMakeFiles/CMakeTmp'


Determining if the include file sys/sha2.h exists failed with the following output:
Change Dir: C:/msys64/home/vagrant/slave/monero-static-win64/build/build/release/CMakeFiles/CMakeTmp

Run Build Command:"C:/msys64/usr/bin/make.exe" "cmTC_637cf/fast"
make[1]: Entering directory '/home/vagrant/slave/monero-static-win64/build/build/release/CMakeFiles/CMakeTmp'
/usr/bin/make -f CMakeFiles/cmTC_637cf.dir/build.make CMakeFiles/cmTC_637cf.dir/build
make[2]: Entering directory '/home/vagrant/slave/monero-static-win64/build/build/release/CMakeFiles/CMakeTmp'
Building C object CMakeFiles/cmTC_637cf.dir/CheckIncludeFile.c.obj

/C/msys64/mingw64/bin/x86_64-w64-mingw32-gcc.exe    -o CMakeFiles/cmTC_637cf.dir/CheckIncludeFile.c.obj   -c /C/msys64/home/vagrant/slave/monero-static-win64/build/build/release/CMakeFiles/CMakeTmp/CheckIncludeFile.c
C:/msys64/home/vagrant/slave/monero-static-win64/build/build/release/CMakeFiles/CMakeTmp/CheckIncludeFile.c:1:10: fatal error: sys/sha2.h: No such file or directory
 #include <sys/sha2.h>
          ^~~~~~~~~~~~
compilation terminated.

make[2]: *** [CMakeFiles/cmTC_637cf.dir/build.make:66: CMakeFiles/cmTC_637cf.dir/CheckIncludeFile.c.obj] Error 1
make[2]: Leaving directory '/home/vagrant/slave/monero-static-win64/build/build/release/CMakeFiles/CMakeTmp'
make[1]: *** [Makefile:121: cmTC_637cf/fast] Error 2
make[1]: Leaving directory '/home/vagrant/slave/monero-static-win64/build/build/release/CMakeFiles/CMakeTmp'


Determining if the include file sys/socket.h exists failed with the following output:
Change Dir: C:/msys64/home/vagrant/slave/monero-static-win64/build/build/release/CMakeFiles/CMakeTmp

Run Build Command:"C:/msys64/usr/bin/make.exe" "cmTC_9a1ec/fast"
make[1]: Entering directory '/home/vagrant/slave/monero-static-win64/build/build/release/CMakeFiles/CMakeTmp'
/usr/bin/make -f CMakeFiles/cmTC_9a1ec.dir/build.make CMakeFiles/cmTC_9a1ec.dir/build
make[2]: Entering directory '/home/vagrant/slave/monero-static-win64/build/build/release/CMakeFiles/CMakeTmp'
Building C object CMakeFiles/cmTC_9a1ec.dir/CheckIncludeFile.c.obj

/C/msys64/mingw64/bin/x86_64-w64-mingw32-gcc.exe    -o CMakeFiles/cmTC_9a1ec.dir/CheckIncludeFile.c.obj   -c /C/msys64/home/vagrant/slave/monero-static-win64/build/build/release/CMakeFiles/CMakeTmp/CheckIncludeFile.c
C:/msys64/home/vagrant/slave/monero-static-win64/build/build/release/CMakeFiles/CMakeTmp/CheckIncludeFile.c:1:10: fatal error: sys/socket.h: No such file or directory
 #include <sys/socket.h>
          ^~~~~~~~~~~~~~
compilation terminated.

make[2]: *** [CMakeFiles/cmTC_9a1ec.dir/build.make:66: CMakeFiles/cmTC_9a1ec.dir/CheckIncludeFile.c.obj] Error 1
make[2]: Leaving directory '/home/vagrant/slave/monero-static-win64/build/build/release/CMakeFiles/CMakeTmp'
make[1]: *** [Makefile:121: cmTC_9a1ec/fast] Error 2
make[1]: Leaving directory '/home/vagrant/slave/monero-static-win64/build/build/release/CMakeFiles/CMakeTmp'


Determining if the include file sys/sysctl.h exists failed with the following output:
Change Dir: C:/msys64/home/vagrant/slave/monero-static-win64/build/build/release/CMakeFiles/CMakeTmp

Run Build Command:"C:/msys64/usr/bin/make.exe" "cmTC_e1ae9/fast"
make[1]: Entering directory '/home/vagrant/slave/monero-static-win64/build/build/release/CMakeFiles/CMakeTmp'
/usr/bin/make -f CMakeFiles/cmTC_e1ae9.dir/build.make CMakeFiles/cmTC_e1ae9.dir/build
make[2]: Entering directory '/home/vagrant/slave/monero-static-win64/build/build/release/CMakeFiles/CMakeTmp'
Building C object CMakeFiles/cmTC_e1ae9.dir/CheckIncludeFile.c.obj

/C/msys64/mingw64/bin/x86_64-w64-mingw32-gcc.exe    -o CMakeFiles/cmTC_e1ae9.dir/CheckIncludeFile.c.obj   -c /C/msys64/home/vagrant/slave/monero-static-win64/build/build/release/CMakeFiles/CMakeTmp/CheckIncludeFile.c
C:/msys64/home/vagrant/slave/monero-static-win64/build/build/release/CMakeFiles/CMakeTmp/CheckIncludeFile.c:1:10: fatal error: sys/sysctl.h: No such file or directory
 #include <sys/sysctl.h>
          ^~~~~~~~~~~~~~
compilation terminated.

make[2]: *** [CMakeFiles/cmTC_e1ae9.dir/build.make:66: CMakeFiles/cmTC_e1ae9.dir/CheckIncludeFile.c.obj] Error 1
make[2]: Leaving directory '/home/vagrant/slave/monero-static-win64/build/build/release/CMakeFiles/CMakeTmp'
make[1]: *** [Makefile:121: cmTC_e1ae9/fast] Error 2
make[1]: Leaving directory '/home/vagrant/slave/monero-static-win64/build/build/release/CMakeFiles/CMakeTmp'


Determining if the include file sys/uio.h exists failed with the following output:
Change Dir: C:/msys64/home/vagrant/slave/monero-static-win64/build/build/release/CMakeFiles/CMakeTmp

Run Build Command:"C:/msys64/usr/bin/make.exe" "cmTC_cad57/fast"
make[1]: Entering directory '/home/vagrant/slave/monero-static-win64/build/build/release/CMakeFiles/CMakeTmp'
/usr/bin/make -f CMakeFiles/cmTC_cad57.dir/build.make CMakeFiles/cmTC_cad57.dir/build
make[2]: Entering directory '/home/vagrant/slave/monero-static-win64/build/build/release/CMakeFiles/CMakeTmp'
Building C object CMakeFiles/cmTC_cad57.dir/CheckIncludeFile.c.obj

/C/msys64/mingw64/bin/x86_64-w64-mingw32-gcc.exe    -o CMakeFiles/cmTC_cad57.dir/CheckIncludeFile.c.obj   -c /C/msys64/home/vagrant/slave/monero-static-win64/build/build/release/CMakeFiles/CMakeTmp/CheckIncludeFile.c
C:/msys64/home/vagrant/slave/monero-static-win64/build/build/release/CMakeFiles/CMakeTmp/CheckIncludeFile.c:1:10: fatal error: sys/uio.h: No such file or directory
 #include <sys/uio.h>
          ^~~~~~~~~~~
compilation terminated.

make[2]: *** [CMakeFiles/cmTC_cad57.dir/build.make:66: CMakeFiles/cmTC_cad57.dir/CheckIncludeFile.c.obj] Error 1
make[2]: Leaving directory '/home/vagrant/slave/monero-static-win64/build/build/release/CMakeFiles/CMakeTmp'
make[1]: *** [Makefile:121: cmTC_cad57/fast] Error 2
make[1]: Leaving directory '/home/vagrant/slave/monero-static-win64/build/build/release/CMakeFiles/CMakeTmp'


Determining if the include file sys/un.h exists failed with the following output:
Change Dir: C:/msys64/home/vagrant/slave/monero-static-win64/build/build/release/CMakeFiles/CMakeTmp

Run Build Command:"C:/msys64/usr/bin/make.exe" "cmTC_abaa7/fast"
make[1]: Entering directory '/home/vagrant/slave/monero-static-win64/build/build/release/CMakeFiles/CMakeTmp'
/usr/bin/make -f CMakeFiles/cmTC_abaa7.dir/build.make CMakeFiles/cmTC_abaa7.dir/build
make[2]: Entering directory '/home/vagrant/slave/monero-static-win64/build/build/release/CMakeFiles/CMakeTmp'
Building C object CMakeFiles/cmTC_abaa7.dir/CheckIncludeFile.c.obj

/C/msys64/mingw64/bin/x86_64-w64-mingw32-gcc.exe    -o CMakeFiles/cmTC_abaa7.dir/CheckIncludeFile.c.obj   -c /C/msys64/home/vagrant/slave/monero-static-win64/build/build/release/CMakeFiles/CMakeTmp/CheckIncludeFile.c
C:/msys64/home/vagrant/slave/monero-static-win64/build/build/release/CMakeFiles/CMakeTmp/CheckIncludeFile.c:1:10: fatal error: sys/un.h: No such file or directory
 #include <sys/un.h>
          ^~~~~~~~~~
compilation terminated.

make[2]: *** [CMakeFiles/cmTC_abaa7.dir/build.make:66: CMakeFiles/cmTC_abaa7.dir/CheckIncludeFile.c.obj] Error 1
make[2]: Leaving directory '/home/vagrant/slave/monero-static-win64/build/build/release/CMakeFiles/CMakeTmp'
make[1]: *** [Makefile:121: cmTC_abaa7/fast] Error 2
make[1]: Leaving directory '/home/vagrant/slave/monero-static-win64/build/build/release/CMakeFiles/CMakeTmp'


Determining if the include file sys/wait.h exists failed with the following output:
Change Dir: C:/msys64/home/vagrant/slave/monero-static-win64/build/build/release/CMakeFiles/CMakeTmp

Run Build Command:"C:/msys64/usr/bin/make.exe" "cmTC_778a8/fast"
make[1]: Entering directory '/home/vagrant/slave/monero-static-win64/build/build/release/CMakeFiles/CMakeTmp'
/usr/bin/make -f CMakeFiles/cmTC_778a8.dir/build.make CMakeFiles/cmTC_778a8.dir/build
make[2]: Entering directory '/home/vagrant/slave/monero-static-win64/build/build/release/CMakeFiles/CMakeTmp'
Building C object CMakeFiles/cmTC_778a8.dir/CheckIncludeFile.c.obj

/C/msys64/mingw64/bin/x86_64-w64-mingw32-gcc.exe    -o CMakeFiles/cmTC_778a8.dir/CheckIncludeFile.c.obj   -c /C/msys64/home/vagrant/slave/monero-static-win64/build/build/release/CMakeFiles/CMakeTmp/CheckIncludeFile.c
C:/msys64/home/vagrant/slave/monero-static-win64/build/build/release/CMakeFiles/CMakeTmp/CheckIncludeFile.c:1:10: fatal error: sys/wait.h: No such file or directory
 #include <sys/wait.h>
          ^~~~~~~~~~~~
compilation terminated.

make[2]: *** [CMakeFiles/cmTC_778a8.dir/build.make:66: CMakeFiles/cmTC_778a8.dir/CheckIncludeFile.c.obj] Error 1
make[2]: Leaving directory '/home/vagrant/slave/monero-static-win64/build/build/release/CMakeFiles/CMakeTmp'
make[1]: *** [Makefile:121: cmTC_778a8/fast] Error 2
make[1]: Leaving directory '/home/vagrant/slave/monero-static-win64/build/build/release/CMakeFiles/CMakeTmp'


Determining if the include file syslog.h exists failed with the following output:
Change Dir: C:/msys64/home/vagrant/slave/monero-static-win64/build/build/release/CMakeFiles/CMakeTmp

Run Build Command:"C:/msys64/usr/bin/make.exe" "cmTC_f9c5d/fast"
make[1]: Entering directory '/home/vagrant/slave/monero-static-win64/build/build/release/CMakeFiles/CMakeTmp'
/usr/bin/make -f CMakeFiles/cmTC_f9c5d.dir/build.make CMakeFiles/cmTC_f9c5d.dir/build
make[2]: Entering directory '/home/vagrant/slave/monero-static-win64/build/build/release/CMakeFiles/CMakeTmp'
Building C object CMakeFiles/cmTC_f9c5d.dir/CheckIncludeFile.c.obj

/C/msys64/mingw64/bin/x86_64-w64-mingw32-gcc.exe    -o CMakeFiles/cmTC_f9c5d.dir/CheckIncludeFile.c.obj   -c /C/msys64/home/vagrant/slave/monero-static-win64/build/build/release/CMakeFiles/CMakeTmp/CheckIncludeFile.c
C:/msys64/home/vagrant/slave/monero-static-win64/build/build/release/CMakeFiles/CMakeTmp/CheckIncludeFile.c:1:10: fatal error: syslog.h: No such file or directory
 #include <syslog.h>
          ^~~~~~~~~~
compilation terminated.

make[2]: *** [CMakeFiles/cmTC_f9c5d.dir/build.make:66: CMakeFiles/cmTC_f9c5d.dir/CheckIncludeFile.c.obj] Error 1
make[2]: Leaving directory '/home/vagrant/slave/monero-static-win64/build/build/release/CMakeFiles/CMakeTmp'
make[1]: *** [Makefile:121: cmTC_f9c5d/fast] Error 2
make[1]: Leaving directory '/home/vagrant/slave/monero-static-win64/build/build/release/CMakeFiles/CMakeTmp'


Determining if the include file vfork.h exists failed with the following output:
Change Dir: C:/msys64/home/vagrant/slave/monero-static-win64/build/build/release/CMakeFiles/CMakeTmp

Run Build Command:"C:/msys64/usr/bin/make.exe" "cmTC_8225e/fast"
make[1]: Entering directory '/home/vagrant/slave/monero-static-win64/build/build/release/CMakeFiles/CMakeTmp'
/usr/bin/make -f CMakeFiles/cmTC_8225e.dir/build.make CMakeFiles/cmTC_8225e.dir/build
make[2]: Entering directory '/home/vagrant/slave/monero-static-win64/build/build/release/CMakeFiles/CMakeTmp'
Building C object CMakeFiles/cmTC_8225e.dir/CheckIncludeFile.c.obj

/C/msys64/mingw64/bin/x86_64-w64-mingw32-gcc.exe    -o CMakeFiles/cmTC_8225e.dir/CheckIncludeFile.c.obj   -c /C/msys64/home/vagrant/slave/monero-static-win64/build/build/release/CMakeFiles/CMakeTmp/CheckIncludeFile.c
C:/msys64/home/vagrant/slave/monero-static-win64/build/build/release/CMakeFiles/CMakeTmp/CheckIncludeFile.c:1:10: fatal error: vfork.h: No such file or directory
 #include <vfork.h>
          ^~~~~~~~~
compilation terminated.

make[2]: *** [CMakeFiles/cmTC_8225e.dir/build.make:66: CMakeFiles/cmTC_8225e.dir/CheckIncludeFile.c.obj] Error 1
make[2]: Leaving directory '/home/vagrant/slave/monero-static-win64/build/build/release/CMakeFiles/CMakeTmp'
make[1]: *** [Makefile:121: cmTC_8225e/fast] Error 2
make[1]: Leaving directory '/home/vagrant/slave/monero-static-win64/build/build/release/CMakeFiles/CMakeTmp'


Determining if the function arc4random exists failed with the following output:
Change Dir: C:/msys64/home/vagrant/slave/monero-static-win64/build/build/release/CMakeFiles/CMakeTmp

Run Build Command:"C:/msys64/usr/bin/make.exe" "cmTC_116f7/fast"
make[1]: Entering directory '/home/vagrant/slave/monero-static-win64/build/build/release/CMakeFiles/CMakeTmp'
/usr/bin/make -f CMakeFiles/cmTC_116f7.dir/build.make CMakeFiles/cmTC_116f7.dir/build
make[2]: Entering directory '/home/vagrant/slave/monero-static-win64/build/build/release/CMakeFiles/CMakeTmp'
Building C object CMakeFiles/cmTC_116f7.dir/CheckFunctionExists.c.obj

/C/msys64/mingw64/bin/x86_64-w64-mingw32-gcc.exe   -DCHECK_FUNCTION_EXISTS=arc4random   -o CMakeFiles/cmTC_116f7.dir/CheckFunctionExists.c.obj   -c /C/msys64/mingw64/share/cmake-3.12/Modules/CheckFunctionExists.c
Linking C executable cmTC_116f7.exe

/C/msys64/mingw64/bin/cmake.exe -E remove -f CMakeFiles/cmTC_116f7.dir/objects.a
ar cr CMakeFiles/cmTC_116f7.dir/objects.a "CMakeFiles/cmTC_116f7.dir/CheckFunctionExists.c.obj" 
/C/msys64/mingw64/bin/x86_64-w64-mingw32-gcc.exe  -DCHECK_FUNCTION_EXISTS=arc4random    -Wl,--whole-archive CMakeFiles/cmTC_116f7.dir/objects.a -Wl,--no-whole-archive  -o cmTC_116f7.exe -Wl,--major-image-version,0,--minor-image-version,0 -liphlpapi -lws2_32 -lkernel32 -luser32 -lgdi32 -lwinspool -lshell32 -lole32 -loleaut32 -luuid -lcomdlg32 -ladvapi32 
CMakeFiles/cmTC_116f7.dir/objects.a(CheckFunctionExists.c.obj):CheckFunctionExists.c:(.text+0x15): undefined reference to `arc4random'

collect2.exe: error: ld returned 1 exit status
make[2]: *** [CMakeFiles/cmTC_116f7.dir/build.make:88: cmTC_116f7.exe] Error 1
make[2]: Leaving directory '/home/vagrant/slave/monero-static-win64/build/build/release/CMakeFiles/CMakeTmp'
make[1]: *** [Makefile:121: cmTC_116f7/fast] Error 2
make[1]: Leaving directory '/home/vagrant/slave/monero-static-win64/build/build/release/CMakeFiles/CMakeTmp'


Determining if the function arc4random_uniform exists failed with the following output:
Change Dir: C:/msys64/home/vagrant/slave/monero-static-win64/build/build/release/CMakeFiles/CMakeTmp

Run Build Command:"C:/msys64/usr/bin/make.exe" "cmTC_3c1b9/fast"
make[1]: Entering directory '/home/vagrant/slave/monero-static-win64/build/build/release/CMakeFiles/CMakeTmp'
/usr/bin/make -f CMakeFiles/cmTC_3c1b9.dir/build.make CMakeFiles/cmTC_3c1b9.dir/build
make[2]: Entering directory '/home/vagrant/slave/monero-static-win64/build/build/release/CMakeFiles/CMakeTmp'
Building C object CMakeFiles/cmTC_3c1b9.dir/CheckFunctionExists.c.obj

/C/msys64/mingw64/bin/x86_64-w64-mingw32-gcc.exe   -DCHECK_FUNCTION_EXISTS=arc4random_uniform   -o CMakeFiles/cmTC_3c1b9.dir/CheckFunctionExists.c.obj   -c /C/msys64/mingw64/share/cmake-3.12/Modules/CheckFunctionExists.c
Linking C executable cmTC_3c1b9.exe

/C/msys64/mingw64/bin/cmake.exe -E remove -f CMakeFiles/cmTC_3c1b9.dir/objects.a
ar cr CMakeFiles/cmTC_3c1b9.dir/objects.a "CMakeFiles/cmTC_3c1b9.dir/CheckFunctionExists.c.obj" 
/C/msys64/mingw64/bin/x86_64-w64-mingw32-gcc.exe  -DCHECK_FUNCTION_EXISTS=arc4random_uniform    -Wl,--whole-archive CMakeFiles/cmTC_3c1b9.dir/objects.a -Wl,--no-whole-archive  -o cmTC_3c1b9.exe -Wl,--major-image-version,0,--minor-image-version,0 -liphlpapi -lws2_32 -lkernel32 -luser32 -lgdi32 -lwinspool -lshell32 -lole32 -loleaut32 -luuid -lcomdlg32 -ladvapi32 
CMakeFiles/cmTC_3c1b9.dir/objects.a(CheckFunctionExists.c.obj):CheckFunctionExists.c:(.text+0x15): undefined reference to `arc4random_uniform'

collect2.exe: error: ld returned 1 exit status
make[2]: *** [CMakeFiles/cmTC_3c1b9.dir/build.make:88: cmTC_3c1b9.exe] Error 1
make[2]: Leaving directory '/home/vagrant/slave/monero-static-win64/build/build/release/CMakeFiles/CMakeTmp'
make[1]: *** [Makefile:121: cmTC_3c1b9/fast] Error 2
make[1]: Leaving directory '/home/vagrant/slave/monero-static-win64/build/build/release/CMakeFiles/CMakeTmp'


Determining if the function chown exists failed with the following output:
Change Dir: C:/msys64/home/vagrant/slave/monero-static-win64/build/build/release/CMakeFiles/CMakeTmp

Run Build Command:"C:/msys64/usr/bin/make.exe" "cmTC_1af49/fast"
make[1]: Entering directory '/home/vagrant/slave/monero-static-win64/build/build/release/CMakeFiles/CMakeTmp'
/usr/bin/make -f CMakeFiles/cmTC_1af49.dir/build.make CMakeFiles/cmTC_1af49.dir/build
make[2]: Entering directory '/home/vagrant/slave/monero-static-win64/build/build/release/CMakeFiles/CMakeTmp'
Building C object CMakeFiles/cmTC_1af49.dir/CheckFunctionExists.c.obj

/C/msys64/mingw64/bin/x86_64-w64-mingw32-gcc.exe   -DCHECK_FUNCTION_EXISTS=chown   -o CMakeFiles/cmTC_1af49.dir/CheckFunctionExists.c.obj   -c /C/msys64/mingw64/share/cmake-3.12/Modules/CheckFunctionExists.c
Linking C executable cmTC_1af49.exe

/C/msys64/mingw64/bin/cmake.exe -E remove -f CMakeFiles/cmTC_1af49.dir/objects.a
ar cr CMakeFiles/cmTC_1af49.dir/objects.a "CMakeFiles/cmTC_1af49.dir/CheckFunctionExists.c.obj" 
/C/msys64/mingw64/bin/x86_64-w64-mingw32-gcc.exe  -DCHECK_FUNCTION_EXISTS=chown    -Wl,--whole-archive CMakeFiles/cmTC_1af49.dir/objects.a -Wl,--no-whole-archive  -o cmTC_1af49.exe -Wl,--major-image-version,0,--minor-image-version,0 -liphlpapi -lws2_32 -lkernel32 -luser32 -lgdi32 -lwinspool -lshell32 -lole32 -loleaut32 -luuid -lcomdlg32 -ladvapi32 
CMakeFiles/cmTC_1af49.dir/objects.a(CheckFunctionExists.c.obj):CheckFunctionExists.c:(.text+0x15): undefined reference to `chown'

collect2.exe: error: ld returned 1 exit status
make[2]: *** [CMakeFiles/cmTC_1af49.dir/build.make:88: cmTC_1af49.exe] Error 1
make[2]: Leaving directory '/home/vagrant/slave/monero-static-win64/build/build/release/CMakeFiles/CMakeTmp'
make[1]: *** [Makefile:121: cmTC_1af49/fast] Error 2
make[1]: Leaving directory '/home/vagrant/slave/monero-static-win64/build/build/release/CMakeFiles/CMakeTmp'


Determining if the function chroot exists failed with the following output:
Change Dir: C:/msys64/home/vagrant/slave/monero-static-win64/build/build/release/CMakeFiles/CMakeTmp

Run Build Command:"C:/msys64/usr/bin/make.exe" "cmTC_2c937/fast"
make[1]: Entering directory '/home/vagrant/slave/monero-static-win64/build/build/release/CMakeFiles/CMakeTmp'
/usr/bin/make -f CMakeFiles/cmTC_2c937.dir/build.make CMakeFiles/cmTC_2c937.dir/build
make[2]: Entering directory '/home/vagrant/slave/monero-static-win64/build/build/release/CMakeFiles/CMakeTmp'
Building C object CMakeFiles/cmTC_2c937.dir/CheckFunctionExists.c.obj

/C/msys64/mingw64/bin/x86_64-w64-mingw32-gcc.exe   -DCHECK_FUNCTION_EXISTS=chroot   -o CMakeFiles/cmTC_2c937.dir/CheckFunctionExists.c.obj   -c /C/msys64/mingw64/share/cmake-3.12/Modules/CheckFunctionExists.c
Linking C executable cmTC_2c937.exe

/C/msys64/mingw64/bin/cmake.exe -E remove -f CMakeFiles/cmTC_2c937.dir/objects.a
ar cr CMakeFiles/cmTC_2c937.dir/objects.a "CMakeFiles/cmTC_2c937.dir/CheckFunctionExists.c.obj" 
/C/msys64/mingw64/bin/x86_64-w64-mingw32-gcc.exe  -DCHECK_FUNCTION_EXISTS=chroot    -Wl,--whole-archive CMakeFiles/cmTC_2c937.dir/objects.a -Wl,--no-whole-archive  -o cmTC_2c937.exe -Wl,--major-image-version,0,--minor-image-version,0 -liphlpapi -lws2_32 -lkernel32 -luser32 -lgdi32 -lwinspool -lshell32 -lole32 -loleaut32 -luuid -lcomdlg32 -ladvapi32 
CMakeFiles/cmTC_2c937.dir/objects.a(CheckFunctionExists.c.obj):CheckFunctionExists.c:(.text+0x15): undefined reference to `chroot'

collect2.exe: error: ld returned 1 exit status
make[2]: *** [CMakeFiles/cmTC_2c937.dir/build.make:88: cmTC_2c937.exe] Error 1
make[2]: Leaving directory '/home/vagrant/slave/monero-static-win64/build/build/release/CMakeFiles/CMakeTmp'
make[1]: *** [Makefile:121: cmTC_2c937/fast] Error 2
make[1]: Leaving directory '/home/vagrant/slave/monero-static-win64/build/build/release/CMakeFiles/CMakeTmp'


Determining if the function ctime_r exists failed with the following output:
Change Dir: C:/msys64/home/vagrant/slave/monero-static-win64/build/build/release/CMakeFiles/CMakeTmp

Run Build Command:"C:/msys64/usr/bin/make.exe" "cmTC_d6b63/fast"
make[1]: Entering directory '/home/vagrant/slave/monero-static-win64/build/build/release/CMakeFiles/CMakeTmp'
/usr/bin/make -f CMakeFiles/cmTC_d6b63.dir/build.make CMakeFiles/cmTC_d6b63.dir/build
make[2]: Entering directory '/home/vagrant/slave/monero-static-win64/build/build/release/CMakeFiles/CMakeTmp'
Building C object CMakeFiles/cmTC_d6b63.dir/CheckFunctionExists.c.obj

/C/msys64/mingw64/bin/x86_64-w64-mingw32-gcc.exe   -DCHECK_FUNCTION_EXISTS=ctime_r   -o CMakeFiles/cmTC_d6b63.dir/CheckFunctionExists.c.obj   -c /C/msys64/mingw64/share/cmake-3.12/Modules/CheckFunctionExists.c
Linking C executable cmTC_d6b63.exe

/C/msys64/mingw64/bin/cmake.exe -E remove -f CMakeFiles/cmTC_d6b63.dir/objects.a
ar cr CMakeFiles/cmTC_d6b63.dir/objects.a "CMakeFiles/cmTC_d6b63.dir/CheckFunctionExists.c.obj" 
/C/msys64/mingw64/bin/x86_64-w64-mingw32-gcc.exe  -DCHECK_FUNCTION_EXISTS=ctime_r    -Wl,--whole-archive CMakeFiles/cmTC_d6b63.dir/objects.a -Wl,--no-whole-archive  -o cmTC_d6b63.exe -Wl,--major-image-version,0,--minor-image-version,0 -liphlpapi -lws2_32 -lkernel32 -luser32 -lgdi32 -lwinspool -lshell32 -lole32 -loleaut32 -luuid -lcomdlg32 -ladvapi32 
CMakeFiles/cmTC_d6b63.dir/objects.a(CheckFunctionExists.c.obj):CheckFunctionExists.c:(.text+0x15): undefined reference to `ctime_r'

collect2.exe: error: ld returned 1 exit status
make[2]: *** [CMakeFiles/cmTC_d6b63.dir/build.make:88: cmTC_d6b63.exe] Error 1
make[2]: Leaving directory '/home/vagrant/slave/monero-static-win64/build/build/release/CMakeFiles/CMakeTmp'
make[1]: *** [Makefile:121: cmTC_d6b63/fast] Error 2
make[1]: Leaving directory '/home/vagrant/slave/monero-static-win64/build/build/release/CMakeFiles/CMakeTmp'


Determining if the function daemon exists failed with the following output:
Change Dir: C:/msys64/home/vagrant/slave/monero-static-win64/build/build/release/CMakeFiles/CMakeTmp

Run Build Command:"C:/msys64/usr/bin/make.exe" "cmTC_47e78/fast"
make[1]: Entering directory '/home/vagrant/slave/monero-static-win64/build/build/release/CMakeFiles/CMakeTmp'
/usr/bin/make -f CMakeFiles/cmTC_47e78.dir/build.make CMakeFiles/cmTC_47e78.dir/build
make[2]: Entering directory '/home/vagrant/slave/monero-static-win64/build/build/release/CMakeFiles/CMakeTmp'
Building C object CMakeFiles/cmTC_47e78.dir/CheckFunctionExists.c.obj

/C/msys64/mingw64/bin/x86_64-w64-mingw32-gcc.exe   -DCHECK_FUNCTION_EXISTS=daemon   -o CMakeFiles/cmTC_47e78.dir/CheckFunctionExists.c.obj   -c /C/msys64/mingw64/share/cmake-3.12/Modules/CheckFunctionExists.c
Linking C executable cmTC_47e78.exe

/C/msys64/mingw64/bin/cmake.exe -E remove -f CMakeFiles/cmTC_47e78.dir/objects.a
ar cr CMakeFiles/cmTC_47e78.dir/objects.a "CMakeFiles/cmTC_47e78.dir/CheckFunctionExists.c.obj" 
/C/msys64/mingw64/bin/x86_64-w64-mingw32-gcc.exe  -DCHECK_FUNCTION_EXISTS=daemon    -Wl,--whole-archive CMakeFiles/cmTC_47e78.dir/objects.a -Wl,--no-whole-archive  -o cmTC_47e78.exe -Wl,--major-image-version,0,--minor-image-version,0 -liphlpapi -lws2_32 -lkernel32 -luser32 -lgdi32 -lwinspool -lshell32 -lole32 -loleaut32 -luuid -lcomdlg32 -ladvapi32 
CMakeFiles/cmTC_47e78.dir/objects.a(CheckFunctionExists.c.obj):CheckFunctionExists.c:(.text+0x15): undefined reference to `daemon'

collect2.exe: error: ld returned 1 exit status
make[2]: *** [CMakeFiles/cmTC_47e78.dir/build.make:88: cmTC_47e78.exe] Error 1
make[2]: Leaving directory '/home/vagrant/slave/monero-static-win64/build/build/release/CMakeFiles/CMakeTmp'
make[1]: *** [Makefile:121: cmTC_47e78/fast] Error 2
make[1]: Leaving directory '/home/vagrant/slave/monero-static-win64/build/build/release/CMakeFiles/CMakeTmp'


Determining if the function endprotoent exists failed with the following output:
Change Dir: C:/msys64/home/vagrant/slave/monero-static-win64/build/build/release/CMakeFiles/CMakeTmp

Run Build Command:"C:/msys64/usr/bin/make.exe" "cmTC_163dc/fast"
make[1]: Entering directory '/home/vagrant/slave/monero-static-win64/build/build/release/CMakeFiles/CMakeTmp'
/usr/bin/make -f CMakeFiles/cmTC_163dc.dir/build.make CMakeFiles/cmTC_163dc.dir/build
make[2]: Entering directory '/home/vagrant/slave/monero-static-win64/build/build/release/CMakeFiles/CMakeTmp'
Building C object CMakeFiles/cmTC_163dc.dir/CheckFunctionExists.c.obj

/C/msys64/mingw64/bin/x86_64-w64-mingw32-gcc.exe   -DCHECK_FUNCTION_EXISTS=endprotoent   -o CMakeFiles/cmTC_163dc.dir/CheckFunctionExists.c.obj   -c /C/msys64/mingw64/share/cmake-3.12/Modules/CheckFunctionExists.c
Linking C executable cmTC_163dc.exe

/C/msys64/mingw64/bin/cmake.exe -E remove -f CMakeFiles/cmTC_163dc.dir/objects.a
ar cr CMakeFiles/cmTC_163dc.dir/objects.a "CMakeFiles/cmTC_163dc.dir/CheckFunctionExists.c.obj" 
/C/msys64/mingw64/bin/x86_64-w64-mingw32-gcc.exe  -DCHECK_FUNCTION_EXISTS=endprotoent    -Wl,--whole-archive CMakeFiles/cmTC_163dc.dir/objects.a -Wl,--no-whole-archive  -o cmTC_163dc.exe -Wl,--major-image-version,0,--minor-image-version,0 -liphlpapi -lws2_32 -lkernel32 -luser32 -lgdi32 -lwinspool -lshell32 -lole32 -loleaut32 -luuid -lcomdlg32 -ladvapi32 
CMakeFiles/cmTC_163dc.dir/objects.a(CheckFunctionExists.c.obj):CheckFunctionExists.c:(.text+0x15): undefined reference to `endprotoent'

collect2.exe: error: ld returned 1 exit status
make[2]: *** [CMakeFiles/cmTC_163dc.dir/build.make:88: cmTC_163dc.exe] Error 1
make[2]: Leaving directory '/home/vagrant/slave/monero-static-win64/build/build/release/CMakeFiles/CMakeTmp'
make[1]: *** [Makefile:121: cmTC_163dc/fast] Error 2
make[1]: Leaving directory '/home/vagrant/slave/monero-static-win64/build/build/release/CMakeFiles/CMakeTmp'


Determining if the function endservent exists failed with the following output:
Change Dir: C:/msys64/home/vagrant/slave/monero-static-win64/build/build/release/CMakeFiles/CMakeTmp

Run Build Command:"C:/msys64/usr/bin/make.exe" "cmTC_09e01/fast"
make[1]: Entering directory '/home/vagrant/slave/monero-static-win64/build/build/release/CMakeFiles/CMakeTmp'
/usr/bin/make -f CMakeFiles/cmTC_09e01.dir/build.make CMakeFiles/cmTC_09e01.dir/build
make[2]: Entering directory '/home/vagrant/slave/monero-static-win64/build/build/release/CMakeFiles/CMakeTmp'
Building C object CMakeFiles/cmTC_09e01.dir/CheckFunctionExists.c.obj

/C/msys64/mingw64/bin/x86_64-w64-mingw32-gcc.exe   -DCHECK_FUNCTION_EXISTS=endservent   -o CMakeFiles/cmTC_09e01.dir/CheckFunctionExists.c.obj   -c /C/msys64/mingw64/share/cmake-3.12/Modules/CheckFunctionExists.c
Linking C executable cmTC_09e01.exe

/C/msys64/mingw64/bin/cmake.exe -E remove -f CMakeFiles/cmTC_09e01.dir/objects.a
ar cr CMakeFiles/cmTC_09e01.dir/objects.a "CMakeFiles/cmTC_09e01.dir/CheckFunctionExists.c.obj" 
/C/msys64/mingw64/bin/x86_64-w64-mingw32-gcc.exe  -DCHECK_FUNCTION_EXISTS=endservent    -Wl,--whole-archive CMakeFiles/cmTC_09e01.dir/objects.a -Wl,--no-whole-archive  -o cmTC_09e01.exe -Wl,--major-image-version,0,--minor-image-version,0 -liphlpapi -lws2_32 -lkernel32 -luser32 -lgdi32 -lwinspool -lshell32 -lole32 -loleaut32 -luuid -lcomdlg32 -ladvapi32 
CMakeFiles/cmTC_09e01.dir/objects.a(CheckFunctionExists.c.obj):CheckFunctionExists.c:(.text+0x15): undefined reference to `endservent'

collect2.exe: error: ld returned 1 exit status
make[2]: *** [CMakeFiles/cmTC_09e01.dir/build.make:88: cmTC_09e01.exe] Error 1
make[2]: Leaving directory '/home/vagrant/slave/monero-static-win64/build/build/release/CMakeFiles/CMakeTmp'
make[1]: *** [Makefile:121: cmTC_09e01/fast] Error 2
make[1]: Leaving directory '/home/vagrant/slave/monero-static-win64/build/build/release/CMakeFiles/CMakeTmp'


Determining if the function fork exists failed with the following output:
Change Dir: C:/msys64/home/vagrant/slave/monero-static-win64/build/build/release/CMakeFiles/CMakeTmp

Run Build Command:"C:/msys64/usr/bin/make.exe" "cmTC_5d4dc/fast"
make[1]: Entering directory '/home/vagrant/slave/monero-static-win64/build/build/release/CMakeFiles/CMakeTmp'
/usr/bin/make -f CMakeFiles/cmTC_5d4dc.dir/build.make CMakeFiles/cmTC_5d4dc.dir/build
make[2]: Entering directory '/home/vagrant/slave/monero-static-win64/build/build/release/CMakeFiles/CMakeTmp'
Building C object CMakeFiles/cmTC_5d4dc.dir/CheckFunctionExists.c.obj

/C/msys64/mingw64/bin/x86_64-w64-mingw32-gcc.exe   -DCHECK_FUNCTION_EXISTS=fork   -o CMakeFiles/cmTC_5d4dc.dir/CheckFunctionExists.c.obj   -c /C/msys64/mingw64/share/cmake-3.12/Modules/CheckFunctionExists.c
<command-line>: warning: conflicting types for built-in function 'fork' [-Wbuiltin-declaration-mismatch]
C:/msys64/mingw64/share/cmake-3.12/Modules/CheckFunctionExists.c:7:3: note: in expansion of macro 'CHECK_FUNCTION_EXISTS'
   CHECK_FUNCTION_EXISTS(void);
   ^~~~~~~~~~~~~~~~~~~~~
Linking C executable cmTC_5d4dc.exe

/C/msys64/mingw64/bin/cmake.exe -E remove -f CMakeFiles/cmTC_5d4dc.dir/objects.a
ar cr CMakeFiles/cmTC_5d4dc.dir/objects.a "CMakeFiles/cmTC_5d4dc.dir/CheckFunctionExists.c.obj" 
/C/msys64/mingw64/bin/x86_64-w64-mingw32-gcc.exe  -DCHECK_FUNCTION_EXISTS=fork    -Wl,--whole-archive CMakeFiles/cmTC_5d4dc.dir/objects.a -Wl,--no-whole-archive  -o cmTC_5d4dc.exe -Wl,--major-image-version,0,--minor-image-version,0 -liphlpapi -lws2_32 -lkernel32 -luser32 -lgdi32 -lwinspool -lshell32 -lole32 -loleaut32 -luuid -lcomdlg32 -ladvapi32 
CMakeFiles/cmTC_5d4dc.dir/objects.a(CheckFunctionExists.c.obj):CheckFunctionExists.c:(.text+0x15): undefined reference to `fork'

collect2.exe: error: ld returned 1 exit status
make[2]: *** [CMakeFiles/cmTC_5d4dc.dir/build.make:88: cmTC_5d4dc.exe] Error 1
make[2]: Leaving directory '/home/vagrant/slave/monero-static-win64/build/build/release/CMakeFiles/CMakeTmp'
make[1]: *** [Makefile:121: cmTC_5d4dc/fast] Error 2
make[1]: Leaving directory '/home/vagrant/slave/monero-static-win64/build/build/release/CMakeFiles/CMakeTmp'


Determining if the function fsync exists failed with the following output:
Change Dir: C:/msys64/home/vagrant/slave/monero-static-win64/build/build/release/CMakeFiles/CMakeTmp

Run Build Command:"C:/msys64/usr/bin/make.exe" "cmTC_e6233/fast"
make[1]: Entering directory '/home/vagrant/slave/monero-static-win64/build/build/release/CMakeFiles/CMakeTmp'
/usr/bin/make -f CMakeFiles/cmTC_e6233.dir/build.make CMakeFiles/cmTC_e6233.dir/build
make[2]: Entering directory '/home/vagrant/slave/monero-static-win64/build/build/release/CMakeFiles/CMakeTmp'
Building C object CMakeFiles/cmTC_e6233.dir/CheckFunctionExists.c.obj

/C/msys64/mingw64/bin/x86_64-w64-mingw32-gcc.exe   -DCHECK_FUNCTION_EXISTS=fsync   -o CMakeFiles/cmTC_e6233.dir/CheckFunctionExists.c.obj   -c /C/msys64/mingw64/share/cmake-3.12/Modules/CheckFunctionExists.c
Linking C executable cmTC_e6233.exe

/C/msys64/mingw64/bin/cmake.exe -E remove -f CMakeFiles/cmTC_e6233.dir/objects.a
ar cr CMakeFiles/cmTC_e6233.dir/objects.a "CMakeFiles/cmTC_e6233.dir/CheckFunctionExists.c.obj" 
/C/msys64/mingw64/bin/x86_64-w64-mingw32-gcc.exe  -DCHECK_FUNCTION_EXISTS=fsync    -Wl,--whole-archive CMakeFiles/cmTC_e6233.dir/objects.a -Wl,--no-whole-archive  -o cmTC_e6233.exe -Wl,--major-image-version,0,--minor-image-version,0 -liphlpapi -lws2_32 -lkernel32 -luser32 -lgdi32 -lwinspool -lshell32 -lole32 -loleaut32 -luuid -lcomdlg32 -ladvapi32 
CMakeFiles/cmTC_e6233.dir/objects.a(CheckFunctionExists.c.obj):CheckFunctionExists.c:(.text+0x15): undefined reference to `fsync'

collect2.exe: error: ld returned 1 exit status
make[2]: *** [CMakeFiles/cmTC_e6233.dir/build.make:88: cmTC_e6233.exe] Error 1
make[2]: Leaving directory '/home/vagrant/slave/monero-static-win64/build/build/release/CMakeFiles/CMakeTmp'
make[1]: *** [Makefile:121: cmTC_e6233/fast] Error 2
make[1]: Leaving directory '/home/vagrant/slave/monero-static-win64/build/build/release/CMakeFiles/CMakeTmp'


Determining if the function getauxval exists failed with the following output:
Change Dir: C:/msys64/home/vagrant/slave/monero-static-win64/build/build/release/CMakeFiles/CMakeTmp

Run Build Command:"C:/msys64/usr/bin/make.exe" "cmTC_ae2e2/fast"
make[1]: Entering directory '/home/vagrant/slave/monero-static-win64/build/build/release/CMakeFiles/CMakeTmp'
/usr/bin/make -f CMakeFiles/cmTC_ae2e2.dir/build.make CMakeFiles/cmTC_ae2e2.dir/build
make[2]: Entering directory '/home/vagrant/slave/monero-static-win64/build/build/release/CMakeFiles/CMakeTmp'
Building C object CMakeFiles/cmTC_ae2e2.dir/CheckFunctionExists.c.obj

/C/msys64/mingw64/bin/x86_64-w64-mingw32-gcc.exe   -DCHECK_FUNCTION_EXISTS=getauxval   -o CMakeFiles/cmTC_ae2e2.dir/CheckFunctionExists.c.obj   -c /C/msys64/mingw64/share/cmake-3.12/Modules/CheckFunctionExists.c
Linking C executable cmTC_ae2e2.exe

/C/msys64/mingw64/bin/cmake.exe -E remove -f CMakeFiles/cmTC_ae2e2.dir/objects.a
ar cr CMakeFiles/cmTC_ae2e2.dir/objects.a "CMakeFiles/cmTC_ae2e2.dir/CheckFunctionExists.c.obj" 
/C/msys64/mingw64/bin/x86_64-w64-mingw32-gcc.exe  -DCHECK_FUNCTION_EXISTS=getauxval    -Wl,--whole-archive CMakeFiles/cmTC_ae2e2.dir/objects.a -Wl,--no-whole-archive  -o cmTC_ae2e2.exe -Wl,--major-image-version,0,--minor-image-version,0 -liphlpapi -lws2_32 -lkernel32 -luser32 -lgdi32 -lwinspool -lshell32 -lole32 -loleaut32 -luuid -lcomdlg32 -ladvapi32 
CMakeFiles/cmTC_ae2e2.dir/objects.a(CheckFunctionExists.c.obj):CheckFunctionExists.c:(.text+0x15): undefined reference to `getauxval'

collect2.exe: error: ld returned 1 exit status
make[2]: *** [CMakeFiles/cmTC_ae2e2.dir/build.make:88: cmTC_ae2e2.exe] Error 1
make[2]: Leaving directory '/home/vagrant/slave/monero-static-win64/build/build/release/CMakeFiles/CMakeTmp'
make[1]: *** [Makefile:121: cmTC_ae2e2/fast] Error 2
make[1]: Leaving directory '/home/vagrant/slave/monero-static-win64/build/build/release/CMakeFiles/CMakeTmp'


Determining if the function getentropy exists failed with the following output:
Change Dir: C:/msys64/home/vagrant/slave/monero-static-win64/build/build/release/CMakeFiles/CMakeTmp

Run Build Command:"C:/msys64/usr/bin/make.exe" "cmTC_85c3e/fast"
make[1]: Entering directory '/home/vagrant/slave/monero-static-win64/build/build/release/CMakeFiles/CMakeTmp'
/usr/bin/make -f CMakeFiles/cmTC_85c3e.dir/build.make CMakeFiles/cmTC_85c3e.dir/build
make[2]: Entering directory '/home/vagrant/slave/monero-static-win64/build/build/release/CMakeFiles/CMakeTmp'
Building C object CMakeFiles/cmTC_85c3e.dir/CheckFunctionExists.c.obj

/C/msys64/mingw64/bin/x86_64-w64-mingw32-gcc.exe   -DCHECK_FUNCTION_EXISTS=getentropy   -o CMakeFiles/cmTC_85c3e.dir/CheckFunctionExists.c.obj   -c /C/msys64/mingw64/share/cmake-3.12/Modules/CheckFunctionExists.c
Linking C executable cmTC_85c3e.exe

/C/msys64/mingw64/bin/cmake.exe -E remove -f CMakeFiles/cmTC_85c3e.dir/objects.a
ar cr CMakeFiles/cmTC_85c3e.dir/objects.a "CMakeFiles/cmTC_85c3e.dir/CheckFunctionExists.c.obj" 
/C/msys64/mingw64/bin/x86_64-w64-mingw32-gcc.exe  -DCHECK_FUNCTION_EXISTS=getentropy    -Wl,--whole-archive CMakeFiles/cmTC_85c3e.dir/objects.a -Wl,--no-whole-archive  -o cmTC_85c3e.exe -Wl,--major-image-version,0,--minor-image-version,0 -liphlpapi -lws2_32 -lkernel32 -luser32 -lgdi32 -lwinspool -lshell32 -lole32 -loleaut32 -luuid -lcomdlg32 -ladvapi32 
CMakeFiles/cmTC_85c3e.dir/objects.a(CheckFunctionExists.c.obj):CheckFunctionExists.c:(.text+0x15): undefined reference to `getentropy'

collect2.exe: error: ld returned 1 exit status
make[2]: *** [CMakeFiles/cmTC_85c3e.dir/build.make:88: cmTC_85c3e.exe] Error 1
make[2]: Leaving directory '/home/vagrant/slave/monero-static-win64/build/build/release/CMakeFiles/CMakeTmp'
make[1]: *** [Makefile:121: cmTC_85c3e/fast] Error 2
make[1]: Leaving directory '/home/vagrant/slave/monero-static-win64/build/build/release/CMakeFiles/CMakeTmp'


Determining if the function getpwnam exists failed with the following output:
Change Dir: C:/msys64/home/vagrant/slave/monero-static-win64/build/build/release/CMakeFiles/CMakeTmp

Run Build Command:"C:/msys64/usr/bin/make.exe" "cmTC_38e13/fast"
make[1]: Entering directory '/home/vagrant/slave/monero-static-win64/build/build/release/CMakeFiles/CMakeTmp'
/usr/bin/make -f CMakeFiles/cmTC_38e13.dir/build.make CMakeFiles/cmTC_38e13.dir/build
make[2]: Entering directory '/home/vagrant/slave/monero-static-win64/build/build/release/CMakeFiles/CMakeTmp'
Building C object CMakeFiles/cmTC_38e13.dir/CheckFunctionExists.c.obj

/C/msys64/mingw64/bin/x86_64-w64-mingw32-gcc.exe   -DCHECK_FUNCTION_EXISTS=getpwnam   -o CMakeFiles/cmTC_38e13.dir/CheckFunctionExists.c.obj   -c /C/msys64/mingw64/share/cmake-3.12/Modules/CheckFunctionExists.c
Linking C executable cmTC_38e13.exe

/C/msys64/mingw64/bin/cmake.exe -E remove -f CMakeFiles/cmTC_38e13.dir/objects.a
ar cr CMakeFiles/cmTC_38e13.dir/objects.a "CMakeFiles/cmTC_38e13.dir/CheckFunctionExists.c.obj" 
/C/msys64/mingw64/bin/x86_64-w64-mingw32-gcc.exe  -DCHECK_FUNCTION_EXISTS=getpwnam    -Wl,--whole-archive CMakeFiles/cmTC_38e13.dir/objects.a -Wl,--no-whole-archive  -o cmTC_38e13.exe -Wl,--major-image-version,0,--minor-image-version,0 -liphlpapi -lws2_32 -lkernel32 -luser32 -lgdi32 -lwinspool -lshell32 -lole32 -loleaut32 -luuid -lcomdlg32 -ladvapi32 
CMakeFiles/cmTC_38e13.dir/objects.a(CheckFunctionExists.c.obj):CheckFunctionExists.c:(.text+0x15): undefined reference to `getpwnam'

collect2.exe: error: ld returned 1 exit status
make[2]: *** [CMakeFiles/cmTC_38e13.dir/build.make:88: cmTC_38e13.exe] Error 1
make[2]: Leaving directory '/home/vagrant/slave/monero-static-win64/build/build/release/CMakeFiles/CMakeTmp'
make[1]: *** [Makefile:121: cmTC_38e13/fast] Error 2
make[1]: Leaving directory '/home/vagrant/slave/monero-static-win64/build/build/release/CMakeFiles/CMakeTmp'


Determining if the function getrlimit exists failed with the following output:
Change Dir: C:/msys64/home/vagrant/slave/monero-static-win64/build/build/release/CMakeFiles/CMakeTmp

Run Build Command:"C:/msys64/usr/bin/make.exe" "cmTC_3ae14/fast"
make[1]: Entering directory '/home/vagrant/slave/monero-static-win64/build/build/release/CMakeFiles/CMakeTmp'
/usr/bin/make -f CMakeFiles/cmTC_3ae14.dir/build.make CMakeFiles/cmTC_3ae14.dir/build
make[2]: Entering directory '/home/vagrant/slave/monero-static-win64/build/build/release/CMakeFiles/CMakeTmp'
Building C object CMakeFiles/cmTC_3ae14.dir/CheckFunctionExists.c.obj

/C/msys64/mingw64/bin/x86_64-w64-mingw32-gcc.exe   -DCHECK_FUNCTION_EXISTS=getrlimit   -o CMakeFiles/cmTC_3ae14.dir/CheckFunctionExists.c.obj   -c /C/msys64/mingw64/share/cmake-3.12/Modules/CheckFunctionExists.c
Linking C executable cmTC_3ae14.exe

/C/msys64/mingw64/bin/cmake.exe -E remove -f CMakeFiles/cmTC_3ae14.dir/objects.a
ar cr CMakeFiles/cmTC_3ae14.dir/objects.a "CMakeFiles/cmTC_3ae14.dir/CheckFunctionExists.c.obj" 
/C/msys64/mingw64/bin/x86_64-w64-mingw32-gcc.exe  -DCHECK_FUNCTION_EXISTS=getrlimit    -Wl,--whole-archive CMakeFiles/cmTC_3ae14.dir/objects.a -Wl,--no-whole-archive  -o cmTC_3ae14.exe -Wl,--major-image-version,0,--minor-image-version,0 -liphlpapi -lws2_32 -lkernel32 -luser32 -lgdi32 -lwinspool -lshell32 -lole32 -loleaut32 -luuid -lcomdlg32 -ladvapi32 
CMakeFiles/cmTC_3ae14.dir/objects.a(CheckFunctionExists.c.obj):CheckFunctionExists.c:(.text+0x15): undefined reference to `getrlimit'

collect2.exe: error: ld returned 1 exit status
make[2]: *** [CMakeFiles/cmTC_3ae14.dir/build.make:88: cmTC_3ae14.exe] Error 1
make[2]: Leaving directory '/home/vagrant/slave/monero-static-win64/build/build/release/CMakeFiles/CMakeTmp'
make[1]: *** [Makefile:121: cmTC_3ae14/fast] Error 2
make[1]: Leaving directory '/home/vagrant/slave/monero-static-win64/build/build/release/CMakeFiles/CMakeTmp'


Determining if the function glob exists failed with the following output:
Change Dir: C:/msys64/home/vagrant/slave/monero-static-win64/build/build/release/CMakeFiles/CMakeTmp

Run Build Command:"C:/msys64/usr/bin/make.exe" "cmTC_29011/fast"
make[1]: Entering directory '/home/vagrant/slave/monero-static-win64/build/build/release/CMakeFiles/CMakeTmp'
/usr/bin/make -f CMakeFiles/cmTC_29011.dir/build.make CMakeFiles/cmTC_29011.dir/build
make[2]: Entering directory '/home/vagrant/slave/monero-static-win64/build/build/release/CMakeFiles/CMakeTmp'
Building C object CMakeFiles/cmTC_29011.dir/CheckFunctionExists.c.obj

/C/msys64/mingw64/bin/x86_64-w64-mingw32-gcc.exe   -DCHECK_FUNCTION_EXISTS=glob   -o CMakeFiles/cmTC_29011.dir/CheckFunctionExists.c.obj   -c /C/msys64/mingw64/share/cmake-3.12/Modules/CheckFunctionExists.c
Linking C executable cmTC_29011.exe

/C/msys64/mingw64/bin/cmake.exe -E remove -f CMakeFiles/cmTC_29011.dir/objects.a
ar cr CMakeFiles/cmTC_29011.dir/objects.a "CMakeFiles/cmTC_29011.dir/CheckFunctionExists.c.obj" 
/C/msys64/mingw64/bin/x86_64-w64-mingw32-gcc.exe  -DCHECK_FUNCTION_EXISTS=glob    -Wl,--whole-archive CMakeFiles/cmTC_29011.dir/objects.a -Wl,--no-whole-archive  -o cmTC_29011.exe -Wl,--major-image-version,0,--minor-image-version,0 -liphlpapi -lws2_32 -lkernel32 -luser32 -lgdi32 -lwinspool -lshell32 -lole32 -loleaut32 -luuid -lcomdlg32 -ladvapi32 
CMakeFiles/cmTC_29011.dir/objects.a(CheckFunctionExists.c.obj):CheckFunctionExists.c:(.text+0x15): undefined reference to `glob'

collect2.exe: error: ld returned 1 exit status
make[2]: *** [CMakeFiles/cmTC_29011.dir/build.make:88: cmTC_29011.exe] Error 1
make[2]: Leaving directory '/home/vagrant/slave/monero-static-win64/build/build/release/CMakeFiles/CMakeTmp'
make[1]: *** [Makefile:121: cmTC_29011/fast] Error 2
make[1]: Leaving directory '/home/vagrant/slave/monero-static-win64/build/build/release/CMakeFiles/CMakeTmp'


Determining if the function gmtime_r exists failed with the following output:
Change Dir: C:/msys64/home/vagrant/slave/monero-static-win64/build/build/release/CMakeFiles/CMakeTmp

Run Build Command:"C:/msys64/usr/bin/make.exe" "cmTC_560b9/fast"
make[1]: Entering directory '/home/vagrant/slave/monero-static-win64/build/build/release/CMakeFiles/CMakeTmp'
/usr/bin/make -f CMakeFiles/cmTC_560b9.dir/build.make CMakeFiles/cmTC_560b9.dir/build
make[2]: Entering directory '/home/vagrant/slave/monero-static-win64/build/build/release/CMakeFiles/CMakeTmp'
Building C object CMakeFiles/cmTC_560b9.dir/CheckFunctionExists.c.obj

/C/msys64/mingw64/bin/x86_64-w64-mingw32-gcc.exe   -DCHECK_FUNCTION_EXISTS=gmtime_r   -o CMakeFiles/cmTC_560b9.dir/CheckFunctionExists.c.obj   -c /C/msys64/mingw64/share/cmake-3.12/Modules/CheckFunctionExists.c
Linking C executable cmTC_560b9.exe

/C/msys64/mingw64/bin/cmake.exe -E remove -f CMakeFiles/cmTC_560b9.dir/objects.a
ar cr CMakeFiles/cmTC_560b9.dir/objects.a "CMakeFiles/cmTC_560b9.dir/CheckFunctionExists.c.obj" 
/C/msys64/mingw64/bin/x86_64-w64-mingw32-gcc.exe  -DCHECK_FUNCTION_EXISTS=gmtime_r    -Wl,--whole-archive CMakeFiles/cmTC_560b9.dir/objects.a -Wl,--no-whole-archive  -o cmTC_560b9.exe -Wl,--major-image-version,0,--minor-image-version,0 -liphlpapi -lws2_32 -lkernel32 -luser32 -lgdi32 -lwinspool -lshell32 -lole32 -loleaut32 -luuid -lcomdlg32 -ladvapi32 
CMakeFiles/cmTC_560b9.dir/objects.a(CheckFunctionExists.c.obj):CheckFunctionExists.c:(.text+0x15): undefined reference to `gmtime_r'

collect2.exe: error: ld returned 1 exit status
make[2]: *** [CMakeFiles/cmTC_560b9.dir/build.make:88: cmTC_560b9.exe] Error 1
make[2]: Leaving directory '/home/vagrant/slave/monero-static-win64/build/build/release/CMakeFiles/CMakeTmp'
make[1]: *** [Makefile:121: cmTC_560b9/fast] Error 2
make[1]: Leaving directory '/home/vagrant/slave/monero-static-win64/build/build/release/CMakeFiles/CMakeTmp'


Determining if the function fcntl exists failed with the following output:
Change Dir: C:/msys64/home/vagrant/slave/monero-static-win64/build/build/release/CMakeFiles/CMakeTmp

Run Build Command:"C:/msys64/usr/bin/make.exe" "cmTC_33409/fast"
make[1]: Entering directory '/home/vagrant/slave/monero-static-win64/build/build/release/CMakeFiles/CMakeTmp'
/usr/bin/make -f CMakeFiles/cmTC_33409.dir/build.make CMakeFiles/cmTC_33409.dir/build
make[2]: Entering directory '/home/vagrant/slave/monero-static-win64/build/build/release/CMakeFiles/CMakeTmp'
Building C object CMakeFiles/cmTC_33409.dir/CheckFunctionExists.c.obj

/C/msys64/mingw64/bin/x86_64-w64-mingw32-gcc.exe   -DCHECK_FUNCTION_EXISTS=fcntl   -o CMakeFiles/cmTC_33409.dir/CheckFunctionExists.c.obj   -c /C/msys64/mingw64/share/cmake-3.12/Modules/CheckFunctionExists.c
Linking C executable cmTC_33409.exe

/C/msys64/mingw64/bin/cmake.exe -E remove -f CMakeFiles/cmTC_33409.dir/objects.a
ar cr CMakeFiles/cmTC_33409.dir/objects.a "CMakeFiles/cmTC_33409.dir/CheckFunctionExists.c.obj" 
/C/msys64/mingw64/bin/x86_64-w64-mingw32-gcc.exe  -DCHECK_FUNCTION_EXISTS=fcntl    -Wl,--whole-archive CMakeFiles/cmTC_33409.dir/objects.a -Wl,--no-whole-archive  -o cmTC_33409.exe -Wl,--major-image-version,0,--minor-image-version,0 -liphlpapi -lws2_32 -lkernel32 -luser32 -lgdi32 -lwinspool -lshell32 -lole32 -loleaut32 -luuid -lcomdlg32 -ladvapi32 
CMakeFiles/cmTC_33409.dir/objects.a(CheckFunctionExists.c.obj):CheckFunctionExists.c:(.text+0x15): undefined reference to `fcntl'

collect2.exe: error: ld returned 1 exit status
make[2]: *** [CMakeFiles/cmTC_33409.dir/build.make:88: cmTC_33409.exe] Error 1
make[2]: Leaving directory '/home/vagrant/slave/monero-static-win64/build/build/release/CMakeFiles/CMakeTmp'
make[1]: *** [Makefile:121: cmTC_33409/fast] Error 2
make[1]: Leaving directory '/home/vagrant/slave/monero-static-win64/build/build/release/CMakeFiles/CMakeTmp'


Determining if the function inet_aton exists failed with the following output:
Change Dir: C:/msys64/home/vagrant/slave/monero-static-win64/build/build/release/CMakeFiles/CMakeTmp

Run Build Command:"C:/msys64/usr/bin/make.exe" "cmTC_b0256/fast"
make[1]: Entering directory '/home/vagrant/slave/monero-static-win64/build/build/release/CMakeFiles/CMakeTmp'
/usr/bin/make -f CMakeFiles/cmTC_b0256.dir/build.make CMakeFiles/cmTC_b0256.dir/build
make[2]: Entering directory '/home/vagrant/slave/monero-static-win64/build/build/release/CMakeFiles/CMakeTmp'
Building C object CMakeFiles/cmTC_b0256.dir/CheckFunctionExists.c.obj

/C/msys64/mingw64/bin/x86_64-w64-mingw32-gcc.exe   -DCHECK_FUNCTION_EXISTS=inet_aton   -o CMakeFiles/cmTC_b0256.dir/CheckFunctionExists.c.obj   -c /C/msys64/mingw64/share/cmake-3.12/Modules/CheckFunctionExists.c
Linking C executable cmTC_b0256.exe

/C/msys64/mingw64/bin/cmake.exe -E remove -f CMakeFiles/cmTC_b0256.dir/objects.a
ar cr CMakeFiles/cmTC_b0256.dir/objects.a "CMakeFiles/cmTC_b0256.dir/CheckFunctionExists.c.obj" 
/C/msys64/mingw64/bin/x86_64-w64-mingw32-gcc.exe  -DCHECK_FUNCTION_EXISTS=inet_aton    -Wl,--whole-archive CMakeFiles/cmTC_b0256.dir/objects.a -Wl,--no-whole-archive  -o cmTC_b0256.exe -Wl,--major-image-version,0,--minor-image-version,0 -liphlpapi -lws2_32 -lkernel32 -luser32 -lgdi32 -lwinspool -lshell32 -lole32 -loleaut32 -luuid -lcomdlg32 -ladvapi32 
CMakeFiles/cmTC_b0256.dir/objects.a(CheckFunctionExists.c.obj):CheckFunctionExists.c:(.text+0x15): undefined reference to `inet_aton'

collect2.exe: error: ld returned 1 exit status
make[2]: *** [CMakeFiles/cmTC_b0256.dir/build.make:88: cmTC_b0256.exe] Error 1
make[2]: Leaving directory '/home/vagrant/slave/monero-static-win64/build/build/release/CMakeFiles/CMakeTmp'
make[1]: *** [Makefile:121: cmTC_b0256/fast] Error 2
make[1]: Leaving directory '/home/vagrant/slave/monero-static-win64/build/build/release/CMakeFiles/CMakeTmp'


Determining if the function initgroups exists failed with the following output:
Change Dir: C:/msys64/home/vagrant/slave/monero-static-win64/build/build/release/CMakeFiles/CMakeTmp

Run Build Command:"C:/msys64/usr/bin/make.exe" "cmTC_e270d/fast"
make[1]: Entering directory '/home/vagrant/slave/monero-static-win64/build/build/release/CMakeFiles/CMakeTmp'
/usr/bin/make -f CMakeFiles/cmTC_e270d.dir/build.make CMakeFiles/cmTC_e270d.dir/build
make[2]: Entering directory '/home/vagrant/slave/monero-static-win64/build/build/release/CMakeFiles/CMakeTmp'
Building C object CMakeFiles/cmTC_e270d.dir/CheckFunctionExists.c.obj

/C/msys64/mingw64/bin/x86_64-w64-mingw32-gcc.exe   -DCHECK_FUNCTION_EXISTS=initgroups   -o CMakeFiles/cmTC_e270d.dir/CheckFunctionExists.c.obj   -c /C/msys64/mingw64/share/cmake-3.12/Modules/CheckFunctionExists.c
Linking C executable cmTC_e270d.exe

/C/msys64/mingw64/bin/cmake.exe -E remove -f CMakeFiles/cmTC_e270d.dir/objects.a
ar cr CMakeFiles/cmTC_e270d.dir/objects.a "CMakeFiles/cmTC_e270d.dir/CheckFunctionExists.c.obj" 
/C/msys64/mingw64/bin/x86_64-w64-mingw32-gcc.exe  -DCHECK_FUNCTION_EXISTS=initgroups    -Wl,--whole-archive CMakeFiles/cmTC_e270d.dir/objects.a -Wl,--no-whole-archive  -o cmTC_e270d.exe -Wl,--major-image-version,0,--minor-image-version,0 -liphlpapi -lws2_32 -lkernel32 -luser32 -lgdi32 -lwinspool -lshell32 -lole32 -loleaut32 -luuid -lcomdlg32 -ladvapi32 
CMakeFiles/cmTC_e270d.dir/objects.a(CheckFunctionExists.c.obj):CheckFunctionExists.c:(.text+0x15): undefined reference to `initgroups'

collect2.exe: error: ld returned 1 exit status
make[2]: *** [CMakeFiles/cmTC_e270d.dir/build.make:88: cmTC_e270d.exe] Error 1
make[2]: Leaving directory '/home/vagrant/slave/monero-static-win64/build/build/release/CMakeFiles/CMakeTmp'
make[1]: *** [Makefile:121: cmTC_e270d/fast] Error 2
make[1]: Leaving directory '/home/vagrant/slave/monero-static-win64/build/build/release/CMakeFiles/CMakeTmp'


Determining if the function kill exists failed with the following output:
Change Dir: C:/msys64/home/vagrant/slave/monero-static-win64/build/build/release/CMakeFiles/CMakeTmp

Run Build Command:"C:/msys64/usr/bin/make.exe" "cmTC_f8033/fast"
make[1]: Entering directory '/home/vagrant/slave/monero-static-win64/build/build/release/CMakeFiles/CMakeTmp'
/usr/bin/make -f CMakeFiles/cmTC_f8033.dir/build.make CMakeFiles/cmTC_f8033.dir/build
make[2]: Entering directory '/home/vagrant/slave/monero-static-win64/build/build/release/CMakeFiles/CMakeTmp'
Building C object CMakeFiles/cmTC_f8033.dir/CheckFunctionExists.c.obj

/C/msys64/mingw64/bin/x86_64-w64-mingw32-gcc.exe   -DCHECK_FUNCTION_EXISTS=kill   -o CMakeFiles/cmTC_f8033.dir/CheckFunctionExists.c.obj   -c /C/msys64/mingw64/share/cmake-3.12/Modules/CheckFunctionExists.c
Linking C executable cmTC_f8033.exe

/C/msys64/mingw64/bin/cmake.exe -E remove -f CMakeFiles/cmTC_f8033.dir/objects.a
ar cr CMakeFiles/cmTC_f8033.dir/objects.a "CMakeFiles/cmTC_f8033.dir/CheckFunctionExists.c.obj" 
/C/msys64/mingw64/bin/x86_64-w64-mingw32-gcc.exe  -DCHECK_FUNCTION_EXISTS=kill    -Wl,--whole-archive CMakeFiles/cmTC_f8033.dir/objects.a -Wl,--no-whole-archive  -o cmTC_f8033.exe -Wl,--major-image-version,0,--minor-image-version,0 -liphlpapi -lws2_32 -lkernel32 -luser32 -lgdi32 -lwinspool -lshell32 -lole32 -loleaut32 -luuid -lcomdlg32 -ladvapi32 
CMakeFiles/cmTC_f8033.dir/objects.a(CheckFunctionExists.c.obj):CheckFunctionExists.c:(.text+0x15): undefined reference to `kill'

collect2.exe: error: ld returned 1 exit status
make[2]: *** [CMakeFiles/cmTC_f8033.dir/build.make:88: cmTC_f8033.exe] Error 1
make[2]: Leaving directory '/home/vagrant/slave/monero-static-win64/build/build/release/CMakeFiles/CMakeTmp'
make[1]: *** [Makefile:121: cmTC_f8033/fast] Error 2
make[1]: Leaving directory '/home/vagrant/slave/monero-static-win64/build/build/release/CMakeFiles/CMakeTmp'


Determining if the function localtime_r exists failed with the following output:
Change Dir: C:/msys64/home/vagrant/slave/monero-static-win64/build/build/release/CMakeFiles/CMakeTmp

Run Build Command:"C:/msys64/usr/bin/make.exe" "cmTC_54da7/fast"
make[1]: Entering directory '/home/vagrant/slave/monero-static-win64/build/build/release/CMakeFiles/CMakeTmp'
/usr/bin/make -f CMakeFiles/cmTC_54da7.dir/build.make CMakeFiles/cmTC_54da7.dir/build
make[2]: Entering directory '/home/vagrant/slave/monero-static-win64/build/build/release/CMakeFiles/CMakeTmp'
Building C object CMakeFiles/cmTC_54da7.dir/CheckFunctionExists.c.obj

/C/msys64/mingw64/bin/x86_64-w64-mingw32-gcc.exe   -DCHECK_FUNCTION_EXISTS=localtime_r   -o CMakeFiles/cmTC_54da7.dir/CheckFunctionExists.c.obj   -c /C/msys64/mingw64/share/cmake-3.12/Modules/CheckFunctionExists.c
Linking C executable cmTC_54da7.exe

/C/msys64/mingw64/bin/cmake.exe -E remove -f CMakeFiles/cmTC_54da7.dir/objects.a
ar cr CMakeFiles/cmTC_54da7.dir/objects.a "CMakeFiles/cmTC_54da7.dir/CheckFunctionExists.c.obj" 
/C/msys64/mingw64/bin/x86_64-w64-mingw32-gcc.exe  -DCHECK_FUNCTION_EXISTS=localtime_r    -Wl,--whole-archive CMakeFiles/cmTC_54da7.dir/objects.a -Wl,--no-whole-archive  -o cmTC_54da7.exe -Wl,--major-image-version,0,--minor-image-version,0 -liphlpapi -lws2_32 -lkernel32 -luser32 -lgdi32 -lwinspool -lshell32 -lole32 -loleaut32 -luuid -lcomdlg32 -ladvapi32 
CMakeFiles/cmTC_54da7.dir/objects.a(CheckFunctionExists.c.obj):CheckFunctionExists.c:(.text+0x15): undefined reference to `localtime_r'

collect2.exe: error: ld returned 1 exit status
make[2]: *** [CMakeFiles/cmTC_54da7.dir/build.make:88: cmTC_54da7.exe] Error 1
make[2]: Leaving directory '/home/vagrant/slave/monero-static-win64/build/build/release/CMakeFiles/CMakeTmp'
make[1]: *** [Makefile:121: cmTC_54da7/fast] Error 2
make[1]: Leaving directory '/home/vagrant/slave/monero-static-win64/build/build/release/CMakeFiles/CMakeTmp'


Determining if the function random exists failed with the following output:
Change Dir: C:/msys64/home/vagrant/slave/monero-static-win64/build/build/release/CMakeFiles/CMakeTmp

Run Build Command:"C:/msys64/usr/bin/make.exe" "cmTC_b067e/fast"
make[1]: Entering directory '/home/vagrant/slave/monero-static-win64/build/build/release/CMakeFiles/CMakeTmp'
/usr/bin/make -f CMakeFiles/cmTC_b067e.dir/build.make CMakeFiles/cmTC_b067e.dir/build
make[2]: Entering directory '/home/vagrant/slave/monero-static-win64/build/build/release/CMakeFiles/CMakeTmp'
Building C object CMakeFiles/cmTC_b067e.dir/CheckFunctionExists.c.obj

/C/msys64/mingw64/bin/x86_64-w64-mingw32-gcc.exe   -DCHECK_FUNCTION_EXISTS=random   -o CMakeFiles/cmTC_b067e.dir/CheckFunctionExists.c.obj   -c /C/msys64/mingw64/share/cmake-3.12/Modules/CheckFunctionExists.c
Linking C executable cmTC_b067e.exe

/C/msys64/mingw64/bin/cmake.exe -E remove -f CMakeFiles/cmTC_b067e.dir/objects.a
ar cr CMakeFiles/cmTC_b067e.dir/objects.a "CMakeFiles/cmTC_b067e.dir/CheckFunctionExists.c.obj" 
/C/msys64/mingw64/bin/x86_64-w64-mingw32-gcc.exe  -DCHECK_FUNCTION_EXISTS=random    -Wl,--whole-archive CMakeFiles/cmTC_b067e.dir/objects.a -Wl,--no-whole-archive  -o cmTC_b067e.exe -Wl,--major-image-version,0,--minor-image-version,0 -liphlpapi -lws2_32 -lkernel32 -luser32 -lgdi32 -lwinspool -lshell32 -lole32 -loleaut32 -luuid -lcomdlg32 -ladvapi32 
CMakeFiles/cmTC_b067e.dir/objects.a(CheckFunctionExists.c.obj):CheckFunctionExists.c:(.text+0x15): undefined reference to `random'

collect2.exe: error: ld returned 1 exit status
make[2]: *** [CMakeFiles/cmTC_b067e.dir/build.make:88: cmTC_b067e.exe] Error 1
make[2]: Leaving directory '/home/vagrant/slave/monero-static-win64/build/build/release/CMakeFiles/CMakeTmp'
make[1]: *** [Makefile:121: cmTC_b067e/fast] Error 2
make[1]: Leaving directory '/home/vagrant/slave/monero-static-win64/build/build/release/CMakeFiles/CMakeTmp'


Determining if the function reallocarray exists failed with the following output:
Change Dir: C:/msys64/home/vagrant/slave/monero-static-win64/build/build/release/CMakeFiles/CMakeTmp

Run Build Command:"C:/msys64/usr/bin/make.exe" "cmTC_ba63e/fast"
make[1]: Entering directory '/home/vagrant/slave/monero-static-win64/build/build/release/CMakeFiles/CMakeTmp'
/usr/bin/make -f CMakeFiles/cmTC_ba63e.dir/build.make CMakeFiles/cmTC_ba63e.dir/build
make[2]: Entering directory '/home/vagrant/slave/monero-static-win64/build/build/release/CMakeFiles/CMakeTmp'
Building C object CMakeFiles/cmTC_ba63e.dir/CheckFunctionExists.c.obj

/C/msys64/mingw64/bin/x86_64-w64-mingw32-gcc.exe   -DCHECK_FUNCTION_EXISTS=reallocarray   -o CMakeFiles/cmTC_ba63e.dir/CheckFunctionExists.c.obj   -c /C/msys64/mingw64/share/cmake-3.12/Modules/CheckFunctionExists.c
Linking C executable cmTC_ba63e.exe

/C/msys64/mingw64/bin/cmake.exe -E remove -f CMakeFiles/cmTC_ba63e.dir/objects.a
ar cr CMakeFiles/cmTC_ba63e.dir/objects.a "CMakeFiles/cmTC_ba63e.dir/CheckFunctionExists.c.obj" 
/C/msys64/mingw64/bin/x86_64-w64-mingw32-gcc.exe  -DCHECK_FUNCTION_EXISTS=reallocarray    -Wl,--whole-archive CMakeFiles/cmTC_ba63e.dir/objects.a -Wl,--no-whole-archive  -o cmTC_ba63e.exe -Wl,--major-image-version,0,--minor-image-version,0 -liphlpapi -lws2_32 -lkernel32 -luser32 -lgdi32 -lwinspool -lshell32 -lole32 -loleaut32 -luuid -lcomdlg32 -ladvapi32 
CMakeFiles/cmTC_ba63e.dir/objects.a(CheckFunctionExists.c.obj):CheckFunctionExists.c:(.text+0x15): undefined reference to `reallocarray'

collect2.exe: error: ld returned 1 exit status
make[2]: *** [CMakeFiles/cmTC_ba63e.dir/build.make:88: cmTC_ba63e.exe] Error 1
make[2]: Leaving directory '/home/vagrant/slave/monero-static-win64/build/build/release/CMakeFiles/CMakeTmp'
make[1]: *** [Makefile:121: cmTC_ba63e/fast] Error 2
make[1]: Leaving directory '/home/vagrant/slave/monero-static-win64/build/build/release/CMakeFiles/CMakeTmp'


Determining if the function recvmsg exists failed with the following output:
Change Dir: C:/msys64/home/vagrant/slave/monero-static-win64/build/build/release/CMakeFiles/CMakeTmp

Run Build Command:"C:/msys64/usr/bin/make.exe" "cmTC_d2073/fast"
make[1]: Entering directory '/home/vagrant/slave/monero-static-win64/build/build/release/CMakeFiles/CMakeTmp'
/usr/bin/make -f CMakeFiles/cmTC_d2073.dir/build.make CMakeFiles/cmTC_d2073.dir/build
make[2]: Entering directory '/home/vagrant/slave/monero-static-win64/build/build/release/CMakeFiles/CMakeTmp'
Building C object CMakeFiles/cmTC_d2073.dir/CheckFunctionExists.c.obj

/C/msys64/mingw64/bin/x86_64-w64-mingw32-gcc.exe   -DCHECK_FUNCTION_EXISTS=recvmsg   -o CMakeFiles/cmTC_d2073.dir/CheckFunctionExists.c.obj   -c /C/msys64/mingw64/share/cmake-3.12/Modules/CheckFunctionExists.c
Linking C executable cmTC_d2073.exe

/C/msys64/mingw64/bin/cmake.exe -E remove -f CMakeFiles/cmTC_d2073.dir/objects.a
ar cr CMakeFiles/cmTC_d2073.dir/objects.a "CMakeFiles/cmTC_d2073.dir/CheckFunctionExists.c.obj" 
/C/msys64/mingw64/bin/x86_64-w64-mingw32-gcc.exe  -DCHECK_FUNCTION_EXISTS=recvmsg    -Wl,--whole-archive CMakeFiles/cmTC_d2073.dir/objects.a -Wl,--no-whole-archive  -o cmTC_d2073.exe -Wl,--major-image-version,0,--minor-image-version,0 -liphlpapi -lws2_32 -lkernel32 -luser32 -lgdi32 -lwinspool -lshell32 -lole32 -loleaut32 -luuid -lcomdlg32 -ladvapi32 
CMakeFiles/cmTC_d2073.dir/objects.a(CheckFunctionExists.c.obj):CheckFunctionExists.c:(.text+0x15): undefined reference to `recvmsg'

collect2.exe: error: ld returned 1 exit status
make[2]: *** [CMakeFiles/cmTC_d2073.dir/build.make:88: cmTC_d2073.exe] Error 1
make[2]: Leaving directory '/home/vagrant/slave/monero-static-win64/build/build/release/CMakeFiles/CMakeTmp'
make[1]: *** [Makefile:121: cmTC_d2073/fast] Error 2
make[1]: Leaving directory '/home/vagrant/slave/monero-static-win64/build/build/release/CMakeFiles/CMakeTmp'


Determining if the function sbrk exists failed with the following output:
Change Dir: C:/msys64/home/vagrant/slave/monero-static-win64/build/build/release/CMakeFiles/CMakeTmp

Run Build Command:"C:/msys64/usr/bin/make.exe" "cmTC_cb6f5/fast"
make[1]: Entering directory '/home/vagrant/slave/monero-static-win64/build/build/release/CMakeFiles/CMakeTmp'
/usr/bin/make -f CMakeFiles/cmTC_cb6f5.dir/build.make CMakeFiles/cmTC_cb6f5.dir/build
make[2]: Entering directory '/home/vagrant/slave/monero-static-win64/build/build/release/CMakeFiles/CMakeTmp'
Building C object CMakeFiles/cmTC_cb6f5.dir/CheckFunctionExists.c.obj

/C/msys64/mingw64/bin/x86_64-w64-mingw32-gcc.exe   -DCHECK_FUNCTION_EXISTS=sbrk   -o CMakeFiles/cmTC_cb6f5.dir/CheckFunctionExists.c.obj   -c /C/msys64/mingw64/share/cmake-3.12/Modules/CheckFunctionExists.c
Linking C executable cmTC_cb6f5.exe

/C/msys64/mingw64/bin/cmake.exe -E remove -f CMakeFiles/cmTC_cb6f5.dir/objects.a
ar cr CMakeFiles/cmTC_cb6f5.dir/objects.a "CMakeFiles/cmTC_cb6f5.dir/CheckFunctionExists.c.obj" 
/C/msys64/mingw64/bin/x86_64-w64-mingw32-gcc.exe  -DCHECK_FUNCTION_EXISTS=sbrk    -Wl,--whole-archive CMakeFiles/cmTC_cb6f5.dir/objects.a -Wl,--no-whole-archive  -o cmTC_cb6f5.exe -Wl,--major-image-version,0,--minor-image-version,0 -liphlpapi -lws2_32 -lkernel32 -luser32 -lgdi32 -lwinspool -lshell32 -lole32 -loleaut32 -luuid -lcomdlg32 -ladvapi32 
CMakeFiles/cmTC_cb6f5.dir/objects.a(CheckFunctionExists.c.obj):CheckFunctionExists.c:(.text+0x15): undefined reference to `sbrk'

collect2.exe: error: ld returned 1 exit status
make[2]: *** [CMakeFiles/cmTC_cb6f5.dir/build.make:88: cmTC_cb6f5.exe] Error 1
make[2]: Leaving directory '/home/vagrant/slave/monero-static-win64/build/build/release/CMakeFiles/CMakeTmp'
make[1]: *** [Makefile:121: cmTC_cb6f5/fast] Error 2
make[1]: Leaving directory '/home/vagrant/slave/monero-static-win64/build/build/release/CMakeFiles/CMakeTmp'


Determining if the function sendmsg exists failed with the following output:
Change Dir: C:/msys64/home/vagrant/slave/monero-static-win64/build/build/release/CMakeFiles/CMakeTmp

Run Build Command:"C:/msys64/usr/bin/make.exe" "cmTC_875c4/fast"
make[1]: Entering directory '/home/vagrant/slave/monero-static-win64/build/build/release/CMakeFiles/CMakeTmp'
/usr/bin/make -f CMakeFiles/cmTC_875c4.dir/build.make CMakeFiles/cmTC_875c4.dir/build
make[2]: Entering directory '/home/vagrant/slave/monero-static-win64/build/build/release/CMakeFiles/CMakeTmp'
Building C object CMakeFiles/cmTC_875c4.dir/CheckFunctionExists.c.obj

/C/msys64/mingw64/bin/x86_64-w64-mingw32-gcc.exe   -DCHECK_FUNCTION_EXISTS=sendmsg   -o CMakeFiles/cmTC_875c4.dir/CheckFunctionExists.c.obj   -c /C/msys64/mingw64/share/cmake-3.12/Modules/CheckFunctionExists.c
Linking C executable cmTC_875c4.exe

/C/msys64/mingw64/bin/cmake.exe -E remove -f CMakeFiles/cmTC_875c4.dir/objects.a
ar cr CMakeFiles/cmTC_875c4.dir/objects.a "CMakeFiles/cmTC_875c4.dir/CheckFunctionExists.c.obj" 
/C/msys64/mingw64/bin/x86_64-w64-mingw32-gcc.exe  -DCHECK_FUNCTION_EXISTS=sendmsg    -Wl,--whole-archive CMakeFiles/cmTC_875c4.dir/objects.a -Wl,--no-whole-archive  -o cmTC_875c4.exe -Wl,--major-image-version,0,--minor-image-version,0 -liphlpapi -lws2_32 -lkernel32 -luser32 -lgdi32 -lwinspool -lshell32 -lole32 -loleaut32 -luuid -lcomdlg32 -ladvapi32 
CMakeFiles/cmTC_875c4.dir/objects.a(CheckFunctionExists.c.obj):CheckFunctionExists.c:(.text+0x15): undefined reference to `sendmsg'

collect2.exe: error: ld returned 1 exit status
make[2]: *** [CMakeFiles/cmTC_875c4.dir/build.make:88: cmTC_875c4.exe] Error 1
make[2]: Leaving directory '/home/vagrant/slave/monero-static-win64/build/build/release/CMakeFiles/CMakeTmp'
make[1]: *** [Makefile:121: cmTC_875c4/fast] Error 2
make[1]: Leaving directory '/home/vagrant/slave/monero-static-win64/build/build/release/CMakeFiles/CMakeTmp'


Determining if the function setregid exists failed with the following output:
Change Dir: C:/msys64/home/vagrant/slave/monero-static-win64/build/build/release/CMakeFiles/CMakeTmp

Run Build Command:"C:/msys64/usr/bin/make.exe" "cmTC_4522b/fast"
make[1]: Entering directory '/home/vagrant/slave/monero-static-win64/build/build/release/CMakeFiles/CMakeTmp'
/usr/bin/make -f CMakeFiles/cmTC_4522b.dir/build.make CMakeFiles/cmTC_4522b.dir/build
make[2]: Entering directory '/home/vagrant/slave/monero-static-win64/build/build/release/CMakeFiles/CMakeTmp'
Building C object CMakeFiles/cmTC_4522b.dir/CheckFunctionExists.c.obj

/C/msys64/mingw64/bin/x86_64-w64-mingw32-gcc.exe   -DCHECK_FUNCTION_EXISTS=setregid   -o CMakeFiles/cmTC_4522b.dir/CheckFunctionExists.c.obj   -c /C/msys64/mingw64/share/cmake-3.12/Modules/CheckFunctionExists.c
Linking C executable cmTC_4522b.exe

/C/msys64/mingw64/bin/cmake.exe -E remove -f CMakeFiles/cmTC_4522b.dir/objects.a
ar cr CMakeFiles/cmTC_4522b.dir/objects.a "CMakeFiles/cmTC_4522b.dir/CheckFunctionExists.c.obj" 
/C/msys64/mingw64/bin/x86_64-w64-mingw32-gcc.exe  -DCHECK_FUNCTION_EXISTS=setregid    -Wl,--whole-archive CMakeFiles/cmTC_4522b.dir/objects.a -Wl,--no-whole-archive  -o cmTC_4522b.exe -Wl,--major-image-version,0,--minor-image-version,0 -liphlpapi -lws2_32 -lkernel32 -luser32 -lgdi32 -lwinspool -lshell32 -lole32 -loleaut32 -luuid -lcomdlg32 -ladvapi32 
CMakeFiles/cmTC_4522b.dir/objects.a(CheckFunctionExists.c.obj):CheckFunctionExists.c:(.text+0x15): undefined reference to `setregid'

collect2.exe: error: ld returned 1 exit status
make[2]: *** [CMakeFiles/cmTC_4522b.dir/build.make:88: cmTC_4522b.exe] Error 1
make[2]: Leaving directory '/home/vagrant/slave/monero-static-win64/build/build/release/CMakeFiles/CMakeTmp'
make[1]: *** [Makefile:121: cmTC_4522b/fast] Error 2
make[1]: Leaving directory '/home/vagrant/slave/monero-static-win64/build/build/release/CMakeFiles/CMakeTmp'


Determining if the function setresgid exists failed with the following output:
Change Dir: C:/msys64/home/vagrant/slave/monero-static-win64/build/build/release/CMakeFiles/CMakeTmp

Run Build Command:"C:/msys64/usr/bin/make.exe" "cmTC_9fc4d/fast"
make[1]: Entering directory '/home/vagrant/slave/monero-static-win64/build/build/release/CMakeFiles/CMakeTmp'
/usr/bin/make -f CMakeFiles/cmTC_9fc4d.dir/build.make CMakeFiles/cmTC_9fc4d.dir/build
make[2]: Entering directory '/home/vagrant/slave/monero-static-win64/build/build/release/CMakeFiles/CMakeTmp'
Building C object CMakeFiles/cmTC_9fc4d.dir/CheckFunctionExists.c.obj

/C/msys64/mingw64/bin/x86_64-w64-mingw32-gcc.exe   -DCHECK_FUNCTION_EXISTS=setresgid   -o CMakeFiles/cmTC_9fc4d.dir/CheckFunctionExists.c.obj   -c /C/msys64/mingw64/share/cmake-3.12/Modules/CheckFunctionExists.c
Linking C executable cmTC_9fc4d.exe

/C/msys64/mingw64/bin/cmake.exe -E remove -f CMakeFiles/cmTC_9fc4d.dir/objects.a
ar cr CMakeFiles/cmTC_9fc4d.dir/objects.a "CMakeFiles/cmTC_9fc4d.dir/CheckFunctionExists.c.obj" 
/C/msys64/mingw64/bin/x86_64-w64-mingw32-gcc.exe  -DCHECK_FUNCTION_EXISTS=setresgid    -Wl,--whole-archive CMakeFiles/cmTC_9fc4d.dir/objects.a -Wl,--no-whole-archive  -o cmTC_9fc4d.exe -Wl,--major-image-version,0,--minor-image-version,0 -liphlpapi -lws2_32 -lkernel32 -luser32 -lgdi32 -lwinspool -lshell32 -lole32 -loleaut32 -luuid -lcomdlg32 -ladvapi32 
CMakeFiles/cmTC_9fc4d.dir/objects.a(CheckFunctionExists.c.obj):CheckFunctionExists.c:(.text+0x15): undefined reference to `setresgid'

collect2.exe: error: ld returned 1 exit status
make[2]: *** [CMakeFiles/cmTC_9fc4d.dir/build.make:88: cmTC_9fc4d.exe] Error 1
make[2]: Leaving directory '/home/vagrant/slave/monero-static-win64/build/build/release/CMakeFiles/CMakeTmp'
make[1]: *** [Makefile:121: cmTC_9fc4d/fast] Error 2
make[1]: Leaving directory '/home/vagrant/slave/monero-static-win64/build/build/release/CMakeFiles/CMakeTmp'


Determining if the function setresuid exists failed with the following output:
Change Dir: C:/msys64/home/vagrant/slave/monero-static-win64/build/build/release/CMakeFiles/CMakeTmp

Run Build Command:"C:/msys64/usr/bin/make.exe" "cmTC_7e52a/fast"
make[1]: Entering directory '/home/vagrant/slave/monero-static-win64/build/build/release/CMakeFiles/CMakeTmp'
/usr/bin/make -f CMakeFiles/cmTC_7e52a.dir/build.make CMakeFiles/cmTC_7e52a.dir/build
make[2]: Entering directory '/home/vagrant/slave/monero-static-win64/build/build/release/CMakeFiles/CMakeTmp'
Building C object CMakeFiles/cmTC_7e52a.dir/CheckFunctionExists.c.obj

/C/msys64/mingw64/bin/x86_64-w64-mingw32-gcc.exe   -DCHECK_FUNCTION_EXISTS=setresuid   -o CMakeFiles/cmTC_7e52a.dir/CheckFunctionExists.c.obj   -c /C/msys64/mingw64/share/cmake-3.12/Modules/CheckFunctionExists.c
Linking C executable cmTC_7e52a.exe

/C/msys64/mingw64/bin/cmake.exe -E remove -f CMakeFiles/cmTC_7e52a.dir/objects.a
ar cr CMakeFiles/cmTC_7e52a.dir/objects.a "CMakeFiles/cmTC_7e52a.dir/CheckFunctionExists.c.obj" 
/C/msys64/mingw64/bin/x86_64-w64-mingw32-gcc.exe  -DCHECK_FUNCTION_EXISTS=setresuid    -Wl,--whole-archive CMakeFiles/cmTC_7e52a.dir/objects.a -Wl,--no-whole-archive  -o cmTC_7e52a.exe -Wl,--major-image-version,0,--minor-image-version,0 -liphlpapi -lws2_32 -lkernel32 -luser32 -lgdi32 -lwinspool -lshell32 -lole32 -loleaut32 -luuid -lcomdlg32 -ladvapi32 
CMakeFiles/cmTC_7e52a.dir/objects.a(CheckFunctionExists.c.obj):CheckFunctionExists.c:(.text+0x15): undefined reference to `setresuid'

collect2.exe: error: ld returned 1 exit status
make[2]: *** [CMakeFiles/cmTC_7e52a.dir/build.make:88: cmTC_7e52a.exe] Error 1
make[2]: Leaving directory '/home/vagrant/slave/monero-static-win64/build/build/release/CMakeFiles/CMakeTmp'
make[1]: *** [Makefile:121: cmTC_7e52a/fast] Error 2
make[1]: Leaving directory '/home/vagrant/slave/monero-static-win64/build/build/release/CMakeFiles/CMakeTmp'


Determining if the function setreuid exists failed with the following output:
Change Dir: C:/msys64/home/vagrant/slave/monero-static-win64/build/build/release/CMakeFiles/CMakeTmp

Run Build Command:"C:/msys64/usr/bin/make.exe" "cmTC_abed1/fast"
make[1]: Entering directory '/home/vagrant/slave/monero-static-win64/build/build/release/CMakeFiles/CMakeTmp'
/usr/bin/make -f CMakeFiles/cmTC_abed1.dir/build.make CMakeFiles/cmTC_abed1.dir/build
make[2]: Entering directory '/home/vagrant/slave/monero-static-win64/build/build/release/CMakeFiles/CMakeTmp'
Building C object CMakeFiles/cmTC_abed1.dir/CheckFunctionExists.c.obj

/C/msys64/mingw64/bin/x86_64-w64-mingw32-gcc.exe   -DCHECK_FUNCTION_EXISTS=setreuid   -o CMakeFiles/cmTC_abed1.dir/CheckFunctionExists.c.obj   -c /C/msys64/mingw64/share/cmake-3.12/Modules/CheckFunctionExists.c
Linking C executable cmTC_abed1.exe

/C/msys64/mingw64/bin/cmake.exe -E remove -f CMakeFiles/cmTC_abed1.dir/objects.a
ar cr CMakeFiles/cmTC_abed1.dir/objects.a "CMakeFiles/cmTC_abed1.dir/CheckFunctionExists.c.obj" 
/C/msys64/mingw64/bin/x86_64-w64-mingw32-gcc.exe  -DCHECK_FUNCTION_EXISTS=setreuid    -Wl,--whole-archive CMakeFiles/cmTC_abed1.dir/objects.a -Wl,--no-whole-archive  -o cmTC_abed1.exe -Wl,--major-image-version,0,--minor-image-version,0 -liphlpapi -lws2_32 -lkernel32 -luser32 -lgdi32 -lwinspool -lshell32 -lole32 -loleaut32 -luuid -lcomdlg32 -ladvapi32 
CMakeFiles/cmTC_abed1.dir/objects.a(CheckFunctionExists.c.obj):CheckFunctionExists.c:(.text+0x15): undefined reference to `setreuid'

collect2.exe: error: ld returned 1 exit status
make[2]: *** [CMakeFiles/cmTC_abed1.dir/build.make:88: cmTC_abed1.exe] Error 1
make[2]: Leaving directory '/home/vagrant/slave/monero-static-win64/build/build/release/CMakeFiles/CMakeTmp'
make[1]: *** [Makefile:121: cmTC_abed1/fast] Error 2
make[1]: Leaving directory '/home/vagrant/slave/monero-static-win64/build/build/release/CMakeFiles/CMakeTmp'


Determining if the function setrlimit exists failed with the following output:
Change Dir: C:/msys64/home/vagrant/slave/monero-static-win64/build/build/release/CMakeFiles/CMakeTmp

Run Build Command:"C:/msys64/usr/bin/make.exe" "cmTC_d625a/fast"
make[1]: Entering directory '/home/vagrant/slave/monero-static-win64/build/build/release/CMakeFiles/CMakeTmp'
/usr/bin/make -f CMakeFiles/cmTC_d625a.dir/build.make CMakeFiles/cmTC_d625a.dir/build
make[2]: Entering directory '/home/vagrant/slave/monero-static-win64/build/build/release/CMakeFiles/CMakeTmp'
Building C object CMakeFiles/cmTC_d625a.dir/CheckFunctionExists.c.obj

/C/msys64/mingw64/bin/x86_64-w64-mingw32-gcc.exe   -DCHECK_FUNCTION_EXISTS=setrlimit   -o CMakeFiles/cmTC_d625a.dir/CheckFunctionExists.c.obj   -c /C/msys64/mingw64/share/cmake-3.12/Modules/CheckFunctionExists.c
Linking C executable cmTC_d625a.exe

/C/msys64/mingw64/bin/cmake.exe -E remove -f CMakeFiles/cmTC_d625a.dir/objects.a
ar cr CMakeFiles/cmTC_d625a.dir/objects.a "CMakeFiles/cmTC_d625a.dir/CheckFunctionExists.c.obj" 
/C/msys64/mingw64/bin/x86_64-w64-mingw32-gcc.exe  -DCHECK_FUNCTION_EXISTS=setrlimit    -Wl,--whole-archive CMakeFiles/cmTC_d625a.dir/objects.a -Wl,--no-whole-archive  -o cmTC_d625a.exe -Wl,--major-image-version,0,--minor-image-version,0 -liphlpapi -lws2_32 -lkernel32 -luser32 -lgdi32 -lwinspool -lshell32 -lole32 -loleaut32 -luuid -lcomdlg32 -ladvapi32 
CMakeFiles/cmTC_d625a.dir/objects.a(CheckFunctionExists.c.obj):CheckFunctionExists.c:(.text+0x15): undefined reference to `setrlimit'

collect2.exe: error: ld returned 1 exit status
make[2]: *** [CMakeFiles/cmTC_d625a.dir/build.make:88: cmTC_d625a.exe] Error 1
make[2]: Leaving directory '/home/vagrant/slave/monero-static-win64/build/build/release/CMakeFiles/CMakeTmp'
make[1]: *** [Makefile:121: cmTC_d625a/fast] Error 2
make[1]: Leaving directory '/home/vagrant/slave/monero-static-win64/build/build/release/CMakeFiles/CMakeTmp'


Determining if the function setsid exists failed with the following output:
Change Dir: C:/msys64/home/vagrant/slave/monero-static-win64/build/build/release/CMakeFiles/CMakeTmp

Run Build Command:"C:/msys64/usr/bin/make.exe" "cmTC_4d684/fast"
make[1]: Entering directory '/home/vagrant/slave/monero-static-win64/build/build/release/CMakeFiles/CMakeTmp'
/usr/bin/make -f CMakeFiles/cmTC_4d684.dir/build.make CMakeFiles/cmTC_4d684.dir/build
make[2]: Entering directory '/home/vagrant/slave/monero-static-win64/build/build/release/CMakeFiles/CMakeTmp'
Building C object CMakeFiles/cmTC_4d684.dir/CheckFunctionExists.c.obj

/C/msys64/mingw64/bin/x86_64-w64-mingw32-gcc.exe   -DCHECK_FUNCTION_EXISTS=setsid   -o CMakeFiles/cmTC_4d684.dir/CheckFunctionExists.c.obj   -c /C/msys64/mingw64/share/cmake-3.12/Modules/CheckFunctionExists.c
Linking C executable cmTC_4d684.exe

/C/msys64/mingw64/bin/cmake.exe -E remove -f CMakeFiles/cmTC_4d684.dir/objects.a
ar cr CMakeFiles/cmTC_4d684.dir/objects.a "CMakeFiles/cmTC_4d684.dir/CheckFunctionExists.c.obj" 
/C/msys64/mingw64/bin/x86_64-w64-mingw32-gcc.exe  -DCHECK_FUNCTION_EXISTS=setsid    -Wl,--whole-archive CMakeFiles/cmTC_4d684.dir/objects.a -Wl,--no-whole-archive  -o cmTC_4d684.exe -Wl,--major-image-version,0,--minor-image-version,0 -liphlpapi -lws2_32 -lkernel32 -luser32 -lgdi32 -lwinspool -lshell32 -lole32 -loleaut32 -luuid -lcomdlg32 -ladvapi32 
CMakeFiles/cmTC_4d684.dir/objects.a(CheckFunctionExists.c.obj):CheckFunctionExists.c:(.text+0x15): undefined reference to `setsid'

collect2.exe: error: ld returned 1 exit status
make[2]: *** [CMakeFiles/cmTC_4d684.dir/build.make:88: cmTC_4d684.exe] Error 1
make[2]: Leaving directory '/home/vagrant/slave/monero-static-win64/build/build/release/CMakeFiles/CMakeTmp'
make[1]: *** [Makefile:121: cmTC_4d684/fast] Error 2
make[1]: Leaving directory '/home/vagrant/slave/monero-static-win64/build/build/release/CMakeFiles/CMakeTmp'


Determining if the function setusercontent exists failed with the following output:
Change Dir: C:/msys64/home/vagrant/slave/monero-static-win64/build/build/release/CMakeFiles/CMakeTmp

Run Build Command:"C:/msys64/usr/bin/make.exe" "cmTC_36e3f/fast"
make[1]: Entering directory '/home/vagrant/slave/monero-static-win64/build/build/release/CMakeFiles/CMakeTmp'
/usr/bin/make -f CMakeFiles/cmTC_36e3f.dir/build.make CMakeFiles/cmTC_36e3f.dir/build
make[2]: Entering directory '/home/vagrant/slave/monero-static-win64/build/build/release/CMakeFiles/CMakeTmp'
Building C object CMakeFiles/cmTC_36e3f.dir/CheckFunctionExists.c.obj

/C/msys64/mingw64/bin/x86_64-w64-mingw32-gcc.exe   -DCHECK_FUNCTION_EXISTS=setusercontent   -o CMakeFiles/cmTC_36e3f.dir/CheckFunctionExists.c.obj   -c /C/msys64/mingw64/share/cmake-3.12/Modules/CheckFunctionExists.c
Linking C executable cmTC_36e3f.exe

/C/msys64/mingw64/bin/cmake.exe -E remove -f CMakeFiles/cmTC_36e3f.dir/objects.a
ar cr CMakeFiles/cmTC_36e3f.dir/objects.a "CMakeFiles/cmTC_36e3f.dir/CheckFunctionExists.c.obj" 
/C/msys64/mingw64/bin/x86_64-w64-mingw32-gcc.exe  -DCHECK_FUNCTION_EXISTS=setusercontent    -Wl,--whole-archive CMakeFiles/cmTC_36e3f.dir/objects.a -Wl,--no-whole-archive  -o cmTC_36e3f.exe -Wl,--major-image-version,0,--minor-image-version,0 -liphlpapi -lws2_32 -lkernel32 -luser32 -lgdi32 -lwinspool -lshell32 -lole32 -loleaut32 -luuid -lcomdlg32 -ladvapi32 
CMakeFiles/cmTC_36e3f.dir/objects.a(CheckFunctionExists.c.obj):CheckFunctionExists.c:(.text+0x15): undefined reference to `setusercontent'

collect2.exe: error: ld returned 1 exit status
make[2]: *** [CMakeFiles/cmTC_36e3f.dir/build.make:88: cmTC_36e3f.exe] Error 1
make[2]: Leaving directory '/home/vagrant/slave/monero-static-win64/build/build/release/CMakeFiles/CMakeTmp'
make[1]: *** [Makefile:121: cmTC_36e3f/fast] Error 2
make[1]: Leaving directory '/home/vagrant/slave/monero-static-win64/build/build/release/CMakeFiles/CMakeTmp'


Determining if the function sigprocmask exists failed with the following output:
Change Dir: C:/msys64/home/vagrant/slave/monero-static-win64/build/build/release/CMakeFiles/CMakeTmp

Run Build Command:"C:/msys64/usr/bin/make.exe" "cmTC_fc636/fast"
make[1]: Entering directory '/home/vagrant/slave/monero-static-win64/build/build/release/CMakeFiles/CMakeTmp'
/usr/bin/make -f CMakeFiles/cmTC_fc636.dir/build.make CMakeFiles/cmTC_fc636.dir/build
make[2]: Entering directory '/home/vagrant/slave/monero-static-win64/build/build/release/CMakeFiles/CMakeTmp'
Building C object CMakeFiles/cmTC_fc636.dir/CheckFunctionExists.c.obj

/C/msys64/mingw64/bin/x86_64-w64-mingw32-gcc.exe   -DCHECK_FUNCTION_EXISTS=sigprocmask   -o CMakeFiles/cmTC_fc636.dir/CheckFunctionExists.c.obj   -c /C/msys64/mingw64/share/cmake-3.12/Modules/CheckFunctionExists.c
Linking C executable cmTC_fc636.exe

/C/msys64/mingw64/bin/cmake.exe -E remove -f CMakeFiles/cmTC_fc636.dir/objects.a
ar cr CMakeFiles/cmTC_fc636.dir/objects.a "CMakeFiles/cmTC_fc636.dir/CheckFunctionExists.c.obj" 
/C/msys64/mingw64/bin/x86_64-w64-mingw32-gcc.exe  -DCHECK_FUNCTION_EXISTS=sigprocmask    -Wl,--whole-archive CMakeFiles/cmTC_fc636.dir/objects.a -Wl,--no-whole-archive  -o cmTC_fc636.exe -Wl,--major-image-version,0,--minor-image-version,0 -liphlpapi -lws2_32 -lkernel32 -luser32 -lgdi32 -lwinspool -lshell32 -lole32 -loleaut32 -luuid -lcomdlg32 -ladvapi32 
CMakeFiles/cmTC_fc636.dir/objects.a(CheckFunctionExists.c.obj):CheckFunctionExists.c:(.text+0x15): undefined reference to `sigprocmask'

collect2.exe: error: ld returned 1 exit status
make[2]: *** [CMakeFiles/cmTC_fc636.dir/build.make:88: cmTC_fc636.exe] Error 1
make[2]: Leaving directory '/home/vagrant/slave/monero-static-win64/build/build/release/CMakeFiles/CMakeTmp'
make[1]: *** [Makefile:121: cmTC_fc636/fast] Error 2
make[1]: Leaving directory '/home/vagrant/slave/monero-static-win64/build/build/release/CMakeFiles/CMakeTmp'


Determining if the function socketpair exists failed with the following output:
Change Dir: C:/msys64/home/vagrant/slave/monero-static-win64/build/build/release/CMakeFiles/CMakeTmp

Run Build Command:"C:/msys64/usr/bin/make.exe" "cmTC_ee433/fast"
make[1]: Entering directory '/home/vagrant/slave/monero-static-win64/build/build/release/CMakeFiles/CMakeTmp'
/usr/bin/make -f CMakeFiles/cmTC_ee433.dir/build.make CMakeFiles/cmTC_ee433.dir/build
make[2]: Entering directory '/home/vagrant/slave/monero-static-win64/build/build/release/CMakeFiles/CMakeTmp'
Building C object CMakeFiles/cmTC_ee433.dir/CheckFunctionExists.c.obj

/C/msys64/mingw64/bin/x86_64-w64-mingw32-gcc.exe   -DCHECK_FUNCTION_EXISTS=socketpair   -o CMakeFiles/cmTC_ee433.dir/CheckFunctionExists.c.obj   -c /C/msys64/mingw64/share/cmake-3.12/Modules/CheckFunctionExists.c
Linking C executable cmTC_ee433.exe

/C/msys64/mingw64/bin/cmake.exe -E remove -f CMakeFiles/cmTC_ee433.dir/objects.a
ar cr CMakeFiles/cmTC_ee433.dir/objects.a "CMakeFiles/cmTC_ee433.dir/CheckFunctionExists.c.obj" 
/C/msys64/mingw64/bin/x86_64-w64-mingw32-gcc.exe  -DCHECK_FUNCTION_EXISTS=socketpair    -Wl,--whole-archive CMakeFiles/cmTC_ee433.dir/objects.a -Wl,--no-whole-archive  -o cmTC_ee433.exe -Wl,--major-image-version,0,--minor-image-version,0 -liphlpapi -lws2_32 -lkernel32 -luser32 -lgdi32 -lwinspool -lshell32 -lole32 -loleaut32 -luuid -lcomdlg32 -ladvapi32 
CMakeFiles/cmTC_ee433.dir/objects.a(CheckFunctionExists.c.obj):CheckFunctionExists.c:(.text+0x15): undefined reference to `socketpair'

collect2.exe: error: ld returned 1 exit status
make[2]: *** [CMakeFiles/cmTC_ee433.dir/build.make:88: cmTC_ee433.exe] Error 1
make[2]: Leaving directory '/home/vagrant/slave/monero-static-win64/build/build/release/CMakeFiles/CMakeTmp'
make[1]: *** [Makefile:121: cmTC_ee433/fast] Error 2
make[1]: Leaving directory '/home/vagrant/slave/monero-static-win64/build/build/release/CMakeFiles/CMakeTmp'


Determining if the function srandom exists failed with the following output:
Change Dir: C:/msys64/home/vagrant/slave/monero-static-win64/build/build/release/CMakeFiles/CMakeTmp

Run Build Command:"C:/msys64/usr/bin/make.exe" "cmTC_942ed/fast"
make[1]: Entering directory '/home/vagrant/slave/monero-static-win64/build/build/release/CMakeFiles/CMakeTmp'
/usr/bin/make -f CMakeFiles/cmTC_942ed.dir/build.make CMakeFiles/cmTC_942ed.dir/build
make[2]: Entering directory '/home/vagrant/slave/monero-static-win64/build/build/release/CMakeFiles/CMakeTmp'
Building C object CMakeFiles/cmTC_942ed.dir/CheckFunctionExists.c.obj

/C/msys64/mingw64/bin/x86_64-w64-mingw32-gcc.exe   -DCHECK_FUNCTION_EXISTS=srandom   -o CMakeFiles/cmTC_942ed.dir/CheckFunctionExists.c.obj   -c /C/msys64/mingw64/share/cmake-3.12/Modules/CheckFunctionExists.c
Linking C executable cmTC_942ed.exe

/C/msys64/mingw64/bin/cmake.exe -E remove -f CMakeFiles/cmTC_942ed.dir/objects.a
ar cr CMakeFiles/cmTC_942ed.dir/objects.a "CMakeFiles/cmTC_942ed.dir/CheckFunctionExists.c.obj" 
/C/msys64/mingw64/bin/x86_64-w64-mingw32-gcc.exe  -DCHECK_FUNCTION_EXISTS=srandom    -Wl,--whole-archive CMakeFiles/cmTC_942ed.dir/objects.a -Wl,--no-whole-archive  -o cmTC_942ed.exe -Wl,--major-image-version,0,--minor-image-version,0 -liphlpapi -lws2_32 -lkernel32 -luser32 -lgdi32 -lwinspool -lshell32 -lole32 -loleaut32 -luuid -lcomdlg32 -ladvapi32 
CMakeFiles/cmTC_942ed.dir/objects.a(CheckFunctionExists.c.obj):CheckFunctionExists.c:(.text+0x15): undefined reference to `srandom'

collect2.exe: error: ld returned 1 exit status
make[2]: *** [CMakeFiles/cmTC_942ed.dir/build.make:88: cmTC_942ed.exe] Error 1
make[2]: Leaving directory '/home/vagrant/slave/monero-static-win64/build/build/release/CMakeFiles/CMakeTmp'
make[1]: *** [Makefile:121: cmTC_942ed/fast] Error 2
make[1]: Leaving directory '/home/vagrant/slave/monero-static-win64/build/build/release/CMakeFiles/CMakeTmp'


Determining if the function strsep exists failed with the following output:
Change Dir: C:/msys64/home/vagrant/slave/monero-static-win64/build/build/release/CMakeFiles/CMakeTmp

Run Build Command:"C:/msys64/usr/bin/make.exe" "cmTC_164d3/fast"
make[1]: Entering directory '/home/vagrant/slave/monero-static-win64/build/build/release/CMakeFiles/CMakeTmp'
/usr/bin/make -f CMakeFiles/cmTC_164d3.dir/build.make CMakeFiles/cmTC_164d3.dir/build
make[2]: Entering directory '/home/vagrant/slave/monero-static-win64/build/build/release/CMakeFiles/CMakeTmp'
Building C object CMakeFiles/cmTC_164d3.dir/CheckFunctionExists.c.obj

/C/msys64/mingw64/bin/x86_64-w64-mingw32-gcc.exe   -DCHECK_FUNCTION_EXISTS=strsep   -o CMakeFiles/cmTC_164d3.dir/CheckFunctionExists.c.obj   -c /C/msys64/mingw64/share/cmake-3.12/Modules/CheckFunctionExists.c
Linking C executable cmTC_164d3.exe

/C/msys64/mingw64/bin/cmake.exe -E remove -f CMakeFiles/cmTC_164d3.dir/objects.a
ar cr CMakeFiles/cmTC_164d3.dir/objects.a "CMakeFiles/cmTC_164d3.dir/CheckFunctionExists.c.obj" 
/C/msys64/mingw64/bin/x86_64-w64-mingw32-gcc.exe  -DCHECK_FUNCTION_EXISTS=strsep    -Wl,--whole-archive CMakeFiles/cmTC_164d3.dir/objects.a -Wl,--no-whole-archive  -o cmTC_164d3.exe -Wl,--major-image-version,0,--minor-image-version,0 -liphlpapi -lws2_32 -lkernel32 -luser32 -lgdi32 -lwinspool -lshell32 -lole32 -loleaut32 -luuid -lcomdlg32 -ladvapi32 
CMakeFiles/cmTC_164d3.dir/objects.a(CheckFunctionExists.c.obj):CheckFunctionExists.c:(.text+0x15): undefined reference to `strsep'

collect2.exe: error: ld returned 1 exit status
make[2]: *** [CMakeFiles/cmTC_164d3.dir/build.make:88: cmTC_164d3.exe] Error 1
make[2]: Leaving directory '/home/vagrant/slave/monero-static-win64/build/build/release/CMakeFiles/CMakeTmp'
make[1]: *** [Makefile:121: cmTC_164d3/fast] Error 2
make[1]: Leaving directory '/home/vagrant/slave/monero-static-win64/build/build/release/CMakeFiles/CMakeTmp'


Determining if the function strlcat exists failed with the following output:
Change Dir: C:/msys64/home/vagrant/slave/monero-static-win64/build/build/release/CMakeFiles/CMakeTmp

Run Build Command:"C:/msys64/usr/bin/make.exe" "cmTC_fbb0f/fast"
make[1]: Entering directory '/home/vagrant/slave/monero-static-win64/build/build/release/CMakeFiles/CMakeTmp'
/usr/bin/make -f CMakeFiles/cmTC_fbb0f.dir/build.make CMakeFiles/cmTC_fbb0f.dir/build
make[2]: Entering directory '/home/vagrant/slave/monero-static-win64/build/build/release/CMakeFiles/CMakeTmp'
Building C object CMakeFiles/cmTC_fbb0f.dir/CheckFunctionExists.c.obj

/C/msys64/mingw64/bin/x86_64-w64-mingw32-gcc.exe   -DCHECK_FUNCTION_EXISTS=strlcat   -o CMakeFiles/cmTC_fbb0f.dir/CheckFunctionExists.c.obj   -c /C/msys64/mingw64/share/cmake-3.12/Modules/CheckFunctionExists.c
Linking C executable cmTC_fbb0f.exe

/C/msys64/mingw64/bin/cmake.exe -E remove -f CMakeFiles/cmTC_fbb0f.dir/objects.a
ar cr CMakeFiles/cmTC_fbb0f.dir/objects.a "CMakeFiles/cmTC_fbb0f.dir/CheckFunctionExists.c.obj" 
/C/msys64/mingw64/bin/x86_64-w64-mingw32-gcc.exe  -DCHECK_FUNCTION_EXISTS=strlcat    -Wl,--whole-archive CMakeFiles/cmTC_fbb0f.dir/objects.a -Wl,--no-whole-archive  -o cmTC_fbb0f.exe -Wl,--major-image-version,0,--minor-image-version,0 -liphlpapi -lws2_32 -lkernel32 -luser32 -lgdi32 -lwinspool -lshell32 -lole32 -loleaut32 -luuid -lcomdlg32 -ladvapi32 
CMakeFiles/cmTC_fbb0f.dir/objects.a(CheckFunctionExists.c.obj):CheckFunctionExists.c:(.text+0x15): undefined reference to `strlcat'

collect2.exe: error: ld returned 1 exit status
make[2]: *** [CMakeFiles/cmTC_fbb0f.dir/build.make:88: cmTC_fbb0f.exe] Error 1
make[2]: Leaving directory '/home/vagrant/slave/monero-static-win64/build/build/release/CMakeFiles/CMakeTmp'
make[1]: *** [Makefile:121: cmTC_fbb0f/fast] Error 2
make[1]: Leaving directory '/home/vagrant/slave/monero-static-win64/build/build/release/CMakeFiles/CMakeTmp'


Determining if the function strlcpy exists failed with the following output:
Change Dir: C:/msys64/home/vagrant/slave/monero-static-win64/build/build/release/CMakeFiles/CMakeTmp

Run Build Command:"C:/msys64/usr/bin/make.exe" "cmTC_f4ac0/fast"
make[1]: Entering directory '/home/vagrant/slave/monero-static-win64/build/build/release/CMakeFiles/CMakeTmp'
/usr/bin/make -f CMakeFiles/cmTC_f4ac0.dir/build.make CMakeFiles/cmTC_f4ac0.dir/build
make[2]: Entering directory '/home/vagrant/slave/monero-static-win64/build/build/release/CMakeFiles/CMakeTmp'
Building C object CMakeFiles/cmTC_f4ac0.dir/CheckFunctionExists.c.obj

/C/msys64/mingw64/bin/x86_64-w64-mingw32-gcc.exe   -DCHECK_FUNCTION_EXISTS=strlcpy   -o CMakeFiles/cmTC_f4ac0.dir/CheckFunctionExists.c.obj   -c /C/msys64/mingw64/share/cmake-3.12/Modules/CheckFunctionExists.c
Linking C executable cmTC_f4ac0.exe

/C/msys64/mingw64/bin/cmake.exe -E remove -f CMakeFiles/cmTC_f4ac0.dir/objects.a
ar cr CMakeFiles/cmTC_f4ac0.dir/objects.a "CMakeFiles/cmTC_f4ac0.dir/CheckFunctionExists.c.obj" 
/C/msys64/mingw64/bin/x86_64-w64-mingw32-gcc.exe  -DCHECK_FUNCTION_EXISTS=strlcpy    -Wl,--whole-archive CMakeFiles/cmTC_f4ac0.dir/objects.a -Wl,--no-whole-archive  -o cmTC_f4ac0.exe -Wl,--major-image-version,0,--minor-image-version,0 -liphlpapi -lws2_32 -lkernel32 -luser32 -lgdi32 -lwinspool -lshell32 -lole32 -loleaut32 -luuid -lcomdlg32 -ladvapi32 
CMakeFiles/cmTC_f4ac0.dir/objects.a(CheckFunctionExists.c.obj):CheckFunctionExists.c:(.text+0x15): undefined reference to `strlcpy'

collect2.exe: error: ld returned 1 exit status
make[2]: *** [CMakeFiles/cmTC_f4ac0.dir/build.make:88: cmTC_f4ac0.exe] Error 1
make[2]: Leaving directory '/home/vagrant/slave/monero-static-win64/build/build/release/CMakeFiles/CMakeTmp'
make[1]: *** [Makefile:121: cmTC_f4ac0/fast] Error 2
make[1]: Leaving directory '/home/vagrant/slave/monero-static-win64/build/build/release/CMakeFiles/CMakeTmp'


Determining if the function strptime exists failed with the following output:
Change Dir: C:/msys64/home/vagrant/slave/monero-static-win64/build/build/release/CMakeFiles/CMakeTmp

Run Build Command:"C:/msys64/usr/bin/make.exe" "cmTC_967bc/fast"
make[1]: Entering directory '/home/vagrant/slave/monero-static-win64/build/build/release/CMakeFiles/CMakeTmp'
/usr/bin/make -f CMakeFiles/cmTC_967bc.dir/build.make CMakeFiles/cmTC_967bc.dir/build
make[2]: Entering directory '/home/vagrant/slave/monero-static-win64/build/build/release/CMakeFiles/CMakeTmp'
Building C object CMakeFiles/cmTC_967bc.dir/CheckFunctionExists.c.obj

/C/msys64/mingw64/bin/x86_64-w64-mingw32-gcc.exe   -DCHECK_FUNCTION_EXISTS=strptime   -o CMakeFiles/cmTC_967bc.dir/CheckFunctionExists.c.obj   -c /C/msys64/mingw64/share/cmake-3.12/Modules/CheckFunctionExists.c
Linking C executable cmTC_967bc.exe

/C/msys64/mingw64/bin/cmake.exe -E remove -f CMakeFiles/cmTC_967bc.dir/objects.a
ar cr CMakeFiles/cmTC_967bc.dir/objects.a "CMakeFiles/cmTC_967bc.dir/CheckFunctionExists.c.obj" 
/C/msys64/mingw64/bin/x86_64-w64-mingw32-gcc.exe  -DCHECK_FUNCTION_EXISTS=strptime    -Wl,--whole-archive CMakeFiles/cmTC_967bc.dir/objects.a -Wl,--no-whole-archive  -o cmTC_967bc.exe -Wl,--major-image-version,0,--minor-image-version,0 -liphlpapi -lws2_32 -lkernel32 -luser32 -lgdi32 -lwinspool -lshell32 -lole32 -loleaut32 -luuid -lcomdlg32 -ladvapi32 
CMakeFiles/cmTC_967bc.dir/objects.a(CheckFunctionExists.c.obj):CheckFunctionExists.c:(.text+0x15): undefined reference to `strptime'

collect2.exe: error: ld returned 1 exit status
make[2]: *** [CMakeFiles/cmTC_967bc.dir/build.make:88: cmTC_967bc.exe] Error 1
make[2]: Leaving directory '/home/vagrant/slave/monero-static-win64/build/build/release/CMakeFiles/CMakeTmp'
make[1]: *** [Makefile:121: cmTC_967bc/fast] Error 2
make[1]: Leaving directory '/home/vagrant/slave/monero-static-win64/build/build/release/CMakeFiles/CMakeTmp'


Determining if the function writev exists failed with the following output:
Change Dir: C:/msys64/home/vagrant/slave/monero-static-win64/build/build/release/CMakeFiles/CMakeTmp

Run Build Command:"C:/msys64/usr/bin/make.exe" "cmTC_5f13a/fast"
make[1]: Entering directory '/home/vagrant/slave/monero-static-win64/build/build/release/CMakeFiles/CMakeTmp'
/usr/bin/make -f CMakeFiles/cmTC_5f13a.dir/build.make CMakeFiles/cmTC_5f13a.dir/build
make[2]: Entering directory '/home/vagrant/slave/monero-static-win64/build/build/release/CMakeFiles/CMakeTmp'
Building C object CMakeFiles/cmTC_5f13a.dir/CheckFunctionExists.c.obj

/C/msys64/mingw64/bin/x86_64-w64-mingw32-gcc.exe   -DCHECK_FUNCTION_EXISTS=writev   -o CMakeFiles/cmTC_5f13a.dir/CheckFunctionExists.c.obj   -c /C/msys64/mingw64/share/cmake-3.12/Modules/CheckFunctionExists.c
Linking C executable cmTC_5f13a.exe

/C/msys64/mingw64/bin/cmake.exe -E remove -f CMakeFiles/cmTC_5f13a.dir/objects.a
ar cr CMakeFiles/cmTC_5f13a.dir/objects.a "CMakeFiles/cmTC_5f13a.dir/CheckFunctionExists.c.obj" 
/C/msys64/mingw64/bin/x86_64-w64-mingw32-gcc.exe  -DCHECK_FUNCTION_EXISTS=writev    -Wl,--whole-archive CMakeFiles/cmTC_5f13a.dir/objects.a -Wl,--no-whole-archive  -o cmTC_5f13a.exe -Wl,--major-image-version,0,--minor-image-version,0 -liphlpapi -lws2_32 -lkernel32 -luser32 -lgdi32 -lwinspool -lshell32 -lole32 -loleaut32 -luuid -lcomdlg32 -ladvapi32 
CMakeFiles/cmTC_5f13a.dir/objects.a(CheckFunctionExists.c.obj):CheckFunctionExists.c:(.text+0x15): undefined reference to `writev'

collect2.exe: error: ld returned 1 exit status
make[2]: *** [CMakeFiles/cmTC_5f13a.dir/build.make:88: cmTC_5f13a.exe] Error 1
make[2]: Leaving directory '/home/vagrant/slave/monero-static-win64/build/build/release/CMakeFiles/CMakeTmp'
make[1]: *** [Makefile:121: cmTC_5f13a/fast] Error 2
make[1]: Leaving directory '/home/vagrant/slave/monero-static-win64/build/build/release/CMakeFiles/CMakeTmp'


Determining size of gid_t failed with the following output:
Change Dir: C:/msys64/home/vagrant/slave/monero-static-win64/build/build/release/CMakeFiles/CMakeTmp

Run Build Command:"C:/msys64/usr/bin/make.exe" "cmTC_480ba/fast"
make[1]: Entering directory '/home/vagrant/slave/monero-static-win64/build/build/release/CMakeFiles/CMakeTmp'
/usr/bin/make -f CMakeFiles/cmTC_480ba.dir/build.make CMakeFiles/cmTC_480ba.dir/build
make[2]: Entering directory '/home/vagrant/slave/monero-static-win64/build/build/release/CMakeFiles/CMakeTmp'
Building C object CMakeFiles/cmTC_480ba.dir/gid_t.c.obj

/C/msys64/mingw64/bin/x86_64-w64-mingw32-gcc.exe    -o CMakeFiles/cmTC_480ba.dir/gid_t.c.obj   -c /C/msys64/home/vagrant/slave/monero-static-win64/build/build/release/CMakeFiles/CheckTypeSize/gid_t.c
C:/msys64/home/vagrant/slave/monero-static-win64/build/build/release/CMakeFiles/CheckTypeSize/gid_t.c:24:22: error: 'gid_t' undeclared here (not in a function); did you mean 'pid_t'?
 #define SIZE (sizeof(gid_t))
                      ^~~~~
C:/msys64/home/vagrant/slave/monero-static-win64/build/build/release/CMakeFiles/CheckTypeSize/gid_t.c:26:12: note: in expansion of macro 'SIZE'
   ('0' + ((SIZE / 10000)%10)),
            ^~~~
make[2]: *** [CMakeFiles/cmTC_480ba.dir/build.make:66: CMakeFiles/cmTC_480ba.dir/gid_t.c.obj] Error 1
make[2]: Leaving directory '/home/vagrant/slave/monero-static-win64/build/build/release/CMakeFiles/CMakeTmp'
make[1]: *** [Makefile:121: cmTC_480ba/fast] Error 2
make[1]: Leaving directory '/home/vagrant/slave/monero-static-win64/build/build/release/CMakeFiles/CMakeTmp'

C:/msys64/home/vagrant/slave/monero-static-win64/build/build/release/CMakeFiles/CheckTypeSize/gid_t.c:
#include <sys/types.h>
#include <stdint.h>
#include <stddef.h>
#include "sys/types.h"


#undef KEY
#if defined(__i386)
# define KEY '_','_','i','3','8','6'
#elif defined(__x86_64)
# define KEY '_','_','x','8','6','_','6','4'
#elif defined(__ppc__)
# define KEY '_','_','p','p','c','_','_'
#elif defined(__ppc64__)
# define KEY '_','_','p','p','c','6','4','_','_'
#elif defined(__aarch64__)
# define KEY '_','_','a','a','r','c','h','6','4','_','_'
#elif defined(__ARM_ARCH_7A__)
# define KEY '_','_','A','R','M','_','A','R','C','H','_','7','A','_','_'
#elif defined(__ARM_ARCH_7S__)
# define KEY '_','_','A','R','M','_','A','R','C','H','_','7','S','_','_'
#endif

#define SIZE (sizeof(gid_t))
char info_size[] =  {'I', 'N', 'F', 'O', ':', 's','i','z','e','[',
  ('0' + ((SIZE / 10000)%10)),
  ('0' + ((SIZE / 1000)%10)),
  ('0' + ((SIZE / 100)%10)),
  ('0' + ((SIZE / 10)%10)),
  ('0' +  (SIZE    % 10)),
  ']',
#ifdef KEY
  ' ','k','e','y','[', KEY, ']',
#endif
  '\0'};

#ifdef __CLASSIC_C__
int main(argc, argv) int argc; char *argv[];
#else
int main(int argc, char *argv[])
#endif
{
  int require = 0;
  require += info_size[argc];
  (void)argv;
  return require;
}


Determining size of in_addr_t failed with the following output:
Change Dir: C:/msys64/home/vagrant/slave/monero-static-win64/build/build/release/CMakeFiles/CMakeTmp

Run Build Command:"C:/msys64/usr/bin/make.exe" "cmTC_954c1/fast"
make[1]: Entering directory '/home/vagrant/slave/monero-static-win64/build/build/release/CMakeFiles/CMakeTmp'
/usr/bin/make -f CMakeFiles/cmTC_954c1.dir/build.make CMakeFiles/cmTC_954c1.dir/build
make[2]: Entering directory '/home/vagrant/slave/monero-static-win64/build/build/release/CMakeFiles/CMakeTmp'
Building C object CMakeFiles/cmTC_954c1.dir/in_addr_t.c.obj

/C/msys64/mingw64/bin/x86_64-w64-mingw32-gcc.exe    -o CMakeFiles/cmTC_954c1.dir/in_addr_t.c.obj   -c /C/msys64/home/vagrant/slave/monero-static-win64/build/build/release/CMakeFiles/CheckTypeSize/in_addr_t.c
C:/msys64/home/vagrant/slave/monero-static-win64/build/build/release/CMakeFiles/CheckTypeSize/in_addr_t.c:4:10: fatal error: netinet/in.h: No such file or directory
 #include "netinet/in.h"
          ^~~~~~~~~~~~~~
compilation terminated.

make[2]: *** [CMakeFiles/cmTC_954c1.dir/build.make:66: CMakeFiles/cmTC_954c1.dir/in_addr_t.c.obj] Error 1
make[2]: Leaving directory '/home/vagrant/slave/monero-static-win64/build/build/release/CMakeFiles/CMakeTmp'
make[1]: *** [Makefile:121: cmTC_954c1/fast] Error 2
make[1]: Leaving directory '/home/vagrant/slave/monero-static-win64/build/build/release/CMakeFiles/CMakeTmp'

C:/msys64/home/vagrant/slave/monero-static-win64/build/build/release/CMakeFiles/CheckTypeSize/in_addr_t.c:
#include <sys/types.h>
#include <stdint.h>
#include <stddef.h>
#include "netinet/in.h"


#undef KEY
#if defined(__i386)
# define KEY '_','_','i','3','8','6'
#elif defined(__x86_64)
# define KEY '_','_','x','8','6','_','6','4'
#elif defined(__ppc__)
# define KEY '_','_','p','p','c','_','_'
#elif defined(__ppc64__)
# define KEY '_','_','p','p','c','6','4','_','_'
#elif defined(__aarch64__)
# define KEY '_','_','a','a','r','c','h','6','4','_','_'
#elif defined(__ARM_ARCH_7A__)
# define KEY '_','_','A','R','M','_','A','R','C','H','_','7','A','_','_'
#elif defined(__ARM_ARCH_7S__)
# define KEY '_','_','A','R','M','_','A','R','C','H','_','7','S','_','_'
#endif

#define SIZE (sizeof(in_addr_t))
char info_size[] =  {'I', 'N', 'F', 'O', ':', 's','i','z','e','[',
  ('0' + ((SIZE / 10000)%10)),
  ('0' + ((SIZE / 1000)%10)),
  ('0' + ((SIZE / 100)%10)),
  ('0' + ((SIZE / 10)%10)),
  ('0' +  (SIZE    % 10)),
  ']',
#ifdef KEY
  ' ','k','e','y','[', KEY, ']',
#endif
  '\0'};

#ifdef __CLASSIC_C__
int main(argc, argv) int argc; char *argv[];
#else
int main(int argc, char *argv[])
#endif
{
  int require = 0;
  require += info_size[argc];
  (void)argv;
  return require;
}


Determining size of in_port_t failed with the following output:
Change Dir: C:/msys64/home/vagrant/slave/monero-static-win64/build/build/release/CMakeFiles/CMakeTmp

Run Build Command:"C:/msys64/usr/bin/make.exe" "cmTC_48d22/fast"
make[1]: Entering directory '/home/vagrant/slave/monero-static-win64/build/build/release/CMakeFiles/CMakeTmp'
/usr/bin/make -f CMakeFiles/cmTC_48d22.dir/build.make CMakeFiles/cmTC_48d22.dir/build
make[2]: Entering directory '/home/vagrant/slave/monero-static-win64/build/build/release/CMakeFiles/CMakeTmp'
Building C object CMakeFiles/cmTC_48d22.dir/in_port_t.c.obj

/C/msys64/mingw64/bin/x86_64-w64-mingw32-gcc.exe    -o CMakeFiles/cmTC_48d22.dir/in_port_t.c.obj   -c /C/msys64/home/vagrant/slave/monero-static-win64/build/build/release/CMakeFiles/CheckTypeSize/in_port_t.c
C:/msys64/home/vagrant/slave/monero-static-win64/build/build/release/CMakeFiles/CheckTypeSize/in_port_t.c:4:10: fatal error: netinet/in.h: No such file or directory
 #include "netinet/in.h"
          ^~~~~~~~~~~~~~
compilation terminated.

make[2]: *** [CMakeFiles/cmTC_48d22.dir/build.make:66: CMakeFiles/cmTC_48d22.dir/in_port_t.c.obj] Error 1
make[2]: Leaving directory '/home/vagrant/slave/monero-static-win64/build/build/release/CMakeFiles/CMakeTmp'
make[1]: *** [Makefile:121: cmTC_48d22/fast] Error 2
make[1]: Leaving directory '/home/vagrant/slave/monero-static-win64/build/build/release/CMakeFiles/CMakeTmp'

C:/msys64/home/vagrant/slave/monero-static-win64/build/build/release/CMakeFiles/CheckTypeSize/in_port_t.c:
#include <sys/types.h>
#include <stdint.h>
#include <stddef.h>
#include "netinet/in.h"


#undef KEY
#if defined(__i386)
# define KEY '_','_','i','3','8','6'
#elif defined(__x86_64)
# define KEY '_','_','x','8','6','_','6','4'
#elif defined(__ppc__)
# define KEY '_','_','p','p','c','_','_'
#elif defined(__ppc64__)
# define KEY '_','_','p','p','c','6','4','_','_'
#elif defined(__aarch64__)
# define KEY '_','_','a','a','r','c','h','6','4','_','_'
#elif defined(__ARM_ARCH_7A__)
# define KEY '_','_','A','R','M','_','A','R','C','H','_','7','A','_','_'
#elif defined(__ARM_ARCH_7S__)
# define KEY '_','_','A','R','M','_','A','R','C','H','_','7','S','_','_'
#endif

#define SIZE (sizeof(in_port_t))
char info_size[] =  {'I', 'N', 'F', 'O', ':', 's','i','z','e','[',
  ('0' + ((SIZE / 10000)%10)),
  ('0' + ((SIZE / 1000)%10)),
  ('0' + ((SIZE / 100)%10)),
  ('0' + ((SIZE / 10)%10)),
  ('0' +  (SIZE    % 10)),
  ']',
#ifdef KEY
  ' ','k','e','y','[', KEY, ']',
#endif
  '\0'};

#ifdef __CLASSIC_C__
int main(argc, argv) int argc; char *argv[];
#else
int main(int argc, char *argv[])
#endif
{
  int require = 0;
  require += info_size[argc];
  (void)argv;
  return require;
}


Determining size of rlim_t failed with the following output:
Change Dir: C:/msys64/home/vagrant/slave/monero-static-win64/build/build/release/CMakeFiles/CMakeTmp

Run Build Command:"C:/msys64/usr/bin/make.exe" "cmTC_c86d2/fast"
make[1]: Entering directory '/home/vagrant/slave/monero-static-win64/build/build/release/CMakeFiles/CMakeTmp'
/usr/bin/make -f CMakeFiles/cmTC_c86d2.dir/build.make CMakeFiles/cmTC_c86d2.dir/build
make[2]: Entering directory '/home/vagrant/slave/monero-static-win64/build/build/release/CMakeFiles/CMakeTmp'
Building C object CMakeFiles/cmTC_c86d2.dir/rlim_t.c.obj

/C/msys64/mingw64/bin/x86_64-w64-mingw32-gcc.exe    -o CMakeFiles/cmTC_c86d2.dir/rlim_t.c.obj   -c /C/msys64/home/vagrant/slave/monero-static-win64/build/build/release/CMakeFiles/CheckTypeSize/rlim_t.c
C:/msys64/home/vagrant/slave/monero-static-win64/build/build/release/CMakeFiles/CheckTypeSize/rlim_t.c:4:10: fatal error: sys/resource.h: No such file or directory
 #include "sys/resource.h"
          ^~~~~~~~~~~~~~~~
compilation terminated.

make[2]: *** [CMakeFiles/cmTC_c86d2.dir/build.make:66: CMakeFiles/cmTC_c86d2.dir/rlim_t.c.obj] Error 1
make[2]: Leaving directory '/home/vagrant/slave/monero-static-win64/build/build/release/CMakeFiles/CMakeTmp'
make[1]: *** [Makefile:121: cmTC_c86d2/fast] Error 2
make[1]: Leaving directory '/home/vagrant/slave/monero-static-win64/build/build/release/CMakeFiles/CMakeTmp'

C:/msys64/home/vagrant/slave/monero-static-win64/build/build/release/CMakeFiles/CheckTypeSize/rlim_t.c:
#include <sys/types.h>
#include <stdint.h>
#include <stddef.h>
#include "sys/resource.h"


#undef KEY
#if defined(__i386)
# define KEY '_','_','i','3','8','6'
#elif defined(__x86_64)
# define KEY '_','_','x','8','6','_','6','4'
#elif defined(__ppc__)
# define KEY '_','_','p','p','c','_','_'
#elif defined(__ppc64__)
# define KEY '_','_','p','p','c','6','4','_','_'
#elif defined(__aarch64__)
# define KEY '_','_','a','a','r','c','h','6','4','_','_'
#elif defined(__ARM_ARCH_7A__)
# define KEY '_','_','A','R','M','_','A','R','C','H','_','7','A','_','_'
#elif defined(__ARM_ARCH_7S__)
# define KEY '_','_','A','R','M','_','A','R','C','H','_','7','S','_','_'
#endif

#define SIZE (sizeof(rlim_t))
char info_size[] =  {'I', 'N', 'F', 'O', ':', 's','i','z','e','[',
  ('0' + ((SIZE / 10000)%10)),
  ('0' + ((SIZE / 1000)%10)),
  ('0' + ((SIZE / 100)%10)),
  ('0' + ((SIZE / 10)%10)),
  ('0' +  (SIZE    % 10)),
  ']',
#ifdef KEY
  ' ','k','e','y','[', KEY, ']',
#endif
  '\0'};

#ifdef __CLASSIC_C__
int main(argc, argv) int argc; char *argv[];
#else
int main(int argc, char *argv[])
#endif
{
  int require = 0;
  require += info_size[argc];
  (void)argv;
  return require;
}


Determining size of uid_t failed with the following output:
Change Dir: C:/msys64/home/vagrant/slave/monero-static-win64/build/build/release/CMakeFiles/CMakeTmp

Run Build Command:"C:/msys64/usr/bin/make.exe" "cmTC_494c6/fast"
make[1]: Entering directory '/home/vagrant/slave/monero-static-win64/build/build/release/CMakeFiles/CMakeTmp'
/usr/bin/make -f CMakeFiles/cmTC_494c6.dir/build.make CMakeFiles/cmTC_494c6.dir/build
make[2]: Entering directory '/home/vagrant/slave/monero-static-win64/build/build/release/CMakeFiles/CMakeTmp'
Building C object CMakeFiles/cmTC_494c6.dir/uid_t.c.obj

/C/msys64/mingw64/bin/x86_64-w64-mingw32-gcc.exe    -o CMakeFiles/cmTC_494c6.dir/uid_t.c.obj   -c /C/msys64/home/vagrant/slave/monero-static-win64/build/build/release/CMakeFiles/CheckTypeSize/uid_t.c
C:/msys64/home/vagrant/slave/monero-static-win64/build/build/release/CMakeFiles/CheckTypeSize/uid_t.c:24:22: error: 'uid_t' undeclared here (not in a function); did you mean 'pid_t'?
 #define SIZE (sizeof(uid_t))
                      ^~~~~
C:/msys64/home/vagrant/slave/monero-static-win64/build/build/release/CMakeFiles/CheckTypeSize/uid_t.c:26:12: note: in expansion of macro 'SIZE'
   ('0' + ((SIZE / 10000)%10)),
            ^~~~
make[2]: *** [CMakeFiles/cmTC_494c6.dir/build.make:66: CMakeFiles/cmTC_494c6.dir/uid_t.c.obj] Error 1
make[2]: Leaving directory '/home/vagrant/slave/monero-static-win64/build/build/release/CMakeFiles/CMakeTmp'
make[1]: *** [Makefile:121: cmTC_494c6/fast] Error 2
make[1]: Leaving directory '/home/vagrant/slave/monero-static-win64/build/build/release/CMakeFiles/CMakeTmp'

C:/msys64/home/vagrant/slave/monero-static-win64/build/build/release/CMakeFiles/CheckTypeSize/uid_t.c:
#include <sys/types.h>
#include <stdint.h>
#include <stddef.h>
#include "sys/types.h"


#undef KEY
#if defined(__i386)
# define KEY '_','_','i','3','8','6'
#elif defined(__x86_64)
# define KEY '_','_','x','8','6','_','6','4'
#elif defined(__ppc__)
# define KEY '_','_','p','p','c','_','_'
#elif defined(__ppc64__)
# define KEY '_','_','p','p','c','6','4','_','_'
#elif defined(__aarch64__)
# define KEY '_','_','a','a','r','c','h','6','4','_','_'
#elif defined(__ARM_ARCH_7A__)
# define KEY '_','_','A','R','M','_','A','R','C','H','_','7','A','_','_'
#elif defined(__ARM_ARCH_7S__)
# define KEY '_','_','A','R','M','_','A','R','C','H','_','7','S','_','_'
#endif

#define SIZE (sizeof(uid_t))
char info_size[] =  {'I', 'N', 'F', 'O', ':', 's','i','z','e','[',
  ('0' + ((SIZE / 10000)%10)),
  ('0' + ((SIZE / 1000)%10)),
  ('0' + ((SIZE / 100)%10)),
  ('0' + ((SIZE / 10)%10)),
  ('0' +  (SIZE    % 10)),
  ']',
#ifdef KEY
  ' ','k','e','y','[', KEY, ']',
#endif
  '\0'};

#ifdef __CLASSIC_C__
int main(argc, argv) int argc; char *argv[];
#else
int main(int argc, char *argv[])
#endif
{
  int require = 0;
  require += info_size[argc];
  (void)argv;
  return require;
}


Determining if the pthread_rwlock_t exist failed with the following output:
Change Dir: C:/msys64/home/vagrant/slave/monero-static-win64/build/build/release/CMakeFiles/CMakeTmp

Run Build Command:"C:/msys64/usr/bin/make.exe" "cmTC_58960/fast"
make[1]: Entering directory '/home/vagrant/slave/monero-static-win64/build/build/release/CMakeFiles/CMakeTmp'
/usr/bin/make -f CMakeFiles/cmTC_58960.dir/build.make CMakeFiles/cmTC_58960.dir/build
make[2]: Entering directory '/home/vagrant/slave/monero-static-win64/build/build/release/CMakeFiles/CMakeTmp'
Building C object CMakeFiles/cmTC_58960.dir/CheckSymbolExists.c.obj

/C/msys64/mingw64/bin/x86_64-w64-mingw32-gcc.exe    -o CMakeFiles/cmTC_58960.dir/CheckSymbolExists.c.obj   -c /C/msys64/home/vagrant/slave/monero-static-win64/build/build/release/CMakeFiles/CMakeTmp/CheckSymbolExists.c
C:/msys64/home/vagrant/slave/monero-static-win64/build/build/release/CMakeFiles/CMakeTmp/CheckSymbolExists.c: In function 'main':
C:/msys64/home/vagrant/slave/monero-static-win64/build/build/release/CMakeFiles/CMakeTmp/CheckSymbolExists.c:8:19: error: expected expression before 'pthread_rwlock_t'
   return ((int*)(&pthread_rwlock_t))[argc];
                   ^~~~~~~~~~~~~~~~
make[2]: *** [CMakeFiles/cmTC_58960.dir/build.make:66: CMakeFiles/cmTC_58960.dir/CheckSymbolExists.c.obj] Error 1
make[2]: Leaving directory '/home/vagrant/slave/monero-static-win64/build/build/release/CMakeFiles/CMakeTmp'
make[1]: *** [Makefile:121: cmTC_58960/fast] Error 2
make[1]: Leaving directory '/home/vagrant/slave/monero-static-win64/build/build/release/CMakeFiles/CMakeTmp'

File C:/msys64/home/vagrant/slave/monero-static-win64/build/build/release/CMakeFiles/CMakeTmp/CheckSymbolExists.c:
/* */
#include <pthread.h>

int main(int argc, char** argv)
{
  (void)argv;
#ifndef pthread_rwlock_t
  return ((int*)(&pthread_rwlock_t))[argc];
#else
  (void)argc;
  return 0;
#endif
}

Determining if the pthread_spinlock_t exist failed with the following output:
Change Dir: C:/msys64/home/vagrant/slave/monero-static-win64/build/build/release/CMakeFiles/CMakeTmp

Run Build Command:"C:/msys64/usr/bin/make.exe" "cmTC_a4e27/fast"
make[1]: Entering directory '/home/vagrant/slave/monero-static-win64/build/build/release/CMakeFiles/CMakeTmp'
/usr/bin/make -f CMakeFiles/cmTC_a4e27.dir/build.make CMakeFiles/cmTC_a4e27.dir/build
make[2]: Entering directory '/home/vagrant/slave/monero-static-win64/build/build/release/CMakeFiles/CMakeTmp'
Building C object CMakeFiles/cmTC_a4e27.dir/CheckSymbolExists.c.obj

/C/msys64/mingw64/bin/x86_64-w64-mingw32-gcc.exe    -o CMakeFiles/cmTC_a4e27.dir/CheckSymbolExists.c.obj   -c /C/msys64/home/vagrant/slave/monero-static-win64/build/build/release/CMakeFiles/CMakeTmp/CheckSymbolExists.c
C:/msys64/home/vagrant/slave/monero-static-win64/build/build/release/CMakeFiles/CMakeTmp/CheckSymbolExists.c: In function 'main':
C:/msys64/home/vagrant/slave/monero-static-win64/build/build/release/CMakeFiles/CMakeTmp/CheckSymbolExists.c:8:19: error: expected expression before 'pthread_spinlock_t'
   return ((int*)(&pthread_spinlock_t))[argc];
                   ^~~~~~~~~~~~~~~~~~
make[2]: *** [CMakeFiles/cmTC_a4e27.dir/build.make:66: CMakeFiles/cmTC_a4e27.dir/CheckSymbolExists.c.obj] Error 1
make[2]: Leaving directory '/home/vagrant/slave/monero-static-win64/build/build/release/CMakeFiles/CMakeTmp'
make[1]: *** [Makefile:121: cmTC_a4e27/fast] Error 2
make[1]: Leaving directory '/home/vagrant/slave/monero-static-win64/build/build/release/CMakeFiles/CMakeTmp'

File C:/msys64/home/vagrant/slave/monero-static-win64/build/build/release/CMakeFiles/CMakeTmp/CheckSymbolExists.c:
/* */
#include <pthread.h>

int main(int argc, char** argv)
{
  (void)argv;
#ifndef pthread_spinlock_t
  return ((int*)(&pthread_spinlock_t))[argc];
#else
  (void)argc;
  return 0;
#endif
}

Determining if the SSL_COMP_get_compression_methods exist failed with the following output:
Change Dir: C:/msys64/home/vagrant/slave/monero-static-win64/build/build/release/CMakeFiles/CMakeTmp

Run Build Command:"C:/msys64/usr/bin/make.exe" "cmTC_8034e/fast"
make[1]: Entering directory '/home/vagrant/slave/monero-static-win64/build/build/release/CMakeFiles/CMakeTmp'
/usr/bin/make -f CMakeFiles/cmTC_8034e.dir/build.make CMakeFiles/cmTC_8034e.dir/build
make[2]: Entering directory '/home/vagrant/slave/monero-static-win64/build/build/release/CMakeFiles/CMakeTmp'
Building C object CMakeFiles/cmTC_8034e.dir/CheckSymbolExists.c.obj

/C/msys64/mingw64/bin/x86_64-w64-mingw32-gcc.exe  -I/C/msys64/mingw64/include   -o CMakeFiles/cmTC_8034e.dir/CheckSymbolExists.c.obj   -c /C/msys64/home/vagrant/slave/monero-static-win64/build/build/release/CMakeFiles/CMakeTmp/CheckSymbolExists.c
Linking C executable cmTC_8034e.exe

/C/msys64/mingw64/bin/cmake.exe -E remove -f CMakeFiles/cmTC_8034e.dir/objects.a
ar cr CMakeFiles/cmTC_8034e.dir/objects.a "CMakeFiles/cmTC_8034e.dir/CheckSymbolExists.c.obj" 
/C/msys64/mingw64/bin/x86_64-w64-mingw32-gcc.exe      -Wl,--whole-archive CMakeFiles/cmTC_8034e.dir/objects.a -Wl,--no-whole-archive  -o cmTC_8034e.exe -Wl,--major-image-version,0,--minor-image-version,0 /C/msys64/mingw64/lib/libssl.a /C/msys64/mingw64/lib/libcrypto.a -lkernel32 -luser32 -lgdi32 -lwinspool -lshell32 -lole32 -loleaut32 -luuid -lcomdlg32 -ladvapi32 
C:/msys64/mingw64/lib/libcrypto.a(bss_sock.o):bss_sock.c:(.text+0x115): undefined reference to `__imp_shutdown'

C:/msys64/mingw64/lib/libcrypto.a(bss_sock.o):bss_sock.c:(.text+0x11f): undefined reference to `__imp_closesocket'

C:/msys64/mingw64/lib/libcrypto.a(bss_sock.o):bss_sock.c:(.text+0x19b): undefined reference to `__imp_shutdown'

C:/msys64/mingw64/lib/libcrypto.a(bss_sock.o):bss_sock.c:(.text+0x1a5): undefined reference to `__imp_closesocket'

C:/msys64/mingw64/lib/libcrypto.a(bss_sock.o):bss_sock.c:(.text+0x1c4): undefined reference to `__imp_WSASetLastError'

C:/msys64/mingw64/lib/libcrypto.a(bss_sock.o):bss_sock.c:(.text+0x1d7): undefined reference to `__imp_send'

C:/msys64/mingw64/lib/libcrypto.a(bss_sock.o):bss_sock.c:(.text+0x20a): undefined reference to `__imp_WSAGetLastError'

C:/msys64/mingw64/lib/libcrypto.a(bss_sock.o):bss_sock.c:(.text+0x27c): undefined reference to `__imp_WSASetLastError'

C:/msys64/mingw64/lib/libcrypto.a(bss_sock.o):bss_sock.c:(.text+0x28f): undefined reference to `__imp_recv'

C:/msys64/mingw64/lib/libcrypto.a(bss_sock.o):bss_sock.c:(.text+0x2bb): undefined reference to `__imp_WSAGetLastError'

C:/msys64/mingw64/lib/libcrypto.a(bss_sock.o):bss_sock.c:(.text+0x35f): undefined reference to `__imp_WSASetLastError'

C:/msys64/mingw64/lib/libcrypto.a(bss_sock.o):bss_sock.c:(.text+0x372): undefined reference to `__imp_send'

C:/msys64/mingw64/lib/libcrypto.a(bss_sock.o):bss_sock.c:(.text+0x3aa): undefined reference to `__imp_WSAGetLastError'

C:/msys64/mingw64/lib/libcrypto.a(bss_sock.o):bss_sock.c:(.text+0x465): undefined reference to `__imp_WSAGetLastError'

collect2.exe: error: ld returned 1 exit status
make[2]: *** [CMakeFiles/cmTC_8034e.dir/build.make:90: cmTC_8034e.exe] Error 1
make[2]: Leaving directory '/home/vagrant/slave/monero-static-win64/build/build/release/CMakeFiles/CMakeTmp'
make[1]: *** [Makefile:121: cmTC_8034e/fast] Error 2
make[1]: Leaving directory '/home/vagrant/slave/monero-static-win64/build/build/release/CMakeFiles/CMakeTmp'

File C:/msys64/home/vagrant/slave/monero-static-win64/build/build/release/CMakeFiles/CMakeTmp/CheckSymbolExists.c:
/* */
#include <openssl/ssl.h>

int main(int argc, char** argv)
{
  (void)argv;
#ifndef SSL_COMP_get_compression_methods
  return ((int*)(&SSL_COMP_get_compression_methods))[argc];
#else
  (void)argc;
  return 0;
#endif
}

Determining if the function EVP_MD_CTX_new exists failed with the following output:
Change Dir: C:/msys64/home/vagrant/slave/monero-static-win64/build/build/release/CMakeFiles/CMakeTmp

Run Build Command:"C:/msys64/usr/bin/make.exe" "cmTC_06d6c/fast"
make[1]: Entering directory '/home/vagrant/slave/monero-static-win64/build/build/release/CMakeFiles/CMakeTmp'
/usr/bin/make -f CMakeFiles/cmTC_06d6c.dir/build.make CMakeFiles/cmTC_06d6c.dir/build
make[2]: Entering directory '/home/vagrant/slave/monero-static-win64/build/build/release/CMakeFiles/CMakeTmp'
Building C object CMakeFiles/cmTC_06d6c.dir/CheckFunctionExists.c.obj

/C/msys64/mingw64/bin/x86_64-w64-mingw32-gcc.exe  -I/C/msys64/mingw64/include  -DCHECK_FUNCTION_EXISTS=EVP_MD_CTX_new   -o CMakeFiles/cmTC_06d6c.dir/CheckFunctionExists.c.obj   -c /C/msys64/mingw64/share/cmake-3.12/Modules/CheckFunctionExists.c
Linking C executable cmTC_06d6c.exe

/C/msys64/mingw64/bin/cmake.exe -E remove -f CMakeFiles/cmTC_06d6c.dir/objects.a
ar cr CMakeFiles/cmTC_06d6c.dir/objects.a "CMakeFiles/cmTC_06d6c.dir/CheckFunctionExists.c.obj" 
/C/msys64/mingw64/bin/x86_64-w64-mingw32-gcc.exe  -DCHECK_FUNCTION_EXISTS=EVP_MD_CTX_new    -Wl,--whole-archive CMakeFiles/cmTC_06d6c.dir/objects.a -Wl,--no-whole-archive  -o cmTC_06d6c.exe -Wl,--major-image-version,0,--minor-image-version,0 /C/msys64/mingw64/lib/libssl.a /C/msys64/mingw64/lib/libcrypto.a -lkernel32 -luser32 -lgdi32 -lwinspool -lshell32 -lole32 -loleaut32 -luuid -lcomdlg32 -ladvapi32 
CMakeFiles/cmTC_06d6c.dir/objects.a(CheckFunctionExists.c.obj):CheckFunctionExists.c:(.text+0x15): undefined reference to `EVP_MD_CTX_new'

collect2.exe: error: ld returned 1 exit status
make[2]: *** [CMakeFiles/cmTC_06d6c.dir/build.make:90: cmTC_06d6c.exe] Error 1
make[2]: Leaving directory '/home/vagrant/slave/monero-static-win64/build/build/release/CMakeFiles/CMakeTmp'
make[1]: *** [Makefile:121: cmTC_06d6c/fast] Error 2
make[1]: Leaving directory '/home/vagrant/slave/monero-static-win64/build/build/release/CMakeFiles/CMakeTmp'


Determining if the function OPENSSL_config exists failed with the following output:
Change Dir: C:/msys64/home/vagrant/slave/monero-static-win64/build/build/release/CMakeFiles/CMakeTmp

Run Build Command:"C:/msys64/usr/bin/make.exe" "cmTC_3ef84/fast"
make[1]: Entering directory '/home/vagrant/slave/monero-static-win64/build/build/release/CMakeFiles/CMakeTmp'
/usr/bin/make -f CMakeFiles/cmTC_3ef84.dir/build.make CMakeFiles/cmTC_3ef84.dir/build
make[2]: Entering directory '/home/vagrant/slave/monero-static-win64/build/build/release/CMakeFiles/CMakeTmp'
Building C object CMakeFiles/cmTC_3ef84.dir/CheckFunctionExists.c.obj

/C/msys64/mingw64/bin/x86_64-w64-mingw32-gcc.exe  -I/C/msys64/mingw64/include  -DCHECK_FUNCTION_EXISTS=OPENSSL_config   -o CMakeFiles/cmTC_3ef84.dir/CheckFunctionExists.c.obj   -c /C/msys64/mingw64/share/cmake-3.12/Modules/CheckFunctionExists.c
Linking C executable cmTC_3ef84.exe

/C/msys64/mingw64/bin/cmake.exe -E remove -f CMakeFiles/cmTC_3ef84.dir/objects.a
ar cr CMakeFiles/cmTC_3ef84.dir/objects.a "CMakeFiles/cmTC_3ef84.dir/CheckFunctionExists.c.obj" 
/C/msys64/mingw64/bin/x86_64-w64-mingw32-gcc.exe  -DCHECK_FUNCTION_EXISTS=OPENSSL_config    -Wl,--whole-archive CMakeFiles/cmTC_3ef84.dir/objects.a -Wl,--no-whole-archive  -o cmTC_3ef84.exe -Wl,--major-image-version,0,--minor-image-version,0 /C/msys64/mingw64/lib/libssl.a /C/msys64/mingw64/lib/libcrypto.a -lkernel32 -luser32 -lgdi32 -lwinspool -lshell32 -lole32 -loleaut32 -luuid -lcomdlg32 -ladvapi32 
C:/msys64/mingw64/lib/libcrypto.a(e_capi.o):e_capi.c:(.text+0x19c): undefined reference to `__imp_CertFreeCertificateContext'

C:/msys64/mingw64/lib/libcrypto.a(e_capi.o):e_capi.c:(.text+0x20c): undefined reference to `__imp_CertFreeCertificateContext'

C:/msys64/mingw64/lib/libcrypto.a(e_capi.o):e_capi.c:(.text+0x433): undefined reference to `__imp_CertGetCertificateContextProperty'

C:/msys64/mingw64/lib/libcrypto.a(e_capi.o):e_capi.c:(.text+0x265e): undefined reference to `__imp_CertGetCertificateContextProperty'

C:/msys64/mingw64/lib/libcrypto.a(e_capi.o):e_capi.c:(.text+0x27c1): undefined reference to `__imp_CertGetCertificateContextProperty'

C:/msys64/mingw64/lib/libcrypto.a(e_capi.o):e_capi.c:(.text+0x2927): undefined reference to `__imp_CertEnumCertificatesInStore'

C:/msys64/mingw64/lib/libcrypto.a(e_capi.o):e_capi.c:(.text+0x29a6): undefined reference to `__imp_CertFindCertificateInStore'

C:/msys64/mingw64/lib/libcrypto.a(e_capi.o):e_capi.c:(.text+0x2c38): undefined reference to `__imp_CertOpenStore'

C:/msys64/mingw64/lib/libcrypto.a(e_capi.o):e_capi.c:(.text+0x2d78): undefined reference to `__imp_CertEnumCertificatesInStore'

C:/msys64/mingw64/lib/libcrypto.a(e_capi.o):e_capi.c:(.text+0x2e2d): undefined reference to `__imp_CertGetCertificateContextProperty'

C:/msys64/mingw64/lib/libcrypto.a(e_capi.o):e_capi.c:(.text+0x2e67): undefined reference to `__imp_CertGetCertificateContextProperty'

C:/msys64/mingw64/lib/libcrypto.a(e_capi.o):e_capi.c:(.text+0x2ea8): undefined reference to `__imp_CertDuplicateCertificateContext'

C:/msys64/mingw64/lib/libcrypto.a(e_capi.o):e_capi.c:(.text+0x2f07): undefined reference to `__imp_CertCloseStore'

C:/msys64/mingw64/lib/libcrypto.a(e_capi.o):e_capi.c:(.text+0x2f44): undefined reference to `__imp_CertFreeCertificateContext'

C:/msys64/mingw64/lib/libcrypto.a(e_capi.o):e_capi.c:(.text+0x315f): undefined reference to `__imp_CertOpenStore'

C:/msys64/mingw64/lib/libcrypto.a(e_capi.o):e_capi.c:(.text+0x31a4): undefined reference to `__imp_CertFreeCertificateContext'

C:/msys64/mingw64/lib/libcrypto.a(e_capi.o):e_capi.c:(.text+0x31af): undefined reference to `__imp_CertCloseStore'

C:/msys64/mingw64/lib/libcrypto.a(e_capi.o):e_capi.c:(.text+0x31c9): undefined reference to `__imp_CertEnumCertificatesInStore'

C:/msys64/mingw64/lib/libcrypto.a(e_capi.o):e_capi.c:(.text+0x37a6): undefined reference to `__imp_CertOpenStore'

C:/msys64/mingw64/lib/libcrypto.a(e_capi.o):e_capi.c:(.text+0x3806): undefined reference to `__imp_CertFreeCertificateContext'

C:/msys64/mingw64/lib/libcrypto.a(e_capi.o):e_capi.c:(.text+0x3811): undefined reference to `__imp_CertCloseStore'

C:/msys64/mingw64/lib/libcrypto.a(e_capi.o):e_capi.c:(.text+0x3930): undefined reference to `__imp_CertFreeCertificateContext'

C:/msys64/mingw64/lib/libcrypto.a(e_capi.o):e_capi.c:(.text+0x39bd): undefined reference to `__imp_CertFreeCertificateContext'

collect2.exe: error: ld returned 1 exit status
make[2]: *** [CMakeFiles/cmTC_3ef84.dir/build.make:90: cmTC_3ef84.exe] Error 1
make[2]: Leaving directory '/home/vagrant/slave/monero-static-win64/build/build/release/CMakeFiles/CMakeTmp'
make[1]: *** [Makefile:121: cmTC_3ef84/fast] Error 2
make[1]: Leaving directory '/home/vagrant/slave/monero-static-win64/build/build/release/CMakeFiles/CMakeTmp'


Determining if the LIBRESSL_VERSION_TEXT exist failed with the following output:
Change Dir: C:/msys64/home/vagrant/slave/monero-static-win64/build/build/release/CMakeFiles/CMakeTmp

Run Build Command:"C:/msys64/usr/bin/make.exe" "cmTC_5a5ed/fast"
make[1]: Entering directory '/home/vagrant/slave/monero-static-win64/build/build/release/CMakeFiles/CMakeTmp'
/usr/bin/make -f CMakeFiles/cmTC_5a5ed.dir/build.make CMakeFiles/cmTC_5a5ed.dir/build
make[2]: Entering directory '/home/vagrant/slave/monero-static-win64/build/build/release/CMakeFiles/CMakeTmp'
Building C object CMakeFiles/cmTC_5a5ed.dir/CheckSymbolExists.c.obj

/C/msys64/mingw64/bin/x86_64-w64-mingw32-gcc.exe    -o CMakeFiles/cmTC_5a5ed.dir/CheckSymbolExists.c.obj   -c /C/msys64/home/vagrant/slave/monero-static-win64/build/build/release/CMakeFiles/CMakeTmp/CheckSymbolExists.c
C:/msys64/home/vagrant/slave/monero-static-win64/build/build/release/CMakeFiles/CMakeTmp/CheckSymbolExists.c: In function 'main':
C:/msys64/home/vagrant/slave/monero-static-win64/build/build/release/CMakeFiles/CMakeTmp/CheckSymbolExists.c:8:19: error: 'LIBRESSL_VERSION_TEXT' undeclared (first use in this function); did you mean 'OPENSSL_VERSION_TEXT'?
   return ((int*)(&LIBRESSL_VERSION_TEXT))[argc];
                   ^~~~~~~~~~~~~~~~~~~~~
                   OPENSSL_VERSION_TEXT
C:/msys64/home/vagrant/slave/monero-static-win64/build/build/release/CMakeFiles/CMakeTmp/CheckSymbolExists.c:8:19: note: each undeclared identifier is reported only once for each function it appears in
make[2]: *** [CMakeFiles/cmTC_5a5ed.dir/build.make:66: CMakeFiles/cmTC_5a5ed.dir/CheckSymbolExists.c.obj] Error 1
make[2]: Leaving directory '/home/vagrant/slave/monero-static-win64/build/build/release/CMakeFiles/CMakeTmp'
make[1]: *** [Makefile:121: cmTC_5a5ed/fast] Error 2
make[1]: Leaving directory '/home/vagrant/slave/monero-static-win64/build/build/release/CMakeFiles/CMakeTmp'

File C:/msys64/home/vagrant/slave/monero-static-win64/build/build/release/CMakeFiles/CMakeTmp/CheckSymbolExists.c:
/* */
#include <openssl/opensslv.h>

int main(int argc, char** argv)
{
  (void)argv;
#ifndef LIBRESSL_VERSION_TEXT
  return ((int*)(&LIBRESSL_VERSION_TEXT))[argc];
#else
  (void)argc;
  return 0;
#endif
}

Determining if the backtrace exist failed with the following output:
Change Dir: C:/msys64/home/vagrant/slave/monero-static-win64/build/build/release/CMakeFiles/CMakeTmp

Run Build Command:"C:/msys64/usr/bin/make.exe" "cmTC_fede0/fast"
make[1]: Entering directory '/home/vagrant/slave/monero-static-win64/build/build/release/CMakeFiles/CMakeTmp'
/usr/bin/make -f CMakeFiles/cmTC_fede0.dir/build.make CMakeFiles/cmTC_fede0.dir/build
make[2]: Entering directory '/home/vagrant/slave/monero-static-win64/build/build/release/CMakeFiles/CMakeTmp'
Building C object CMakeFiles/cmTC_fede0.dir/CheckSymbolExists.c.obj

/C/msys64/mingw64/bin/x86_64-w64-mingw32-gcc.exe    -o CMakeFiles/cmTC_fede0.dir/CheckSymbolExists.c.obj   -c /C/msys64/home/vagrant/slave/monero-static-win64/build/build/release/CMakeFiles/CMakeTmp/CheckSymbolExists.c
C:/msys64/home/vagrant/slave/monero-static-win64/build/build/release/CMakeFiles/CMakeTmp/CheckSymbolExists.c:2:10: fatal error: execinfo.h: No such file or directory
 #include <execinfo.h>
          ^~~~~~~~~~~~
compilation terminated.

make[2]: *** [CMakeFiles/cmTC_fede0.dir/build.make:66: CMakeFiles/cmTC_fede0.dir/CheckSymbolExists.c.obj] Error 1
make[2]: Leaving directory '/home/vagrant/slave/monero-static-win64/build/build/release/CMakeFiles/CMakeTmp'
make[1]: *** [Makefile:121: cmTC_fede0/fast] Error 2
make[1]: Leaving directory '/home/vagrant/slave/monero-static-win64/build/build/release/CMakeFiles/CMakeTmp'

File C:/msys64/home/vagrant/slave/monero-static-win64/build/build/release/CMakeFiles/CMakeTmp/CheckSymbolExists.c:
/* */
#include <execinfo.h>

int main(int argc, char** argv)
{
  (void)argv;
#ifndef backtrace
  return ((int*)(&backtrace))[argc];
#else
  (void)argc;
  return 0;
#endif
}

Determining if the -Wl,-z,relro linker flag is supported failed with the following output:
Change Dir: C:/msys64/home/vagrant/slave/monero-static-win64/build/build/release/CMakeFiles/CMakeTmp

Run Build Command:"C:/msys64/usr/bin/make.exe" "cmTC_4a677/fast"
make[1]: Entering directory '/home/vagrant/slave/monero-static-win64/build/build/release/CMakeFiles/CMakeTmp'
/usr/bin/make -f CMakeFiles/cmTC_4a677.dir/build.make CMakeFiles/cmTC_4a677.dir/build
make[2]: Entering directory '/home/vagrant/slave/monero-static-win64/build/build/release/CMakeFiles/CMakeTmp'
Building C object CMakeFiles/cmTC_4a677.dir/CheckLinkerFlag.c.obj

/C/msys64/mingw64/bin/x86_64-w64-mingw32-gcc.exe   -Wl,-z,relro    -Wl,-z,relro -o CMakeFiles/cmTC_4a677.dir/CheckLinkerFlag.c.obj   -c /C/msys64/home/vagrant/slave/monero-static-win64/build/cmake/CheckLinkerFlag.c
Linking C executable cmTC_4a677.exe

/C/msys64/mingw64/bin/cmake.exe -E remove -f CMakeFiles/cmTC_4a677.dir/objects.a
ar cr CMakeFiles/cmTC_4a677.dir/objects.a "CMakeFiles/cmTC_4a677.dir/CheckLinkerFlag.c.obj" 
/C/msys64/mingw64/bin/x86_64-w64-mingw32-gcc.exe -Wl,-z,relro     -Wl,--whole-archive CMakeFiles/cmTC_4a677.dir/objects.a -Wl,--no-whole-archive  -o cmTC_4a677.exe -Wl,--major-image-version,0,--minor-image-version,0 -lkernel32 -luser32 -lgdi32 -lwinspool -lshell32 -lole32 -loleaut32 -luuid -lcomdlg32 -ladvapi32 
C:/msys64/mingw64/bin/../lib/gcc/x86_64-w64-mingw32/8.2.1/../../../../x86_64-w64-mingw32/bin/ld.exe: unrecognized option '-z'

C:/msys64/mingw64/bin/../lib/gcc/x86_64-w64-mingw32/8.2.1/../../../../x86_64-w64-mingw32/bin/ld.exe: use the --help option for usage information

collect2.exe: error: ld returned 1 exit status
make[2]: *** [CMakeFiles/cmTC_4a677.dir/build.make:88: cmTC_4a677.exe] Error 1
make[2]: Leaving directory '/home/vagrant/slave/monero-static-win64/build/build/release/CMakeFiles/CMakeTmp'
make[1]: *** [Makefile:121: cmTC_4a677/fast] Error 2
make[1]: Leaving directory '/home/vagrant/slave/monero-static-win64/build/build/release/CMakeFiles/CMakeTmp'


Determining if the -Wl,-z,now linker flag is supported failed with the following output:
Change Dir: C:/msys64/home/vagrant/slave/monero-static-win64/build/build/release/CMakeFiles/CMakeTmp

Run Build Command:"C:/msys64/usr/bin/make.exe" "cmTC_80041/fast"
make[1]: Entering directory '/home/vagrant/slave/monero-static-win64/build/build/release/CMakeFiles/CMakeTmp'
/usr/bin/make -f CMakeFiles/cmTC_80041.dir/build.make CMakeFiles/cmTC_80041.dir/build
make[2]: Entering directory '/home/vagrant/slave/monero-static-win64/build/build/release/CMakeFiles/CMakeTmp'
Building C object CMakeFiles/cmTC_80041.dir/CheckLinkerFlag.c.obj

/C/msys64/mingw64/bin/x86_64-w64-mingw32-gcc.exe   -Wl,-z,now    -Wl,-z,now -o CMakeFiles/cmTC_80041.dir/CheckLinkerFlag.c.obj   -c /C/msys64/home/vagrant/slave/monero-static-win64/build/cmake/CheckLinkerFlag.c
Linking C executable cmTC_80041.exe

/C/msys64/mingw64/bin/cmake.exe -E remove -f CMakeFiles/cmTC_80041.dir/objects.a
ar cr CMakeFiles/cmTC_80041.dir/objects.a "CMakeFiles/cmTC_80041.dir/CheckLinkerFlag.c.obj" 
/C/msys64/mingw64/bin/x86_64-w64-mingw32-gcc.exe -Wl,-z,now     -Wl,--whole-archive CMakeFiles/cmTC_80041.dir/objects.a -Wl,--no-whole-archive  -o cmTC_80041.exe -Wl,--major-image-version,0,--minor-image-version,0 -lkernel32 -luser32 -lgdi32 -lwinspool -lshell32 -lole32 -loleaut32 -luuid -lcomdlg32 -ladvapi32 
C:/msys64/mingw64/bin/../lib/gcc/x86_64-w64-mingw32/8.2.1/../../../../x86_64-w64-mingw32/bin/ld.exe: unrecognized option '-z'

C:/msys64/mingw64/bin/../lib/gcc/x86_64-w64-mingw32/8.2.1/../../../../x86_64-w64-mingw32/bin/ld.exe: use the --help option for usage information

collect2.exe: error: ld returned 1 exit status
make[2]: *** [CMakeFiles/cmTC_80041.dir/build.make:88: cmTC_80041.exe] Error 1
make[2]: Leaving directory '/home/vagrant/slave/monero-static-win64/build/build/release/CMakeFiles/CMakeTmp'
make[1]: *** [Makefile:121: cmTC_80041/fast] Error 2
make[1]: Leaving directory '/home/vagrant/slave/monero-static-win64/build/build/release/CMakeFiles/CMakeTmp'


Determining if the -Wl,-z,noexecstack linker flag is supported failed with the following output:
Change Dir: C:/msys64/home/vagrant/slave/monero-static-win64/build/build/release/CMakeFiles/CMakeTmp

Run Build Command:"C:/msys64/usr/bin/make.exe" "cmTC_07acc/fast"
make[1]: Entering directory '/home/vagrant/slave/monero-static-win64/build/build/release/CMakeFiles/CMakeTmp'
/usr/bin/make -f CMakeFiles/cmTC_07acc.dir/build.make CMakeFiles/cmTC_07acc.dir/build
make[2]: Entering directory '/home/vagrant/slave/monero-static-win64/build/build/release/CMakeFiles/CMakeTmp'
Building C object CMakeFiles/cmTC_07acc.dir/CheckLinkerFlag.c.obj

/C/msys64/mingw64/bin/x86_64-w64-mingw32-gcc.exe   -Wl,-z,noexecstack    -Wl,-z,noexecstack -o CMakeFiles/cmTC_07acc.dir/CheckLinkerFlag.c.obj   -c /C/msys64/home/vagrant/slave/monero-static-win64/build/cmake/CheckLinkerFlag.c
Linking C executable cmTC_07acc.exe

/C/msys64/mingw64/bin/cmake.exe -E remove -f CMakeFiles/cmTC_07acc.dir/objects.a
ar cr CMakeFiles/cmTC_07acc.dir/objects.a "CMakeFiles/cmTC_07acc.dir/CheckLinkerFlag.c.obj" 
/C/msys64/mingw64/bin/x86_64-w64-mingw32-gcc.exe -Wl,-z,noexecstack     -Wl,--whole-archive CMakeFiles/cmTC_07acc.dir/objects.a -Wl,--no-whole-archive  -o cmTC_07acc.exe -Wl,--major-image-version,0,--minor-image-version,0 -lkernel32 -luser32 -lgdi32 -lwinspool -lshell32 -lole32 -loleaut32 -luuid -lcomdlg32 -ladvapi32 
C:/msys64/mingw64/bin/../lib/gcc/x86_64-w64-mingw32/8.2.1/../../../../x86_64-w64-mingw32/bin/ld.exe: unrecognized option '-z'

C:/msys64/mingw64/bin/../lib/gcc/x86_64-w64-mingw32/8.2.1/../../../../x86_64-w64-mingw32/bin/ld.exe: use the --help option for usage information

collect2.exe: error: ld returned 1 exit status
make[2]: *** [CMakeFiles/cmTC_07acc.dir/build.make:88: cmTC_07acc.exe] Error 1
make[2]: Leaving directory '/home/vagrant/slave/monero-static-win64/build/build/release/CMakeFiles/CMakeTmp'
make[1]: *** [Makefile:121: cmTC_07acc/fast] Error 2
make[1]: Leaving directory '/home/vagrant/slave/monero-static-win64/build/build/release/CMakeFiles/CMakeTmp'


Determining if the -Wl,-z,noexecheap linker flag is supported failed with the following output:
Change Dir: C:/msys64/home/vagrant/slave/monero-static-win64/build/build/release/CMakeFiles/CMakeTmp

Run Build Command:"C:/msys64/usr/bin/make.exe" "cmTC_06c2b/fast"
make[1]: Entering directory '/home/vagrant/slave/monero-static-win64/build/build/release/CMakeFiles/CMakeTmp'
/usr/bin/make -f CMakeFiles/cmTC_06c2b.dir/build.make CMakeFiles/cmTC_06c2b.dir/build
make[2]: Entering directory '/home/vagrant/slave/monero-static-win64/build/build/release/CMakeFiles/CMakeTmp'
Building C object CMakeFiles/cmTC_06c2b.dir/CheckLinkerFlag.c.obj

/C/msys64/mingw64/bin/x86_64-w64-mingw32-gcc.exe   -Wl,-z,noexecheap    -Wl,-z,noexecheap -o CMakeFiles/cmTC_06c2b.dir/CheckLinkerFlag.c.obj   -c /C/msys64/home/vagrant/slave/monero-static-win64/build/cmake/CheckLinkerFlag.c
Linking C executable cmTC_06c2b.exe

/C/msys64/mingw64/bin/cmake.exe -E remove -f CMakeFiles/cmTC_06c2b.dir/objects.a
ar cr CMakeFiles/cmTC_06c2b.dir/objects.a "CMakeFiles/cmTC_06c2b.dir/CheckLinkerFlag.c.obj" 
/C/msys64/mingw64/bin/x86_64-w64-mingw32-gcc.exe -Wl,-z,noexecheap     -Wl,--whole-archive CMakeFiles/cmTC_06c2b.dir/objects.a -Wl,--no-whole-archive  -o cmTC_06c2b.exe -Wl,--major-image-version,0,--minor-image-version,0 -lkernel32 -luser32 -lgdi32 -lwinspool -lshell32 -lole32 -loleaut32 -luuid -lcomdlg32 -ladvapi32 
C:/msys64/mingw64/bin/../lib/gcc/x86_64-w64-mingw32/8.2.1/../../../../x86_64-w64-mingw32/bin/ld.exe: unrecognized option '-z'

C:/msys64/mingw64/bin/../lib/gcc/x86_64-w64-mingw32/8.2.1/../../../../x86_64-w64-mingw32/bin/ld.exe: use the --help option for usage information

collect2.exe: error: ld returned 1 exit status
make[2]: *** [CMakeFiles/cmTC_06c2b.dir/build.make:88: cmTC_06c2b.exe] Error 1
make[2]: Leaving directory '/home/vagrant/slave/monero-static-win64/build/build/release/CMakeFiles/CMakeTmp'
make[1]: *** [Makefile:121: cmTC_06c2b/fast] Error 2
make[1]: Leaving directory '/home/vagrant/slave/monero-static-win64/build/build/release/CMakeFiles/CMakeTmp'


Determining if the function rl_copy_text exists failed with the following output:
Change Dir: C:/msys64/home/vagrant/slave/monero-static-win64/build/build/release/CMakeFiles/CMakeTmp

Run Build Command:"C:/msys64/usr/bin/make.exe" "cmTC_08ee4/fast"
make[1]: Entering directory '/home/vagrant/slave/monero-static-win64/build/build/release/CMakeFiles/CMakeTmp'
/usr/bin/make -f CMakeFiles/cmTC_08ee4.dir/build.make CMakeFiles/cmTC_08ee4.dir/build
make[2]: Entering directory '/home/vagrant/slave/monero-static-win64/build/build/release/CMakeFiles/CMakeTmp'
Building C object CMakeFiles/cmTC_08ee4.dir/CheckFunctionExists.c.obj

/C/msys64/mingw64/bin/x86_64-w64-mingw32-gcc.exe   -maes -march=x86-64 -fno-strict-aliasing -std=c11 -D_GNU_SOURCE -m64 -DWIN32_LEAN_AND_MEAN  -Wall -Wextra -Wpointer-arith -Wundef -Wvla -Wwrite-strings -Wno-error=extra -Wno-error=deprecated-declarations -Wno-unused-parameter -Wno-unused-variable -Wno-error=unused-variable -Wno-error=undef -Wno-error=uninitialized -Wlogical-op -Wno-error=maybe-uninitialized -Wno-error=cpp -Wno-error=unused-value -Wno-error=unused-but-set-variable -Waggregate-return -Wnested-externs -Wold-style-definition -Wstrict-prototypes  -fPIC  -U_FORTIFY_SOURCE -D_FORTIFY_SOURCE=1 -Wformat -Wformat-security -mmitigate-rop -fno-strict-aliasing -DCHECK_FUNCTION_EXISTS=rl_copy_text   -o CMakeFiles/cmTC_08ee4.dir/CheckFunctionExists.c.obj   -c /C/msys64/mingw64/share/cmake-3.12/Modules/CheckFunctionExists.c
Linking C executable cmTC_08ee4.exe

/C/msys64/mingw64/bin/cmake.exe -E remove -f CMakeFiles/cmTC_08ee4.dir/objects.a
ar cr CMakeFiles/cmTC_08ee4.dir/objects.a "CMakeFiles/cmTC_08ee4.dir/CheckFunctionExists.c.obj" 
/C/msys64/mingw64/bin/x86_64-w64-mingw32-gcc.exe  -maes -march=x86-64 -fno-strict-aliasing -std=c11 -D_GNU_SOURCE -m64 -DWIN32_LEAN_AND_MEAN  -Wall -Wextra -Wpointer-arith -Wundef -Wvla -Wwrite-strings -Wno-error=extra -Wno-error=deprecated-declarations -Wno-unused-parameter -Wno-unused-variable -Wno-error=unused-variable -Wno-error=undef -Wno-error=uninitialized -Wlogical-op -Wno-error=maybe-uninitialized -Wno-error=cpp -Wno-error=unused-value -Wno-error=unused-but-set-variable -Waggregate-return -Wnested-externs -Wold-style-definition -Wstrict-prototypes  -fPIC  -U_FORTIFY_SOURCE -D_FORTIFY_SOURCE=1 -Wformat -Wformat-security -mmitigate-rop -fno-strict-aliasing -DCHECK_FUNCTION_EXISTS=rl_copy_text    -Wl,--whole-archive CMakeFiles/cmTC_08ee4.dir/objects.a -Wl,--no-whole-archive  -o cmTC_08ee4.exe -Wl,--major-image-version,0,--minor-image-version,0 /C/msys64/mingw64/lib/libreadline.a -lkernel32 -luser32 -lgdi32 -lwinspool -lshell32 -lole32 -loleaut32 -luuid -lcomdlg32 -ladvapi32 
C:/msys64/mingw64/lib/libreadline.a(terminal.o):(.text+0x186): undefined reference to `tgetnum'

C:/msys64/mingw64/lib/libreadline.a(terminal.o):(.text+0x2c9): undefined reference to `tgetnum'

C:/msys64/mingw64/lib/libreadline.a(terminal.o):(.text+0x779): undefined reference to `tgetent'

C:/msys64/mingw64/lib/libreadline.a(terminal.o):(.text+0x7bf): undefined reference to `tgetstr'

C:/msys64/mingw64/lib/libreadline.a(terminal.o):(.text+0x81e): undefined reference to `tgetflag'

C:/msys64/mingw64/lib/libreadline.a(terminal.o):(.text+0x86d): undefined reference to `tgetflag'

C:/msys64/mingw64/lib/libreadline.a(terminal.o):(.text+0x988): undefined reference to `tgetflag'

C:/msys64/mingw64/lib/libreadline.a(terminal.o):(.text+0xb87): undefined reference to `tputs'

C:/msys64/mingw64/lib/libreadline.a(terminal.o):(.text+0xc6d): undefined reference to `tputs'

C:/msys64/mingw64/lib/libreadline.a(terminal.o):(.text+0xcb7): undefined reference to `tputs'

C:/msys64/mingw64/lib/libreadline.a(terminal.o):(.text+0xd0d): undefined reference to `tputs'

C:/msys64/mingw64/lib/libreadline.a(terminal.o):(.text+0xd3d): undefined reference to `tputs'

C:/msys64/mingw64/lib/libreadline.a(terminal.o):(.text+0xd80): more undefined references to `tputs' follow

collect2.exe: error: ld returned 1 exit status
make[2]: *** [CMakeFiles/cmTC_08ee4.dir/build.make:89: cmTC_08ee4.exe] Error 1
make[2]: Leaving directory '/home/vagrant/slave/monero-static-win64/build/build/release/CMakeFiles/CMakeTmp'
make[1]: *** [Makefile:121: cmTC_08ee4/fast] Error 2
make[1]: Leaving directory '/home/vagrant/slave/monero-static-win64/build/build/release/CMakeFiles/CMakeTmp'


Determining if the function rl_filename_completion_function exists failed with the following output:
Change Dir: C:/msys64/home/vagrant/slave/monero-static-win64/build/build/release/CMakeFiles/CMakeTmp

Run Build Command:"C:/msys64/usr/bin/make.exe" "cmTC_2483c/fast"
make[1]: Entering directory '/home/vagrant/slave/monero-static-win64/build/build/release/CMakeFiles/CMakeTmp'
/usr/bin/make -f CMakeFiles/cmTC_2483c.dir/build.make CMakeFiles/cmTC_2483c.dir/build
make[2]: Entering directory '/home/vagrant/slave/monero-static-win64/build/build/release/CMakeFiles/CMakeTmp'
Building C object CMakeFiles/cmTC_2483c.dir/CheckFunctionExists.c.obj

/C/msys64/mingw64/bin/x86_64-w64-mingw32-gcc.exe   -maes -march=x86-64 -fno-strict-aliasing -std=c11 -D_GNU_SOURCE -m64 -DWIN32_LEAN_AND_MEAN  -Wall -Wextra -Wpointer-arith -Wundef -Wvla -Wwrite-strings -Wno-error=extra -Wno-error=deprecated-declarations -Wno-unused-parameter -Wno-unused-variable -Wno-error=unused-variable -Wno-error=undef -Wno-error=uninitialized -Wlogical-op -Wno-error=maybe-uninitialized -Wno-error=cpp -Wno-error=unused-value -Wno-error=unused-but-set-variable -Waggregate-return -Wnested-externs -Wold-style-definition -Wstrict-prototypes  -fPIC  -U_FORTIFY_SOURCE -D_FORTIFY_SOURCE=1 -Wformat -Wformat-security -mmitigate-rop -fno-strict-aliasing -DCHECK_FUNCTION_EXISTS=rl_filename_completion_function   -o CMakeFiles/cmTC_2483c.dir/CheckFunctionExists.c.obj   -c /C/msys64/mingw64/share/cmake-3.12/Modules/CheckFunctionExists.c
Linking C executable cmTC_2483c.exe

/C/msys64/mingw64/bin/cmake.exe -E remove -f CMakeFiles/cmTC_2483c.dir/objects.a
ar cr CMakeFiles/cmTC_2483c.dir/objects.a "CMakeFiles/cmTC_2483c.dir/CheckFunctionExists.c.obj" 
/C/msys64/mingw64/bin/x86_64-w64-mingw32-gcc.exe  -maes -march=x86-64 -fno-strict-aliasing -std=c11 -D_GNU_SOURCE -m64 -DWIN32_LEAN_AND_MEAN  -Wall -Wextra -Wpointer-arith -Wundef -Wvla -Wwrite-strings -Wno-error=extra -Wno-error=deprecated-declarations -Wno-unused-parameter -Wno-unused-variable -Wno-error=unused-variable -Wno-error=undef -Wno-error=uninitialized -Wlogical-op -Wno-error=maybe-uninitialized -Wno-error=cpp -Wno-error=unused-value -Wno-error=unused-but-set-variable -Waggregate-return -Wnested-externs -Wold-style-definition -Wstrict-prototypes  -fPIC  -U_FORTIFY_SOURCE -D_FORTIFY_SOURCE=1 -Wformat -Wformat-security -mmitigate-rop -fno-strict-aliasing -DCHECK_FUNCTION_EXISTS=rl_filename_completion_function    -Wl,--whole-archive CMakeFiles/cmTC_2483c.dir/objects.a -Wl,--no-whole-archive  -o cmTC_2483c.exe -Wl,--major-image-version,0,--minor-image-version,0 /C/msys64/mingw64/lib/libreadline.a -lkernel32 -luser32 -lgdi32 -lwinspool -lshell32 -lole32 -loleaut32 -luuid -lcomdlg32 -ladvapi32 
C:/msys64/mingw64/lib/libreadline.a(display.o):(.text+0xa6c): undefined reference to `tputs'

C:/msys64/mingw64/lib/libreadline.a(display.o):(.text+0xb8e): undefined reference to `tputs'

C:/msys64/mingw64/lib/libreadline.a(display.o):(.text+0xbe2): undefined reference to `tputs'

C:/msys64/mingw64/lib/libreadline.a(display.o):(.text+0x19a5): undefined reference to `tputs'

C:/msys64/mingw64/lib/libreadline.a(display.o):(.text+0x2b47): undefined reference to `tputs'

C:/msys64/mingw64/lib/libreadline.a(display.o):(.text+0x2c4e): more undefined references to `tputs' follow

C:/msys64/mingw64/lib/libreadline.a(terminal.o):(.text+0x186): undefined reference to `tgetnum'

C:/msys64/mingw64/lib/libreadline.a(terminal.o):(.text+0x2c9): undefined reference to `tgetnum'

C:/msys64/mingw64/lib/libreadline.a(terminal.o):(.text+0x779): undefined reference to `tgetent'

C:/msys64/mingw64/lib/libreadline.a(terminal.o):(.text+0x7bf): undefined reference to `tgetstr'

C:/msys64/mingw64/lib/libreadline.a(terminal.o):(.text+0x81e): undefined reference to `tgetflag'

C:/msys64/mingw64/lib/libreadline.a(terminal.o):(.text+0x86d): undefined reference to `tgetflag'

C:/msys64/mingw64/lib/libreadline.a(terminal.o):(.text+0x988): undefined reference to `tgetflag'

C:/msys64/mingw64/lib/libreadline.a(terminal.o):(.text+0xb87): undefined reference to `tputs'

C:/msys64/mingw64/lib/libreadline.a(terminal.o):(.text+0xc6d): undefined reference to `tputs'

C:/msys64/mingw64/lib/libreadline.a(terminal.o):(.text+0xcb7): undefined reference to `tputs'

C:/msys64/mingw64/lib/libreadline.a(terminal.o):(.text+0xd0d): undefined reference to `tputs'

C:/msys64/mingw64/lib/libreadline.a(terminal.o):(.text+0xd3d): undefined reference to `tputs'

C:/msys64/mingw64/lib/libreadline.a(terminal.o):(.text+0xd80): more undefined references to `tputs' follow

collect2.exe: error: ld returned 1 exit status
make[2]: *** [CMakeFiles/cmTC_2483c.dir/build.make:89: cmTC_2483c.exe] Error 1
make[2]: Leaving directory '/home/vagrant/slave/monero-static-win64/build/build/release/CMakeFiles/CMakeTmp'
make[1]: *** [Makefile:121: cmTC_2483c/fast] Error 2
make[1]: Leaving directory '/home/vagrant/slave/monero-static-win64/build/build/release/CMakeFiles/CMakeTmp'