(view as text)
make release-test
 in dir C:/msys64/home/vagrant/slave\monero-static-win64\build (timeout 1200 secs)
 watching logfiles {'LastTest': 'build/release/Testing/Temporary/LastTest.log', 'CTestCostData.txt': 'build/release/Testing/Temporary/CTestCostData.txt'}
 argv: ['make', 'release-test']
 environment:
  ALLUSERSPROFILE=C:\ProgramData
  APPDATA=C:\WINDOWS\system32\config\systemprofile\AppData\Roaming
  ARGS= -E 'core_tests|libwallet_api_tests' 
  CHOCOLATEYINSTALL=C:\ProgramData\chocolatey
  COMMONPROGRAMFILES=C:\Program Files\Common Files
  COMMONPROGRAMFILES(X86)=C:\Program Files (x86)\Common Files
  COMMONPROGRAMW6432=C:\Program Files\Common Files
  COMPUTERNAME=VAGRANT-10
  COMSPEC=C:\WINDOWS\system32\cmd.exe
  CYGWIN=mintty
  DXSDK_DIR=C:\Program Files (x86)\Microsoft DirectX SDK (June 2010)\
  GTEST_FILTER=-DNSResolver.*:AddressFromURL.*
  HOME=C:\msys64\home\SYSTEM
  LOCALAPPDATA=C:\WINDOWS\system32\config\systemprofile\AppData\Local
  MSYSTEM=MINGW64
  MSYSTEM_PREFIX=/mingw64
  NUMBER_OF_PROCESSORS=2
  OPENSSL_CONF=C:\OpenSSL-Win64\bin\openssl.cfg
  OS=Windows_NT
  PATH=C:\msys64\usr\bin;C:\WINDOWS\system32;C:\WINDOWS;C:\WINDOWS\System32\Wbem;C:\WINDOWS\System32\WindowsPowerShell\v1.0;C:\Program Files\OpenSSH\bin;C:\ProgramData\chocolatey\bin;C:\msys64\mingw64\bin;C:\WINDOWS\system32\config\systemprofile\AppData\Local\Microsoft\WindowsApps;C:\tools\python2\lib\site-packages\pywin32_system32
  PATHEXT=.COM;.EXE;.BAT;.CMD;.VBS;.VBE;.JS;.JSE;.WSF;.WSH;.MSC
  PROCESSOR_ARCHITECTURE=AMD64
  PROCESSOR_IDENTIFIER=Intel64 Family 6 Model 60 Stepping 3, GenuineIntel
  PROCESSOR_LEVEL=6
  PROCESSOR_REVISION=3c03
  PROGRAMDATA=C:\ProgramData
  PROGRAMFILES=C:\Program Files
  PROGRAMFILES(X86)=C:\Program Files (x86)
  PROGRAMW6432=C:\Program Files
  PSMODULEPATH=C:\Program Files (x86)\PowerShell Community Extensions\Pscx3\;C:\Program Files\WindowsPowerShell\Modules;C:\WINDOWS\system32\WindowsPowerShell\v1.0\Modules
  PUBLIC=C:\Users\Public
  PWD=C:\msys64\home\vagrant\slave\monero-static-win64\build
  PYTHONPATH=c:\tools\Python2
  SYSTEMDRIVE=C:
  SYSTEMROOT=C:\WINDOWS
  TEMP=C:\WINDOWS\TEMP
  TERM=cygwin
  TMP=C:\WINDOWS\TEMP
  USERDOMAIN=WORKGROUP
  USERNAME=VAGRANT-10$
  USERPROFILE=C:\WINDOWS\system32\config\systemprofile
  USE_SINGLE_BUILDDIR=1
  VS140COMNTOOLS=C:\Program Files (x86)\Microsoft Visual Studio 14.0\Common7\Tools\
  WINDIR=C:\WINDOWS
 using PTY: False
mkdir -p build/release
cd build/release && cmake -D BUILD_TESTS=ON -D CMAKE_BUILD_TYPE=release ../.. && make && make test
-- CMake version 3.12.4
-- Building build tag win-x64
-- Checking submodules
-- Submodule 'external/miniupnp' is up-to-date
-- Submodule 'external/unbound' is up-to-date
-- Submodule 'external/rapidjson' is up-to-date
-- Submodule 'external/trezor-common' is up-to-date
-- Could not find DEVELOPER_LOCAL_TOOLS in env (not required)
-- BOOST_IGNORE_SYSTEM_PATHS defaults to OFF
-- Could not find DEVELOPER_LIBUNBOUND_OLD in env (not required)
-- Building for a 64-bit system
-- Building internal libraries as static
-- MSYS location: C:/msys64
-- Could not find DATABASE in env (not required unless you want to change database type from default: lmdb)
-- Using LMDB as default DB type
-- looking for liblzma
-- liblzma found
-- Could not find libunwind (missing: LIBUNWIND_INCLUDE_DIR) 
-- Stack trace on exception disabled
-- Using OpenSSL include dir at C:/msys64/mingw64/include
-- Could NOT find MiniUPnPc (missing: MINIUPNP_INCLUDE_DIR MINIUPNP_LIBRARY) 
-- Using in-tree miniupnpc
-- Looking for libunbound
-- Using 64-bit LMDB from source tree
-- Using HIDAPI include dir at C:/msys64/mingw64/include/hidapi
-- Protobuf lib: C:/msys64/mingw64/lib/libprotobuf.a, inc: C:/msys64/mingw64/include, protoc: C:/msys64/mingw64/bin/protoc.exe
-- Trezor protobuf messages regenerated out: "."
-- Checking for module 'libusb-1.0'
--   No package 'libusb-1.0' found
-- Checking for module 'libusb'
--   No package 'libusb' found
-- LibUSB Compilation test: TRUE
-- Trezor compatible LibUSB found at: C:/msys64/mingw64/include/libusb-1.0
-- Building on AMD64 for x86-64
-- AES support enabled
-- Using C security hardening flags:  -Wformat -Wformat-security -mmitigate-rop
-- Using C++ security hardening flags:  -Wformat -Wformat-security -mmitigate-rop
-- Using linker security hardening flags:  -Wl,--dynamicbase -Wl,--nxcompat
-- Found Boost Version: 106800
-- Could NOT find Readline (missing: Readline_INCLUDE_DIR) 
-- Could not find GNU readline library so building without readline support
-- Found Git: C:/msys64/usr/bin/git.exe
-- Trezor support enabled
-- Found GTest: C:/msys64/mingw64/lib/libgtest.dll.a  
Doxygen: graphviz not found - graphs disabled
-- Could NOT find Doxygen (missing: DOXYGEN_EXECUTABLE) 
-- Configuring done
-- Generating done
-- Build files have been written to: C:/msys64/home/vagrant/slave/monero-static-win64/build/build/release
make[1]: Entering directory '/home/vagrant/slave/monero-static-win64/build/build/release'
make[2]: Entering directory '/home/vagrant/slave/monero-static-win64/build/build/release'
make[3]: Entering directory '/home/vagrant/slave/monero-static-win64/build/build/release'
make[3]: Leaving directory '/home/vagrant/slave/monero-static-win64/build/build/release'
[  1%] Built target generate_translations_header
make[3]: Entering directory '/home/vagrant/slave/monero-static-win64/build/build/release'
make[3]: Leaving directory '/home/vagrant/slave/monero-static-win64/build/build/release'
[  4%] Built target libminiupnpc-static
make[3]: Entering directory '/home/vagrant/slave/monero-static-win64/build/build/release'
make[3]: Leaving directory '/home/vagrant/slave/monero-static-win64/build/build/release'
[ 24%] Built target unbound
make[3]: Entering directory '/home/vagrant/slave/monero-static-win64/build/build/release'
make[3]: Leaving directory '/home/vagrant/slave/monero-static-win64/build/build/release'
[ 25%] Built target lmdb
make[3]: Entering directory '/home/vagrant/slave/monero-static-win64/build/build/release'
make[3]: Leaving directory '/home/vagrant/slave/monero-static-win64/build/build/release'
[ 26%] Built target easylogging
make[3]: Entering directory '/home/vagrant/slave/monero-static-win64/build/build/release'
make[3]: Leaving directory '/home/vagrant/slave/monero-static-win64/build/build/release'
make[3]: Entering directory '/home/vagrant/slave/monero-static-win64/build/build/release'
[ 26%] Building CXX object contrib/epee/src/CMakeFiles/epee.dir/hex.cpp.obj
[ 26%] Building CXX object contrib/epee/src/CMakeFiles/epee.dir/http_auth.cpp.obj
[ 26%] Building CXX object contrib/epee/src/CMakeFiles/epee.dir/mlog.cpp.obj
[ 27%] Building CXX object contrib/epee/src/CMakeFiles/epee.dir/net_utils_base.cpp.obj
[ 27%] Building CXX object contrib/epee/src/CMakeFiles/epee.dir/string_tools.cpp.obj
[ 27%] Building CXX object contrib/epee/src/CMakeFiles/epee.dir/wipeable_string.cpp.obj
[ 27%] Building C object contrib/epee/src/CMakeFiles/epee.dir/memwipe.c.obj
[ 28%] Building CXX object contrib/epee/src/CMakeFiles/epee.dir/connection_basic.cpp.obj
[ 28%] Building CXX object contrib/epee/src/CMakeFiles/epee.dir/network_throttle.cpp.obj
[ 28%] Building CXX object contrib/epee/src/CMakeFiles/epee.dir/network_throttle-detail.cpp.obj
[ 28%] Building CXX object contrib/epee/src/CMakeFiles/epee.dir/mlocker.cpp.obj
C:/msys64/home/vagrant/slave/monero-static-win64/build/contrib/epee/src/mlocker.cpp:61:2: warning: #warning Missing query_page_size implementation [-Wcpp]
 #warning Missing query_page_size implementation
  ^~~~~~~
C:/msys64/home/vagrant/slave/monero-static-win64/build/contrib/epee/src/mlocker.cpp:73:2: warning: #warning Missing do_lock implementation [-Wcpp]
 #warning Missing do_lock implementation
  ^~~~~~~
C:/msys64/home/vagrant/slave/monero-static-win64/build/contrib/epee/src/mlocker.cpp:87:2: warning: #warning Missing implementation of page size detection [-Wcpp]
 #warning Missing implementation of page size detection
  ^~~~~~~
[ 28%] Building CXX object contrib/epee/src/CMakeFiles/epee.dir/buffer.cpp.obj
[ 29%] Linking CXX static library libepee.a
make[3]: Leaving directory '/home/vagrant/slave/monero-static-win64/build/build/release'
[ 29%] Built target epee
make[3]: Entering directory '/home/vagrant/slave/monero-static-win64/build/build/release'
make[3]: Leaving directory '/home/vagrant/slave/monero-static-win64/build/build/release'
make[3]: Entering directory '/home/vagrant/slave/monero-static-win64/build/build/release'
[ 29%] Building CXX object contrib/epee/src/CMakeFiles/epee_readline.dir/readline_buffer.cpp.obj
[ 29%] Linking CXX static library libepee_readline.a
make[3]: Leaving directory '/home/vagrant/slave/monero-static-win64/build/build/release'
[ 29%] Built target epee_readline
make[3]: Entering directory '/home/vagrant/slave/monero-static-win64/build/build/release'
make[3]: Leaving directory '/home/vagrant/slave/monero-static-win64/build/build/release'
[ 30%] Built target genversion
make[3]: Entering directory '/home/vagrant/slave/monero-static-win64/build/build/release'
make[3]: Leaving directory '/home/vagrant/slave/monero-static-win64/build/build/release'
make[3]: Entering directory '/home/vagrant/slave/monero-static-win64/build/build/release'
[ 30%] Building CXX object src/CMakeFiles/obj_version.dir/__/version.cpp.obj
make[3]: Leaving directory '/home/vagrant/slave/monero-static-win64/build/build/release'
[ 31%] Built target obj_version
make[3]: Entering directory '/home/vagrant/slave/monero-static-win64/build/build/release'
make[3]: Leaving directory '/home/vagrant/slave/monero-static-win64/build/build/release'
make[3]: Entering directory '/home/vagrant/slave/monero-static-win64/build/build/release'
[ 32%] Linking CXX static library libversion.a
make[3]: Leaving directory '/home/vagrant/slave/monero-static-win64/build/build/release'
[ 32%] Built target version
make[3]: Entering directory '/home/vagrant/slave/monero-static-win64/build/build/release'
make[3]: Leaving directory '/home/vagrant/slave/monero-static-win64/build/build/release'
make[3]: Entering directory '/home/vagrant/slave/monero-static-win64/build/build/release'
[ 33%] Building CXX object src/common/CMakeFiles/obj_common.dir/base58.cpp.obj
[ 33%] Building CXX object src/common/CMakeFiles/obj_common.dir/command_line.cpp.obj
[ 33%] Building CXX object src/common/CMakeFiles/obj_common.dir/dns_utils.cpp.obj
[ 33%] Building CXX object src/common/CMakeFiles/obj_common.dir/download.cpp.obj
[ 34%] Building CXX object src/common/CMakeFiles/obj_common.dir/error.cpp.obj
[ 34%] Building CXX object src/common/CMakeFiles/obj_common.dir/expect.cpp.obj
[ 34%] Building CXX object src/common/CMakeFiles/obj_common.dir/util.cpp.obj
C:/msys64/home/vagrant/slave/monero-static-win64/build/src/common/util.cpp: In static member function 'static tools::private_file tools::private_file::create(std::__cxx11::string)':
C:/msys64/home/vagrant/slave/monero-static-win64/build/src/common/util.cpp:149:69: warning: type qualifiers ignored on cast result type [-Wignored-qualifiers]
     const PSID psid = reinterpret_cast<const PTOKEN_OWNER>(sid.get())->Owner;
                                                                     ^
C:/msys64/home/vagrant/slave/monero-static-win64/build/src/common/util.cpp: In function 'std::__cxx11::string tools::get_windows_version_display_string()':
C:/msys64/home/vagrant/slave/monero-static-win64/build/src/common/util.cpp:327:28: warning: cast between incompatible function types from 'FARPROC' {aka 'long long int (*)()'} to 'PGNSI' {aka 'void (*)(_SYSTEM_INFO*)'} [-Wcast-function-type]
       "GetNativeSystemInfo");
                            ^
C:/msys64/home/vagrant/slave/monero-static-win64/build/src/common/util.cpp:380:27: warning: cast between incompatible function types from 'FARPROC' {aka 'long long int (*)()'} to 'PGPI' {aka 'int (*)(long unsigned int, long unsigned int, long unsigned int, long unsigned int, long unsigned int*)'} [-Wcast-function-type]
           "GetProductInfo");
                           ^
[ 34%] Building CXX object src/common/CMakeFiles/obj_common.dir/i18n.cpp.obj
[ 34%] Building CXX object src/common/CMakeFiles/obj_common.dir/notify.cpp.obj
[ 35%] Building CXX object src/common/CMakeFiles/obj_common.dir/password.cpp.obj
[ 35%] Building CXX object src/common/CMakeFiles/obj_common.dir/perf_timer.cpp.obj
[ 35%] Building CXX object src/common/CMakeFiles/obj_common.dir/pruning.cpp.obj
[ 35%] Building CXX object src/common/CMakeFiles/obj_common.dir/spawn.cpp.obj
[ 36%] Building CXX object src/common/CMakeFiles/obj_common.dir/threadpool.cpp.obj
[ 36%] Building CXX object src/common/CMakeFiles/obj_common.dir/updates.cpp.obj
[ 36%] Building C object src/common/CMakeFiles/obj_common.dir/aligned.c.obj
[ 36%] Building CXX object src/common/CMakeFiles/obj_common.dir/combinator.cpp.obj
make[3]: Leaving directory '/home/vagrant/slave/monero-static-win64/build/build/release'
[ 36%] Built target obj_common
make[3]: Entering directory '/home/vagrant/slave/monero-static-win64/build/build/release'
make[3]: Leaving directory '/home/vagrant/slave/monero-static-win64/build/build/release'
make[3]: Entering directory '/home/vagrant/slave/monero-static-win64/build/build/release'
[ 36%] Building C object src/crypto/CMakeFiles/obj_cncrypto.dir/aesb.c.obj
[ 37%] Building C object src/crypto/CMakeFiles/obj_cncrypto.dir/blake256.c.obj
[ 37%] Building C object src/crypto/CMakeFiles/obj_cncrypto.dir/chacha.c.obj
[ 37%] Building C object src/crypto/CMakeFiles/obj_cncrypto.dir/crypto-ops-data.c.obj
[ 37%] Building C object src/crypto/CMakeFiles/obj_cncrypto.dir/crypto-ops.c.obj
[ 38%] Building CXX object src/crypto/CMakeFiles/obj_cncrypto.dir/crypto.cpp.obj
[ 38%] Building C object src/crypto/CMakeFiles/obj_cncrypto.dir/groestl.c.obj
[ 38%] Building C object src/crypto/CMakeFiles/obj_cncrypto.dir/hash-extra-blake.c.obj
[ 38%] Building C object src/crypto/CMakeFiles/obj_cncrypto.dir/hash-extra-groestl.c.obj
[ 38%] Building C object src/crypto/CMakeFiles/obj_cncrypto.dir/hash-extra-jh.c.obj
[ 39%] Building C object src/crypto/CMakeFiles/obj_cncrypto.dir/hash-extra-skein.c.obj
[ 39%] Building C object src/crypto/CMakeFiles/obj_cncrypto.dir/hash.c.obj
[ 39%] Building C object src/crypto/CMakeFiles/obj_cncrypto.dir/jh.c.obj
[ 39%] Building C object src/crypto/CMakeFiles/obj_cncrypto.dir/keccak.c.obj
[ 40%] Building C object src/crypto/CMakeFiles/obj_cncrypto.dir/oaes_lib.c.obj
[ 40%] Building C object src/crypto/CMakeFiles/obj_cncrypto.dir/random.c.obj
[ 40%] Building C object src/crypto/CMakeFiles/obj_cncrypto.dir/skein.c.obj
[ 40%] Building C object src/crypto/CMakeFiles/obj_cncrypto.dir/slow-hash.c.obj
[ 40%] Building C object src/crypto/CMakeFiles/obj_cncrypto.dir/tree-hash.c.obj
make[3]: Leaving directory '/home/vagrant/slave/monero-static-win64/build/build/release'
[ 40%] Built target obj_cncrypto
make[3]: Entering directory '/home/vagrant/slave/monero-static-win64/build/build/release'
make[3]: Leaving directory '/home/vagrant/slave/monero-static-win64/build/build/release'
make[3]: Entering directory '/home/vagrant/slave/monero-static-win64/build/build/release'
[ 40%] Linking CXX static library libcncrypto.a
make[3]: Leaving directory '/home/vagrant/slave/monero-static-win64/build/build/release'
[ 40%] Built target cncrypto
make[3]: Entering directory '/home/vagrant/slave/monero-static-win64/build/build/release'
make[3]: Leaving directory '/home/vagrant/slave/monero-static-win64/build/build/release'
make[3]: Entering directory '/home/vagrant/slave/monero-static-win64/build/build/release'
[ 40%] Linking CXX static library libcommon.a
make[3]: Leaving directory '/home/vagrant/slave/monero-static-win64/build/build/release'
[ 40%] Built target common
make[3]: Entering directory '/home/vagrant/slave/monero-static-win64/build/build/release'
make[3]: Leaving directory '/home/vagrant/slave/monero-static-win64/build/build/release'
make[3]: Entering directory '/home/vagrant/slave/monero-static-win64/build/build/release'
[ 40%] Building CXX object src/ringct/CMakeFiles/obj_ringct_basic.dir/rctOps.cpp.obj
[ 41%] Building CXX object src/ringct/CMakeFiles/obj_ringct_basic.dir/rctTypes.cpp.obj
[ 41%] Building C object src/ringct/CMakeFiles/obj_ringct_basic.dir/rctCryptoOps.c.obj
[ 41%] Building CXX object src/ringct/CMakeFiles/obj_ringct_basic.dir/multiexp.cc.obj
[ 41%] Building CXX object src/ringct/CMakeFiles/obj_ringct_basic.dir/bulletproofs.cc.obj
make[3]: Leaving directory '/home/vagrant/slave/monero-static-win64/build/build/release'
[ 41%] Built target obj_ringct_basic
make[3]: Entering directory '/home/vagrant/slave/monero-static-win64/build/build/release'
make[3]: Leaving directory '/home/vagrant/slave/monero-static-win64/build/build/release'
make[3]: Entering directory '/home/vagrant/slave/monero-static-win64/build/build/release'
[ 41%] Linking CXX static library libringct_basic.a
make[3]: Leaving directory '/home/vagrant/slave/monero-static-win64/build/build/release'
[ 41%] Built target ringct_basic
make[3]: Entering directory '/home/vagrant/slave/monero-static-win64/build/build/release'
make[3]: Leaving directory '/home/vagrant/slave/monero-static-win64/build/build/release'
make[3]: Entering directory '/home/vagrant/slave/monero-static-win64/build/build/release'
[ 41%] Building CXX object src/ringct/CMakeFiles/obj_ringct.dir/rctSigs.cpp.obj
make[3]: Leaving directory '/home/vagrant/slave/monero-static-win64/build/build/release'
[ 41%] Built target obj_ringct
make[3]: Entering directory '/home/vagrant/slave/monero-static-win64/build/build/release'
make[3]: Leaving directory '/home/vagrant/slave/monero-static-win64/build/build/release'
make[3]: Entering directory '/home/vagrant/slave/monero-static-win64/build/build/release'
[ 41%] Building CXX object src/device/CMakeFiles/obj_device.dir/device.cpp.obj
[ 42%] Building CXX object src/device/CMakeFiles/obj_device.dir/device_default.cpp.obj
[ 42%] Building CXX object src/device/CMakeFiles/obj_device.dir/log.cpp.obj
[ 42%] Building CXX object src/device/CMakeFiles/obj_device.dir/device_ledger.cpp.obj
[ 42%] Building CXX object src/device/CMakeFiles/obj_device.dir/device_io_hid.cpp.obj
make[3]: Leaving directory '/home/vagrant/slave/monero-static-win64/build/build/release'
[ 42%] Built target obj_device
make[3]: Entering directory '/home/vagrant/slave/monero-static-win64/build/build/release'
make[3]: Leaving directory '/home/vagrant/slave/monero-static-win64/build/build/release'
make[3]: Entering directory '/home/vagrant/slave/monero-static-win64/build/build/release'
[ 43%] Linking CXX static library libdevice.a
make[3]: Leaving directory '/home/vagrant/slave/monero-static-win64/build/build/release'
[ 43%] Built target device
make[3]: Entering directory '/home/vagrant/slave/monero-static-win64/build/build/release'
make[3]: Leaving directory '/home/vagrant/slave/monero-static-win64/build/build/release'
make[3]: Entering directory '/home/vagrant/slave/monero-static-win64/build/build/release'
[ 43%] Building CXX object src/cryptonote_basic/CMakeFiles/obj_cryptonote_basic.dir/account.cpp.obj
[ 44%] Building CXX object src/cryptonote_basic/CMakeFiles/obj_cryptonote_basic.dir/cryptonote_basic_impl.cpp.obj
[ 44%] Building CXX object src/cryptonote_basic/CMakeFiles/obj_cryptonote_basic.dir/cryptonote_format_utils.cpp.obj
[ 44%] Building CXX object src/cryptonote_basic/CMakeFiles/obj_cryptonote_basic.dir/difficulty.cpp.obj
[ 44%] Building CXX object src/cryptonote_basic/CMakeFiles/obj_cryptonote_basic.dir/hardfork.cpp.obj
[ 45%] Building CXX object src/cryptonote_basic/CMakeFiles/obj_cryptonote_basic.dir/miner.cpp.obj
In file included from C:/msys64/home/vagrant/slave/monero-static-win64/build/src/cryptonote_basic/miner.h:38,
                 from C:/msys64/home/vagrant/slave/monero-static-win64/build/src/cryptonote_basic/miner.cpp:78:
C:/msys64/home/vagrant/slave/monero-static-win64/build/contrib/epee/include/math_helper.h: In member function 'uint64_t epee::math_helper::once_a_time<scale, default_interval, start_immediate>::get_time() const':
C:/msys64/home/vagrant/slave/monero-static-win64/build/contrib/epee/include/math_helper.h:251:5: warning: no return statement in function returning non-void [-Wreturn-type]
     }
     ^
make[3]: Leaving directory '/home/vagrant/slave/monero-static-win64/build/build/release'
[ 45%] Built target obj_cryptonote_basic
make[3]: Entering directory '/home/vagrant/slave/monero-static-win64/build/build/release'
make[3]: Leaving directory '/home/vagrant/slave/monero-static-win64/build/build/release'
make[3]: Entering directory '/home/vagrant/slave/monero-static-win64/build/build/release'
[ 45%] Building CXX object src/checkpoints/CMakeFiles/obj_checkpoints.dir/checkpoints.cpp.obj
make[3]: Leaving directory '/home/vagrant/slave/monero-static-win64/build/build/release'
[ 45%] Built target obj_checkpoints
make[3]: Entering directory '/home/vagrant/slave/monero-static-win64/build/build/release'
make[3]: Leaving directory '/home/vagrant/slave/monero-static-win64/build/build/release'
make[3]: Entering directory '/home/vagrant/slave/monero-static-win64/build/build/release'
[ 46%] Linking CXX static library libcheckpoints.a
make[3]: Leaving directory '/home/vagrant/slave/monero-static-win64/build/build/release'
[ 46%] Built target checkpoints
make[3]: Entering directory '/home/vagrant/slave/monero-static-win64/build/build/release'
make[3]: Leaving directory '/home/vagrant/slave/monero-static-win64/build/build/release'
make[3]: Entering directory '/home/vagrant/slave/monero-static-win64/build/build/release'
[ 46%] Linking CXX static library libcryptonote_basic.a
make[3]: Leaving directory '/home/vagrant/slave/monero-static-win64/build/build/release'
[ 46%] Built target cryptonote_basic
make[3]: Entering directory '/home/vagrant/slave/monero-static-win64/build/build/release'
make[3]: Leaving directory '/home/vagrant/slave/monero-static-win64/build/build/release'
make[3]: Entering directory '/home/vagrant/slave/monero-static-win64/build/build/release'
[ 46%] Linking CXX static library libringct.a
make[3]: Leaving directory '/home/vagrant/slave/monero-static-win64/build/build/release'
[ 46%] Built target ringct
make[3]: Entering directory '/home/vagrant/slave/monero-static-win64/build/build/release'
make[3]: Leaving directory '/home/vagrant/slave/monero-static-win64/build/build/release'
make[3]: Entering directory '/home/vagrant/slave/monero-static-win64/build/build/release'
[ 46%] Building CXX object src/cryptonote_core/CMakeFiles/obj_cryptonote_core.dir/blockchain.cpp.obj
In file included from C:/msys64/home/vagrant/slave/monero-static-win64/build/src/cryptonote_core/tx_pool.h:43,
                 from C:/msys64/home/vagrant/slave/monero-static-win64/build/src/cryptonote_core/blockchain.cpp:38:
C:/msys64/home/vagrant/slave/monero-static-win64/build/contrib/epee/include/math_helper.h: In member function 'uint64_t epee::math_helper::once_a_time<scale, default_interval, start_immediate>::get_time() const':
C:/msys64/home/vagrant/slave/monero-static-win64/build/contrib/epee/include/math_helper.h:251:5: warning: no return statement in function returning non-void [-Wreturn-type]
     }
     ^
C:/msys64/home/vagrant/slave/monero-static-win64/build/src/cryptonote_core/blockchain.cpp: In member function 'bool cryptonote::Blockchain::expand_transaction_2(cryptonote::transaction&, const crypto::hash&, const std::vector<std::vector<rct::ctkey> >&)':
C:/msys64/home/vagrant/slave/monero-static-win64/build/src/cryptonote_core/blockchain.cpp:2603:88: warning: enum constant in boolean context [-Wint-in-bool-context]
   else if (rv.type == rct::RCTTypeSimple || rv.type == rct::RCTTypeBulletproof || rct::RCTTypeBulletproof2)
                                                                                        ^~~~~~~~~~~~~~~~~~~
[ 46%] Building CXX object src/cryptonote_core/CMakeFiles/obj_cryptonote_core.dir/cryptonote_core.cpp.obj
In file included from C:/msys64/home/vagrant/slave/monero-static-win64/build/src/cryptonote_core/tx_pool.h:43,
                 from C:/msys64/home/vagrant/slave/monero-static-win64/build/src/cryptonote_core/cryptonote_core.h:42,
                 from C:/msys64/home/vagrant/slave/monero-static-win64/build/src/cryptonote_core/cryptonote_core.cpp:37:
C:/msys64/home/vagrant/slave/monero-static-win64/build/contrib/epee/include/math_helper.h: In member function 'uint64_t epee::math_helper::once_a_time<scale, default_interval, start_immediate>::get_time() const':
C:/msys64/home/vagrant/slave/monero-static-win64/build/contrib/epee/include/math_helper.h:251:5: warning: no return statement in function returning non-void [-Wreturn-type]
     }
     ^
[ 46%] Building CXX object src/cryptonote_core/CMakeFiles/obj_cryptonote_core.dir/tx_pool.cpp.obj
In file included from C:/msys64/home/vagrant/slave/monero-static-win64/build/src/cryptonote_core/tx_pool.h:43,
                 from C:/msys64/home/vagrant/slave/monero-static-win64/build/src/cryptonote_core/tx_pool.cpp:36:
C:/msys64/home/vagrant/slave/monero-static-win64/build/contrib/epee/include/math_helper.h: In member function 'uint64_t epee::math_helper::once_a_time<scale, default_interval, start_immediate>::get_time() const':
C:/msys64/home/vagrant/slave/monero-static-win64/build/contrib/epee/include/math_helper.h:251:5: warning: no return statement in function returning non-void [-Wreturn-type]
     }
     ^
[ 46%] Building CXX object src/cryptonote_core/CMakeFiles/obj_cryptonote_core.dir/cryptonote_tx_utils.cpp.obj
In file included from C:/msys64/home/vagrant/slave/monero-static-win64/build/src/cryptonote_basic/miner.h:38,
                 from C:/msys64/home/vagrant/slave/monero-static-win64/build/src/cryptonote_core/cryptonote_tx_utils.cpp:40:
C:/msys64/home/vagrant/slave/monero-static-win64/build/contrib/epee/include/math_helper.h: In member function 'uint64_t epee::math_helper::once_a_time<scale, default_interval, start_immediate>::get_time() const':
C:/msys64/home/vagrant/slave/monero-static-win64/build/contrib/epee/include/math_helper.h:251:5: warning: no return statement in function returning non-void [-Wreturn-type]
     }
     ^
make[3]: Leaving directory '/home/vagrant/slave/monero-static-win64/build/build/release'
[ 46%] Built target obj_cryptonote_core
make[3]: Entering directory '/home/vagrant/slave/monero-static-win64/build/build/release'
make[3]: Leaving directory '/home/vagrant/slave/monero-static-win64/build/build/release'
make[3]: Entering directory '/home/vagrant/slave/monero-static-win64/build/build/release'
[ 47%] Building CXX object src/multisig/CMakeFiles/obj_multisig.dir/multisig.cpp.obj
make[3]: Leaving directory '/home/vagrant/slave/monero-static-win64/build/build/release'
[ 47%] Built target obj_multisig
make[3]: Entering directory '/home/vagrant/slave/monero-static-win64/build/build/release'
make[3]: Leaving directory '/home/vagrant/slave/monero-static-win64/build/build/release'
make[3]: Entering directory '/home/vagrant/slave/monero-static-win64/build/build/release'
[ 47%] Linking CXX static library libmultisig.a
make[3]: Leaving directory '/home/vagrant/slave/monero-static-win64/build/build/release'
[ 47%] Built target multisig
make[3]: Entering directory '/home/vagrant/slave/monero-static-win64/build/build/release'
make[3]: Leaving directory '/home/vagrant/slave/monero-static-win64/build/build/release'
make[3]: Entering directory '/home/vagrant/slave/monero-static-win64/build/build/release'
[ 48%] Building CXX object src/blockchain_db/CMakeFiles/obj_blockchain_db.dir/blockchain_db.cpp.obj
[ 48%] Building CXX object src/blockchain_db/CMakeFiles/obj_blockchain_db.dir/lmdb/db_lmdb.cpp.obj
make[3]: Leaving directory '/home/vagrant/slave/monero-static-win64/build/build/release'
[ 48%] Built target obj_blockchain_db
make[3]: Entering directory '/home/vagrant/slave/monero-static-win64/build/build/release'
make[3]: Leaving directory '/home/vagrant/slave/monero-static-win64/build/build/release'
make[3]: Entering directory '/home/vagrant/slave/monero-static-win64/build/build/release'
[ 48%] Linking CXX static library libblockchain_db.a
make[3]: Leaving directory '/home/vagrant/slave/monero-static-win64/build/build/release'
[ 48%] Built target blockchain_db
make[3]: Entering directory '/home/vagrant/slave/monero-static-win64/build/build/release'
make[3]: Leaving directory '/home/vagrant/slave/monero-static-win64/build/build/release'
make[3]: Entering directory '/home/vagrant/slave/monero-static-win64/build/build/release'
[ 48%] Linking CXX static library libcryptonote_core.a
make[3]: Leaving directory '/home/vagrant/slave/monero-static-win64/build/build/release'
[ 48%] Built target cryptonote_core
make[3]: Entering directory '/home/vagrant/slave/monero-static-win64/build/build/release'
make[3]: Leaving directory '/home/vagrant/slave/monero-static-win64/build/build/release'
make[3]: Entering directory '/home/vagrant/slave/monero-static-win64/build/build/release'
[ 48%] Building CXX object src/net/CMakeFiles/obj_net.dir/error.cpp.obj
[ 48%] Building CXX object src/net/CMakeFiles/obj_net.dir/parse.cpp.obj
[ 48%] Building CXX object src/net/CMakeFiles/obj_net.dir/socks.cpp.obj
[ 50%] Building CXX object src/net/CMakeFiles/obj_net.dir/tor_address.cpp.obj
make[3]: Leaving directory '/home/vagrant/slave/monero-static-win64/build/build/release'
[ 50%] Built target obj_net
make[3]: Entering directory '/home/vagrant/slave/monero-static-win64/build/build/release'
make[3]: Leaving directory '/home/vagrant/slave/monero-static-win64/build/build/release'
make[3]: Entering directory '/home/vagrant/slave/monero-static-win64/build/build/release'
[ 51%] Linking CXX static library libnet.a
make[3]: Leaving directory '/home/vagrant/slave/monero-static-win64/build/build/release'
[ 51%] Built target net
make[3]: Entering directory '/home/vagrant/slave/monero-static-win64/build/build/release'
make[3]: Leaving directory '/home/vagrant/slave/monero-static-win64/build/build/release'
make[3]: Entering directory '/home/vagrant/slave/monero-static-win64/build/build/release'
[ 51%] Building CXX object src/mnemonics/CMakeFiles/obj_mnemonics.dir/electrum-words.cpp.obj
make[3]: Leaving directory '/home/vagrant/slave/monero-static-win64/build/build/release'
[ 51%] Built target obj_mnemonics
make[3]: Entering directory '/home/vagrant/slave/monero-static-win64/build/build/release'
make[3]: Leaving directory '/home/vagrant/slave/monero-static-win64/build/build/release'
make[3]: Entering directory '/home/vagrant/slave/monero-static-win64/build/build/release'
[ 51%] Linking CXX static library libmnemonics.a
make[3]: Leaving directory '/home/vagrant/slave/monero-static-win64/build/build/release'
[ 51%] Built target mnemonics
make[3]: Entering directory '/home/vagrant/slave/monero-static-win64/build/build/release'
make[3]: Leaving directory '/home/vagrant/slave/monero-static-win64/build/build/release'
make[3]: Entering directory '/home/vagrant/slave/monero-static-win64/build/build/release'
[ 51%] Building CXX object src/rpc/CMakeFiles/obj_daemon_messages.dir/message.cpp.obj
[ 51%] Building CXX object src/rpc/CMakeFiles/obj_daemon_messages.dir/daemon_messages.cpp.obj
make[3]: Leaving directory '/home/vagrant/slave/monero-static-win64/build/build/release'
[ 51%] Built target obj_daemon_messages
make[3]: Entering directory '/home/vagrant/slave/monero-static-win64/build/build/release'
make[3]: Leaving directory '/home/vagrant/slave/monero-static-win64/build/build/release'
make[3]: Entering directory '/home/vagrant/slave/monero-static-win64/build/build/release'
[ 51%] Building CXX object src/serialization/CMakeFiles/obj_serialization.dir/json_object.cpp.obj
make[3]: Leaving directory '/home/vagrant/slave/monero-static-win64/build/build/release'
[ 51%] Built target obj_serialization
make[3]: Entering directory '/home/vagrant/slave/monero-static-win64/build/build/release'
make[3]: Leaving directory '/home/vagrant/slave/monero-static-win64/build/build/release'
make[3]: Entering directory '/home/vagrant/slave/monero-static-win64/build/build/release'
[ 51%] Building CXX object src/p2p/CMakeFiles/obj_p2p.dir/net_node.cpp.obj
In file included from C:/msys64/home/vagrant/slave/monero-static-win64/build/src/cryptonote_core/tx_pool.h:43,
                 from C:/msys64/home/vagrant/slave/monero-static-win64/build/src/cryptonote_core/cryptonote_core.h:42,
                 from C:/msys64/home/vagrant/slave/monero-static-win64/build/src/p2p/net_node.cpp:42:
C:/msys64/home/vagrant/slave/monero-static-win64/build/contrib/epee/include/math_helper.h: In member function 'uint64_t epee::math_helper::once_a_time<scale, default_interval, start_immediate>::get_time() const':
C:/msys64/home/vagrant/slave/monero-static-win64/build/contrib/epee/include/math_helper.h:251:5: warning: no return statement in function returning non-void [-Wreturn-type]
     }
     ^
[ 51%] Building CXX object src/p2p/CMakeFiles/obj_p2p.dir/net_peerlist.cpp.obj
make[3]: Leaving directory '/home/vagrant/slave/monero-static-win64/build/build/release'
[ 51%] Built target obj_p2p
make[3]: Entering directory '/home/vagrant/slave/monero-static-win64/build/build/release'
make[3]: Leaving directory '/home/vagrant/slave/monero-static-win64/build/build/release'
make[3]: Entering directory '/home/vagrant/slave/monero-static-win64/build/build/release'
[ 52%] Linking CXX static library libp2p.a
make[3]: Leaving directory '/home/vagrant/slave/monero-static-win64/build/build/release'
[ 52%] Built target p2p
make[3]: Entering directory '/home/vagrant/slave/monero-static-win64/build/build/release'
make[3]: Leaving directory '/home/vagrant/slave/monero-static-win64/build/build/release'
make[3]: Entering directory '/home/vagrant/slave/monero-static-win64/build/build/release'
[ 53%] Building CXX object src/cryptonote_protocol/CMakeFiles/obj_cryptonote_protocol.dir/block_queue.cpp.obj
[ 53%] Building CXX object src/cryptonote_protocol/CMakeFiles/obj_cryptonote_protocol.dir/cryptonote_protocol_handler-base.cpp.obj
In file included from C:/msys64/home/vagrant/slave/monero-static-win64/build/src/cryptonote_protocol/cryptonote_protocol_handler.h:40,
                 from C:/msys64/home/vagrant/slave/monero-static-win64/build/src/cryptonote_protocol/cryptonote_protocol_handler-base.cpp:50:
C:/msys64/home/vagrant/slave/monero-static-win64/build/contrib/epee/include/math_helper.h: In member function 'uint64_t epee::math_helper::once_a_time<scale, default_interval, start_immediate>::get_time() const':
C:/msys64/home/vagrant/slave/monero-static-win64/build/contrib/epee/include/math_helper.h:251:5: warning: no return statement in function returning non-void [-Wreturn-type]
     }
     ^
make[3]: Leaving directory '/home/vagrant/slave/monero-static-win64/build/build/release'
[ 53%] Built target obj_cryptonote_protocol
make[3]: Entering directory '/home/vagrant/slave/monero-static-win64/build/build/release'
make[3]: Leaving directory '/home/vagrant/slave/monero-static-win64/build/build/release'
make[3]: Entering directory '/home/vagrant/slave/monero-static-win64/build/build/release'
[ 53%] Linking CXX static library libcryptonote_protocol.a
make[3]: Leaving directory '/home/vagrant/slave/monero-static-win64/build/build/release'
[ 53%] Built target cryptonote_protocol
make[3]: Entering directory '/home/vagrant/slave/monero-static-win64/build/build/release'
make[3]: Leaving directory '/home/vagrant/slave/monero-static-win64/build/build/release'
make[3]: Entering directory '/home/vagrant/slave/monero-static-win64/build/build/release'
[ 53%] Linking CXX static library libserialization.a
make[3]: Leaving directory '/home/vagrant/slave/monero-static-win64/build/build/release'
[ 53%] Built target serialization
make[3]: Entering directory '/home/vagrant/slave/monero-static-win64/build/build/release'
make[3]: Leaving directory '/home/vagrant/slave/monero-static-win64/build/build/release'
make[3]: Entering directory '/home/vagrant/slave/monero-static-win64/build/build/release'
[ 53%] Linking CXX static library libdaemon_messages.a
make[3]: Leaving directory '/home/vagrant/slave/monero-static-win64/build/build/release'
[ 53%] Built target daemon_messages
make[3]: Entering directory '/home/vagrant/slave/monero-static-win64/build/build/release'
make[3]: Leaving directory '/home/vagrant/slave/monero-static-win64/build/build/release'
make[3]: Entering directory '/home/vagrant/slave/monero-static-win64/build/build/release'
[ 54%] Building CXX object src/rpc/CMakeFiles/obj_daemon_rpc_server.dir/daemon_handler.cpp.obj
In file included from C:/msys64/home/vagrant/slave/monero-static-win64/build/src/cryptonote_core/tx_pool.h:43,
                 from C:/msys64/home/vagrant/slave/monero-static-win64/build/src/cryptonote_core/cryptonote_core.h:42,
                 from C:/msys64/home/vagrant/slave/monero-static-win64/build/src/rpc/daemon_handler.h:34,
                 from C:/msys64/home/vagrant/slave/monero-static-win64/build/src/rpc/daemon_handler.cpp:29:
C:/msys64/home/vagrant/slave/monero-static-win64/build/contrib/epee/include/math_helper.h: In member function 'uint64_t epee::math_helper::once_a_time<scale, default_interval, start_immediate>::get_time() const':
C:/msys64/home/vagrant/slave/monero-static-win64/build/contrib/epee/include/math_helper.h:251:5: warning: no return statement in function returning non-void [-Wreturn-type]
     }
     ^
[ 54%] Building CXX object src/rpc/CMakeFiles/obj_daemon_rpc_server.dir/zmq_server.cpp.obj
make[3]: Leaving directory '/home/vagrant/slave/monero-static-win64/build/build/release'
[ 54%] Built target obj_daemon_rpc_server
make[3]: Entering directory '/home/vagrant/slave/monero-static-win64/build/build/release'
make[3]: Leaving directory '/home/vagrant/slave/monero-static-win64/build/build/release'
make[3]: Entering directory '/home/vagrant/slave/monero-static-win64/build/build/release'
[ 55%] Building CXX object src/rpc/CMakeFiles/obj_rpc.dir/core_rpc_server.cpp.obj
In file included from C:/msys64/home/vagrant/slave/monero-static-win64/build/src/cryptonote_core/tx_pool.h:43,
                 from C:/msys64/home/vagrant/slave/monero-static-win64/build/src/cryptonote_core/cryptonote_core.h:42,
                 from C:/msys64/home/vagrant/slave/monero-static-win64/build/src/rpc/core_rpc_server.h:39,
                 from C:/msys64/home/vagrant/slave/monero-static-win64/build/src/rpc/core_rpc_server.cpp:35:
C:/msys64/home/vagrant/slave/monero-static-win64/build/contrib/epee/include/math_helper.h: In member function 'uint64_t epee::math_helper::once_a_time<scale, default_interval, start_immediate>::get_time() const':
C:/msys64/home/vagrant/slave/monero-static-win64/build/contrib/epee/include/math_helper.h:251:5: warning: no return statement in function returning non-void [-Wreturn-type]
     }
     ^
[ 55%] Building CXX object src/rpc/CMakeFiles/obj_rpc.dir/rpc_handler.cpp.obj
In file included from C:/msys64/home/vagrant/slave/monero-static-win64/build/src/cryptonote_core/tx_pool.h:43,
                 from C:/msys64/home/vagrant/slave/monero-static-win64/build/src/cryptonote_core/cryptonote_core.h:42,
                 from C:/msys64/home/vagrant/slave/monero-static-win64/build/src/rpc/rpc_handler.cpp:6:
C:/msys64/home/vagrant/slave/monero-static-win64/build/contrib/epee/include/math_helper.h: In member function 'uint64_t epee::math_helper::once_a_time<scale, default_interval, start_immediate>::get_time() const':
C:/msys64/home/vagrant/slave/monero-static-win64/build/contrib/epee/include/math_helper.h:251:5: warning: no return statement in function returning non-void [-Wreturn-type]
     }
     ^
[ 55%] Building CXX object src/rpc/CMakeFiles/obj_rpc.dir/instanciations.cpp.obj
In file included from C:/msys64/home/vagrant/slave/monero-static-win64/build/src/p2p/net_node.h:53,
                 from C:/msys64/home/vagrant/slave/monero-static-win64/build/src/rpc/instanciations.cpp:31:
C:/msys64/home/vagrant/slave/monero-static-win64/build/contrib/epee/include/math_helper.h: In member function 'uint64_t epee::math_helper::once_a_time<scale, default_interval, start_immediate>::get_time() const':
C:/msys64/home/vagrant/slave/monero-static-win64/build/contrib/epee/include/math_helper.h:251:5: warning: no return statement in function returning non-void [-Wreturn-type]
     }
     ^
make[3]: Leaving directory '/home/vagrant/slave/monero-static-win64/build/build/release'
[ 55%] Built target obj_rpc
make[3]: Entering directory '/home/vagrant/slave/monero-static-win64/build/build/release'
make[3]: Leaving directory '/home/vagrant/slave/monero-static-win64/build/build/release'
make[3]: Entering directory '/home/vagrant/slave/monero-static-win64/build/build/release'
[ 55%] Building CXX object src/rpc/CMakeFiles/obj_rpc_base.dir/rpc_args.cpp.obj
make[3]: Leaving directory '/home/vagrant/slave/monero-static-win64/build/build/release'
[ 55%] Built target obj_rpc_base
make[3]: Entering directory '/home/vagrant/slave/monero-static-win64/build/build/release'
make[3]: Leaving directory '/home/vagrant/slave/monero-static-win64/build/build/release'
make[3]: Entering directory '/home/vagrant/slave/monero-static-win64/build/build/release'
[ 55%] Linking CXX static library librpc_base.a
make[3]: Leaving directory '/home/vagrant/slave/monero-static-win64/build/build/release'
[ 55%] Built target rpc_base
make[3]: Entering directory '/home/vagrant/slave/monero-static-win64/build/build/release'
make[3]: Leaving directory '/home/vagrant/slave/monero-static-win64/build/build/release'
make[3]: Entering directory '/home/vagrant/slave/monero-static-win64/build/build/release'
[ 56%] Linking CXX static library librpc.a
make[3]: Leaving directory '/home/vagrant/slave/monero-static-win64/build/build/release'
[ 56%] Built target rpc
make[3]: Entering directory '/home/vagrant/slave/monero-static-win64/build/build/release'
make[3]: Leaving directory '/home/vagrant/slave/monero-static-win64/build/build/release'
make[3]: Entering directory '/home/vagrant/slave/monero-static-win64/build/build/release'
[ 56%] Linking CXX static library libdaemon_rpc_server.a
make[3]: Leaving directory '/home/vagrant/slave/monero-static-win64/build/build/release'
[ 56%] Built target daemon_rpc_server
make[3]: Entering directory '/home/vagrant/slave/monero-static-win64/build/build/release'
make[3]: Leaving directory '/home/vagrant/slave/monero-static-win64/build/build/release'
make[3]: Entering directory '/home/vagrant/slave/monero-static-win64/build/build/release'
[ 56%] Building CXX object src/wallet/CMakeFiles/obj_wallet.dir/wallet2.cpp.obj
C:/msys64/home/vagrant/slave/monero-static-win64/build/src/wallet/wallet2.cpp: In function 'std::unique_ptr<tools::wallet2> {anonymous}::make_basic(const boost::program_options::variables_map&, bool, const {anonymous}::options&, const std::function<boost::optional<tools::password_container>(const char*, bool)>&)':
C:/msys64/home/vagrant/slave/monero-static-win64/build/src/wallet/wallet2.cpp:362:71: warning: '*((void*)& trusted_daemon +1)' may be used uninitialized in this function [-Wmaybe-uninitialized]
   wallet->init(std::move(daemon_address), std::move(login), 0, false, *trusted_daemon);
                                                                       ^~~~~~~~~~~~~~~
[ 56%] Building CXX object src/wallet/CMakeFiles/obj_wallet.dir/wallet_args.cpp.obj
[ 57%] Building CXX object src/wallet/CMakeFiles/obj_wallet.dir/ringdb.cpp.obj
[ 57%] Building CXX object src/wallet/CMakeFiles/obj_wallet.dir/node_rpc_proxy.cpp.obj
[ 57%] Building CXX object src/wallet/CMakeFiles/obj_wallet.dir/message_store.cpp.obj
[ 57%] Building CXX object src/wallet/CMakeFiles/obj_wallet.dir/message_transporter.cpp.obj
make[3]: Leaving directory '/home/vagrant/slave/monero-static-win64/build/build/release'
[ 57%] Built target obj_wallet
make[3]: Entering directory '/home/vagrant/slave/monero-static-win64/build/build/release'
make[3]: Leaving directory '/home/vagrant/slave/monero-static-win64/build/build/release'
make[3]: Entering directory '/home/vagrant/slave/monero-static-win64/build/build/release'
[ 57%] Building CXX object src/device_trezor/CMakeFiles/obj_device_trezor.dir/trezor/messages_map.cpp.obj
[ 58%] Building CXX object src/device_trezor/CMakeFiles/obj_device_trezor.dir/trezor/protocol.cpp.obj
[ 58%] Building CXX object src/device_trezor/CMakeFiles/obj_device_trezor.dir/trezor/transport.cpp.obj
[ 58%] Building CXX object src/device_trezor/CMakeFiles/obj_device_trezor.dir/device_trezor_base.cpp.obj
[ 58%] Building CXX object src/device_trezor/CMakeFiles/obj_device_trezor.dir/device_trezor.cpp.obj
[ 59%] Building CXX object src/device_trezor/CMakeFiles/obj_device_trezor.dir/trezor/messages/messages.pb.cc.obj
[ 59%] Building CXX object src/device_trezor/CMakeFiles/obj_device_trezor.dir/trezor/messages/messages-common.pb.cc.obj
[ 59%] Building CXX object src/device_trezor/CMakeFiles/obj_device_trezor.dir/trezor/messages/messages-management.pb.cc.obj
[ 59%] Building CXX object src/device_trezor/CMakeFiles/obj_device_trezor.dir/trezor/messages/messages-monero.pb.cc.obj
make[3]: Leaving directory '/home/vagrant/slave/monero-static-win64/build/build/release'
[ 59%] Built target obj_device_trezor
make[3]: Entering directory '/home/vagrant/slave/monero-static-win64/build/build/release'
make[3]: Leaving directory '/home/vagrant/slave/monero-static-win64/build/build/release'
make[3]: Entering directory '/home/vagrant/slave/monero-static-win64/build/build/release'
[ 59%] Linking CXX static library libdevice_trezor.a
make[3]: Leaving directory '/home/vagrant/slave/monero-static-win64/build/build/release'
[ 59%] Built target device_trezor
make[3]: Entering directory '/home/vagrant/slave/monero-static-win64/build/build/release'
make[3]: Leaving directory '/home/vagrant/slave/monero-static-win64/build/build/release'
make[3]: Entering directory '/home/vagrant/slave/monero-static-win64/build/build/release'
[ 59%] Linking CXX static library ../../lib/libwallet.a
make[3]: Leaving directory '/home/vagrant/slave/monero-static-win64/build/build/release'
[ 59%] Built target wallet
make[3]: Entering directory '/home/vagrant/slave/monero-static-win64/build/build/release'
make[3]: Leaving directory '/home/vagrant/slave/monero-static-win64/build/build/release'
make[3]: Entering directory '/home/vagrant/slave/monero-static-win64/build/build/release'
[ 59%] Building CXX object src/daemonizer/CMakeFiles/obj_daemonizer.dir/windows_service.cpp.obj
make[3]: Leaving directory '/home/vagrant/slave/monero-static-win64/build/build/release'
[ 59%] Built target obj_daemonizer
make[3]: Entering directory '/home/vagrant/slave/monero-static-win64/build/build/release'
make[3]: Leaving directory '/home/vagrant/slave/monero-static-win64/build/build/release'
make[3]: Entering directory '/home/vagrant/slave/monero-static-win64/build/build/release'
[ 59%] Linking CXX static library libdaemonizer.a
make[3]: Leaving directory '/home/vagrant/slave/monero-static-win64/build/build/release'
[ 59%] Built target daemonizer
make[3]: Entering directory '/home/vagrant/slave/monero-static-win64/build/build/release'
make[3]: Leaving directory '/home/vagrant/slave/monero-static-win64/build/build/release'
make[3]: Entering directory '/home/vagrant/slave/monero-static-win64/build/build/release'
[ 59%] Building CXX object src/wallet/CMakeFiles/wallet_rpc_server.dir/wallet_rpc_server.cpp.obj
In file included from C:/msys64/home/vagrant/slave/monero-static-win64/build/src/wallet/wallet_rpc_server.h:38,
                 from C:/msys64/home/vagrant/slave/monero-static-win64/build/src/wallet/wallet_rpc_server.cpp:38:
C:/msys64/home/vagrant/slave/monero-static-win64/build/contrib/epee/include/math_helper.h: In member function 'uint64_t epee::math_helper::once_a_time<scale, default_interval, start_immediate>::get_time() const':
C:/msys64/home/vagrant/slave/monero-static-win64/build/contrib/epee/include/math_helper.h:251:5: warning: no return statement in function returning non-void [-Wreturn-type]
     }
     ^
In file included from C:/msys64/mingw64/x86_64-w64-mingw32/include/shlobj.h:124,
                 from C:/msys64/home/vagrant/slave/monero-static-win64/build/src/daemonizer/windows_daemonizer.inl:36,
                 from C:/msys64/home/vagrant/slave/monero-static-win64/build/src/daemonizer/daemonizer.h:63,
                 from C:/msys64/home/vagrant/slave/monero-static-win64/build/src/wallet/wallet_rpc_server.cpp:54:
C:/msys64/mingw64/x86_64-w64-mingw32/include/shobjidl.h: In function 'HRESULT SHLoadLibraryFromItem(IShellItem*, DWORD, const IID&, void**)':
C:/msys64/mingw64/x86_64-w64-mingw32/include/shobjidl.h:32828: note: -Wmisleading-indentation is disabled from this point onwards, since column-tracking was disabled due to the size of the code/headers
       plib->Release();
 
[ 60%] Linking CXX executable ../../bin/monero-wallet-rpc.exe
make[3]: Leaving directory '/home/vagrant/slave/monero-static-win64/build/build/release'
[ 60%] Built target wallet_rpc_server
make[3]: Entering directory '/home/vagrant/slave/monero-static-win64/build/build/release'
make[3]: Leaving directory '/home/vagrant/slave/monero-static-win64/build/build/release'
make[3]: Entering directory '/home/vagrant/slave/monero-static-win64/build/build/release'
[ 60%] Building CXX object src/simplewallet/CMakeFiles/simplewallet.dir/simplewallet.cpp.obj
In file included from C:/msys64/home/vagrant/slave/monero-static-win64/build/src/cryptonote_protocol/cryptonote_protocol_handler.h:40,
                 from C:/msys64/home/vagrant/slave/monero-static-win64/build/src/simplewallet/simplewallet.cpp:54:
C:/msys64/home/vagrant/slave/monero-static-win64/build/contrib/epee/include/math_helper.h: In member function 'uint64_t epee::math_helper::once_a_time<scale, default_interval, start_immediate>::get_time() const':
C:/msys64/home/vagrant/slave/monero-static-win64/build/contrib/epee/include/math_helper.h:251:5: warning: no return statement in function returning non-void [-Wreturn-type]
     }
     ^
[ 60%] Linking CXX executable ../../bin/monero-wallet-cli.exe
make[3]: Leaving directory '/home/vagrant/slave/monero-static-win64/build/build/release'
[ 60%] Built target simplewallet
make[3]: Entering directory '/home/vagrant/slave/monero-static-win64/build/build/release'
make[3]: Leaving directory '/home/vagrant/slave/monero-static-win64/build/build/release'
make[3]: Entering directory '/home/vagrant/slave/monero-static-win64/build/build/release'
[ 60%] Building CXX object src/gen_multisig/CMakeFiles/gen_multisig.dir/gen_multisig.cpp.obj
[ 61%] Linking CXX executable ../../bin/monero-gen-trusted-multisig.exe
make[3]: Leaving directory '/home/vagrant/slave/monero-static-win64/build/build/release'
[ 61%] Built target gen_multisig
make[3]: Entering directory '/home/vagrant/slave/monero-static-win64/build/build/release'
make[3]: Leaving directory '/home/vagrant/slave/monero-static-win64/build/build/release'
make[3]: Entering directory '/home/vagrant/slave/monero-static-win64/build/build/release'
[ 61%] Building CXX object src/blocks/CMakeFiles/blocks.dir/blocks.cpp.obj
[ 61%] Building C object src/blocks/CMakeFiles/blocks.dir/generated_checkpoints.c.obj
[ 61%] Building C object src/blocks/CMakeFiles/blocks.dir/generated_testnet_blocks.c.obj
[ 62%] Building C object src/blocks/CMakeFiles/blocks.dir/generated_stagenet_blocks.c.obj
[ 62%] Linking CXX static library libblocks.a
make[3]: Leaving directory '/home/vagrant/slave/monero-static-win64/build/build/release'
[ 63%] Built target blocks
make[3]: Entering directory '/home/vagrant/slave/monero-static-win64/build/build/release'
make[3]: Leaving directory '/home/vagrant/slave/monero-static-win64/build/build/release'
make[3]: Entering directory '/home/vagrant/slave/monero-static-win64/build/build/release'
[ 63%] Building CXX object src/daemon/CMakeFiles/daemon.dir/command_parser_executor.cpp.obj
In file included from C:/msys64/home/vagrant/slave/monero-static-win64/build/src/cryptonote_core/tx_pool.h:43,
                 from C:/msys64/home/vagrant/slave/monero-static-win64/build/src/cryptonote_core/cryptonote_core.h:42,
                 from C:/msys64/home/vagrant/slave/monero-static-win64/build/src/rpc/core_rpc_server.h:39,
                 from C:/msys64/home/vagrant/slave/monero-static-win64/build/src/daemon/rpc_command_executor.h:46,
                 from C:/msys64/home/vagrant/slave/monero-static-win64/build/src/daemon/command_parser_executor.h:41,
                 from C:/msys64/home/vagrant/slave/monero-static-win64/build/src/daemon/command_parser_executor.cpp:32:
C:/msys64/home/vagrant/slave/monero-static-win64/build/contrib/epee/include/math_helper.h: In member function 'uint64_t epee::math_helper::once_a_time<scale, default_interval, start_immediate>::get_time() const':
C:/msys64/home/vagrant/slave/monero-static-win64/build/contrib/epee/include/math_helper.h:251:5: warning: no return statement in function returning non-void [-Wreturn-type]
     }
     ^
[ 64%] Building CXX object src/daemon/CMakeFiles/daemon.dir/command_server.cpp.obj
In file included from C:/msys64/home/vagrant/slave/monero-static-win64/build/src/cryptonote_core/tx_pool.h:43,
                 from C:/msys64/home/vagrant/slave/monero-static-win64/build/src/cryptonote_core/cryptonote_core.h:42,
                 from C:/msys64/home/vagrant/slave/monero-static-win64/build/src/rpc/core_rpc_server.h:39,
                 from C:/msys64/home/vagrant/slave/monero-static-win64/build/src/daemon/rpc_command_executor.h:46,
                 from C:/msys64/home/vagrant/slave/monero-static-win64/build/src/daemon/command_parser_executor.h:41,
                 from C:/msys64/home/vagrant/slave/monero-static-win64/build/src/daemon/command_server.h:45,
                 from C:/msys64/home/vagrant/slave/monero-static-win64/build/src/daemon/command_server.cpp:33:
C:/msys64/home/vagrant/slave/monero-static-win64/build/contrib/epee/include/math_helper.h: In member function 'uint64_t epee::math_helper::once_a_time<scale, default_interval, start_immediate>::get_time() const':
C:/msys64/home/vagrant/slave/monero-static-win64/build/contrib/epee/include/math_helper.h:251:5: warning: no return statement in function returning non-void [-Wreturn-type]
     }
     ^
[ 64%] Building CXX object src/daemon/CMakeFiles/daemon.dir/daemon.cpp.obj
In file included from C:/msys64/home/vagrant/slave/monero-static-win64/build/src/cryptonote_core/tx_pool.h:43,
                 from C:/msys64/home/vagrant/slave/monero-static-win64/build/src/cryptonote_core/cryptonote_core.h:42,
                 from C:/msys64/home/vagrant/slave/monero-static-win64/build/src/rpc/daemon_handler.h:34,
                 from C:/msys64/home/vagrant/slave/monero-static-win64/build/src/daemon/daemon.cpp:36:
C:/msys64/home/vagrant/slave/monero-static-win64/build/contrib/epee/include/math_helper.h: In member function 'uint64_t epee::math_helper::once_a_time<scale, default_interval, start_immediate>::get_time() const':
C:/msys64/home/vagrant/slave/monero-static-win64/build/contrib/epee/include/math_helper.h:251:5: warning: no return statement in function returning non-void [-Wreturn-type]
     }
     ^
In file included from C:/msys64/mingw64/x86_64-w64-mingw32/include/shlobj.h:124,
                 from C:/msys64/home/vagrant/slave/monero-static-win64/build/src/daemonizer/windows_daemonizer.inl:36,
                 from C:/msys64/home/vagrant/slave/monero-static-win64/build/src/daemonizer/daemonizer.h:63,
                 from C:/msys64/home/vagrant/slave/monero-static-win64/build/src/daemon/command_line_args.h:34,
                 from C:/msys64/home/vagrant/slave/monero-static-win64/build/src/daemon/daemon.cpp:47:
C:/msys64/mingw64/x86_64-w64-mingw32/include/shobjidl.h: In function 'HRESULT SHLoadLibraryFromItem(IShellItem*, DWORD, const IID&, void**)':
C:/msys64/mingw64/x86_64-w64-mingw32/include/shobjidl.h:32828: note: -Wmisleading-indentation is disabled from this point onwards, since column-tracking was disabled due to the size of the code/headers
       plib->Release();
 
[ 64%] Building CXX object src/daemon/CMakeFiles/daemon.dir/executor.cpp.obj
[ 64%] Building CXX object src/daemon/CMakeFiles/daemon.dir/main.cpp.obj
In file included from C:/msys64/home/vagrant/slave/monero-static-win64/build/src/cryptonote_core/tx_pool.h:43,
                 from C:/msys64/home/vagrant/slave/monero-static-win64/build/src/cryptonote_core/cryptonote_core.h:42,
                 from C:/msys64/home/vagrant/slave/monero-static-win64/build/src/daemon/main.cpp:35:
C:/msys64/home/vagrant/slave/monero-static-win64/build/contrib/epee/include/math_helper.h: In member function 'uint64_t epee::math_helper::once_a_time<scale, default_interval, start_immediate>::get_time() const':
C:/msys64/home/vagrant/slave/monero-static-win64/build/contrib/epee/include/math_helper.h:251:5: warning: no return statement in function returning non-void [-Wreturn-type]
     }
     ^
In file included from C:/msys64/mingw64/x86_64-w64-mingw32/include/shlobj.h:124,
                 from C:/msys64/home/vagrant/slave/monero-static-win64/build/src/daemonizer/windows_daemonizer.inl:36,
                 from C:/msys64/home/vagrant/slave/monero-static-win64/build/src/daemonizer/daemonizer.h:63,
                 from C:/msys64/home/vagrant/slave/monero-static-win64/build/src/daemon/main.cpp:40:
C:/msys64/mingw64/x86_64-w64-mingw32/include/shobjidl.h: In function 'HRESULT SHLoadLibraryFromItem(IShellItem*, DWORD, const IID&, void**)':
C:/msys64/mingw64/x86_64-w64-mingw32/include/shobjidl.h:32828: note: -Wmisleading-indentation is disabled from this point onwards, since column-tracking was disabled due to the size of the code/headers
       plib->Release();
 
[ 65%] Building CXX object src/daemon/CMakeFiles/daemon.dir/rpc_command_executor.cpp.obj
In file included from C:/msys64/home/vagrant/slave/monero-static-win64/build/src/cryptonote_core/tx_pool.h:43,
                 from C:/msys64/home/vagrant/slave/monero-static-win64/build/src/cryptonote_core/cryptonote_core.h:42,
                 from C:/msys64/home/vagrant/slave/monero-static-win64/build/src/rpc/core_rpc_server.h:39,
                 from C:/msys64/home/vagrant/slave/monero-static-win64/build/src/daemon/rpc_command_executor.h:46,
                 from C:/msys64/home/vagrant/slave/monero-static-win64/build/src/daemon/rpc_command_executor.cpp:35:
C:/msys64/home/vagrant/slave/monero-static-win64/build/contrib/epee/include/math_helper.h: In member function 'uint64_t epee::math_helper::once_a_time<scale, default_interval, start_immediate>::get_time() const':
C:/msys64/home/vagrant/slave/monero-static-win64/build/contrib/epee/include/math_helper.h:251:5: warning: no return statement in function returning non-void [-Wreturn-type]
     }
     ^
[ 65%] Linking CXX executable ../../bin/monerod.exe
make[3]: Leaving directory '/home/vagrant/slave/monero-static-win64/build/build/release'
[ 65%] Built target daemon
make[3]: Entering directory '/home/vagrant/slave/monero-static-win64/build/build/release'
make[3]: Leaving directory '/home/vagrant/slave/monero-static-win64/build/build/release'
make[3]: Entering directory '/home/vagrant/slave/monero-static-win64/build/build/release'
[ 65%] Building CXX object src/blockchain_utilities/CMakeFiles/blockchain_prune_known_spent_data.dir/blockchain_prune_known_spent_data.cpp.obj
In file included from C:/msys64/home/vagrant/slave/monero-static-win64/build/src/cryptonote_core/tx_pool.h:43,
                 from C:/msys64/home/vagrant/slave/monero-static-win64/build/src/blockchain_utilities/blockchain_prune_known_spent_data.cpp:32:
C:/msys64/home/vagrant/slave/monero-static-win64/build/contrib/epee/include/math_helper.h: In member function 'uint64_t epee::math_helper::once_a_time<scale, default_interval, start_immediate>::get_time() const':
C:/msys64/home/vagrant/slave/monero-static-win64/build/contrib/epee/include/math_helper.h:251:5: warning: no return statement in function returning non-void [-Wreturn-type]
     }
     ^
[ 65%] Linking CXX executable ../../bin/monero-blockchain-prune-known-spent-data.exe
make[3]: Leaving directory '/home/vagrant/slave/monero-static-win64/build/build/release'
[ 65%] Built target blockchain_prune_known_spent_data
make[3]: Entering directory '/home/vagrant/slave/monero-static-win64/build/build/release'
make[3]: Leaving directory '/home/vagrant/slave/monero-static-win64/build/build/release'
make[3]: Entering directory '/home/vagrant/slave/monero-static-win64/build/build/release'
[ 65%] Building CXX object src/blockchain_utilities/CMakeFiles/blockchain_stats.dir/blockchain_stats.cpp.obj
In file included from C:/msys64/home/vagrant/slave/monero-static-win64/build/src/cryptonote_core/tx_pool.h:43,
                 from C:/msys64/home/vagrant/slave/monero-static-win64/build/src/blockchain_utilities/blockchain_stats.cpp:33:
C:/msys64/home/vagrant/slave/monero-static-win64/build/contrib/epee/include/math_helper.h: In member function 'uint64_t epee::math_helper::once_a_time<scale, default_interval, start_immediate>::get_time() const':
C:/msys64/home/vagrant/slave/monero-static-win64/build/contrib/epee/include/math_helper.h:251:5: warning: no return statement in function returning non-void [-Wreturn-type]
     }
     ^
[ 66%] Linking CXX executable ../../bin/monero-blockchain-stats.exe
make[3]: Leaving directory '/home/vagrant/slave/monero-static-win64/build/build/release'
[ 66%] Built target blockchain_stats
make[3]: Entering directory '/home/vagrant/slave/monero-static-win64/build/build/release'
make[3]: Leaving directory '/home/vagrant/slave/monero-static-win64/build/build/release'
make[3]: Entering directory '/home/vagrant/slave/monero-static-win64/build/build/release'
[ 67%] Building CXX object src/blockchain_utilities/CMakeFiles/blockchain_export.dir/blockchain_export.cpp.obj
In file included from C:/msys64/home/vagrant/slave/monero-static-win64/build/src/cryptonote_core/tx_pool.h:43,
                 from C:/msys64/home/vagrant/slave/monero-static-win64/build/src/blockchain_utilities/blockchain_export.cpp:32:
C:/msys64/home/vagrant/slave/monero-static-win64/build/contrib/epee/include/math_helper.h: In member function 'uint64_t epee::math_helper::once_a_time<scale, default_interval, start_immediate>::get_time() const':
C:/msys64/home/vagrant/slave/monero-static-win64/build/contrib/epee/include/math_helper.h:251:5: warning: no return statement in function returning non-void [-Wreturn-type]
     }
     ^
[ 67%] Building CXX object src/blockchain_utilities/CMakeFiles/blockchain_export.dir/bootstrap_file.cpp.obj
[ 67%] Building CXX object src/blockchain_utilities/CMakeFiles/blockchain_export.dir/blocksdat_file.cpp.obj
[ 67%] Linking CXX executable ../../bin/monero-blockchain-export.exe
make[3]: Leaving directory '/home/vagrant/slave/monero-static-win64/build/build/release'
[ 67%] Built target blockchain_export
make[3]: Entering directory '/home/vagrant/slave/monero-static-win64/build/build/release'
make[3]: Leaving directory '/home/vagrant/slave/monero-static-win64/build/build/release'
make[3]: Entering directory '/home/vagrant/slave/monero-static-win64/build/build/release'
[ 68%] Building CXX object src/blockchain_utilities/CMakeFiles/blockchain_import.dir/blockchain_import.cpp.obj
In file included from C:/msys64/home/vagrant/slave/monero-static-win64/build/src/cryptonote_core/tx_pool.h:43,
                 from C:/msys64/home/vagrant/slave/monero-static-win64/build/src/cryptonote_core/cryptonote_core.h:42,
                 from C:/msys64/home/vagrant/slave/monero-static-win64/build/src/blockchain_utilities/blockchain_import.cpp:46:
C:/msys64/home/vagrant/slave/monero-static-win64/build/contrib/epee/include/math_helper.h: In member function 'uint64_t epee::math_helper::once_a_time<scale, default_interval, start_immediate>::get_time() const':
C:/msys64/home/vagrant/slave/monero-static-win64/build/contrib/epee/include/math_helper.h:251:5: warning: no return statement in function returning non-void [-Wreturn-type]
     }
     ^
[ 68%] Building CXX object src/blockchain_utilities/CMakeFiles/blockchain_import.dir/bootstrap_file.cpp.obj
[ 68%] Building CXX object src/blockchain_utilities/CMakeFiles/blockchain_import.dir/blocksdat_file.cpp.obj
[ 68%] Linking CXX executable ../../bin/monero-blockchain-import.exe
make[3]: Leaving directory '/home/vagrant/slave/monero-static-win64/build/build/release'
[ 68%] Built target blockchain_import
make[3]: Entering directory '/home/vagrant/slave/monero-static-win64/build/build/release'
make[3]: Leaving directory '/home/vagrant/slave/monero-static-win64/build/build/release'
make[3]: Entering directory '/home/vagrant/slave/monero-static-win64/build/build/release'
[ 68%] Building CXX object src/blockchain_utilities/CMakeFiles/blockchain_depth.dir/blockchain_depth.cpp.obj
In file included from C:/msys64/home/vagrant/slave/monero-static-win64/build/src/cryptonote_core/tx_pool.h:43,
                 from C:/msys64/home/vagrant/slave/monero-static-win64/build/src/blockchain_utilities/blockchain_depth.cpp:33:
C:/msys64/home/vagrant/slave/monero-static-win64/build/contrib/epee/include/math_helper.h: In member function 'uint64_t epee::math_helper::once_a_time<scale, default_interval, start_immediate>::get_time() const':
C:/msys64/home/vagrant/slave/monero-static-win64/build/contrib/epee/include/math_helper.h:251:5: warning: no return statement in function returning non-void [-Wreturn-type]
     }
     ^
[ 68%] Linking CXX executable ../../bin/monero-blockchain-depth.exe
make[3]: Leaving directory '/home/vagrant/slave/monero-static-win64/build/build/release'
[ 68%] Built target blockchain_depth
make[3]: Entering directory '/home/vagrant/slave/monero-static-win64/build/build/release'
make[3]: Leaving directory '/home/vagrant/slave/monero-static-win64/build/build/release'
make[3]: Entering directory '/home/vagrant/slave/monero-static-win64/build/build/release'
[ 68%] Building CXX object src/blockchain_utilities/CMakeFiles/blockchain_prune.dir/blockchain_prune.cpp.obj
In file included from C:/msys64/home/vagrant/slave/monero-static-win64/build/src/cryptonote_core/tx_pool.h:43,
                 from C:/msys64/home/vagrant/slave/monero-static-win64/build/src/cryptonote_core/cryptonote_core.h:42,
                 from C:/msys64/home/vagrant/slave/monero-static-win64/build/src/blockchain_utilities/blockchain_prune.cpp:34:
C:/msys64/home/vagrant/slave/monero-static-win64/build/contrib/epee/include/math_helper.h: In member function 'uint64_t epee::math_helper::once_a_time<scale, default_interval, start_immediate>::get_time() const':
C:/msys64/home/vagrant/slave/monero-static-win64/build/contrib/epee/include/math_helper.h:251:5: warning: no return statement in function returning non-void [-Wreturn-type]
     }
     ^
[ 69%] Linking CXX executable ../../bin/monero-blockchain-prune.exe
make[3]: Leaving directory '/home/vagrant/slave/monero-static-win64/build/build/release'
[ 69%] Built target blockchain_prune
make[3]: Entering directory '/home/vagrant/slave/monero-static-win64/build/build/release'
make[3]: Leaving directory '/home/vagrant/slave/monero-static-win64/build/build/release'
make[3]: Entering directory '/home/vagrant/slave/monero-static-win64/build/build/release'
[ 69%] Building CXX object src/blockchain_utilities/CMakeFiles/blockchain_ancestry.dir/blockchain_ancestry.cpp.obj
In file included from C:/msys64/home/vagrant/slave/monero-static-win64/build/src/cryptonote_core/tx_pool.h:43,
                 from C:/msys64/home/vagrant/slave/monero-static-win64/build/src/blockchain_utilities/blockchain_ancestry.cpp:39:
C:/msys64/home/vagrant/slave/monero-static-win64/build/contrib/epee/include/math_helper.h: In member function 'uint64_t epee::math_helper::once_a_time<scale, default_interval, start_immediate>::get_time() const':
C:/msys64/home/vagrant/slave/monero-static-win64/build/contrib/epee/include/math_helper.h:251:5: warning: no return statement in function returning non-void [-Wreturn-type]
     }
     ^
[ 69%] Linking CXX executable ../../bin/monero-blockchain-ancestry.exe
make[3]: Leaving directory '/home/vagrant/slave/monero-static-win64/build/build/release'
[ 69%] Built target blockchain_ancestry
make[3]: Entering directory '/home/vagrant/slave/monero-static-win64/build/build/release'
make[3]: Leaving directory '/home/vagrant/slave/monero-static-win64/build/build/release'
make[3]: Entering directory '/home/vagrant/slave/monero-static-win64/build/build/release'
[ 70%] Building CXX object src/blockchain_utilities/CMakeFiles/blockchain_blackball.dir/blockchain_blackball.cpp.obj
In file included from C:/msys64/home/vagrant/slave/monero-static-win64/build/src/cryptonote_core/tx_pool.h:43,
                 from C:/msys64/home/vagrant/slave/monero-static-win64/build/src/blockchain_utilities/blockchain_blackball.cpp:38:
C:/msys64/home/vagrant/slave/monero-static-win64/build/contrib/epee/include/math_helper.h: In member function 'uint64_t epee::math_helper::once_a_time<scale, default_interval, start_immediate>::get_time() const':
C:/msys64/home/vagrant/slave/monero-static-win64/build/contrib/epee/include/math_helper.h:251:5: warning: no return statement in function returning non-void [-Wreturn-type]
     }
     ^
[ 70%] Linking CXX executable ../../bin/monero-blockchain-mark-spent-outputs.exe
make[3]: Leaving directory '/home/vagrant/slave/monero-static-win64/build/build/release'
[ 70%] Built target blockchain_blackball
make[3]: Entering directory '/home/vagrant/slave/monero-static-win64/build/build/release'
make[3]: Leaving directory '/home/vagrant/slave/monero-static-win64/build/build/release'
make[3]: Entering directory '/home/vagrant/slave/monero-static-win64/build/build/release'
[ 70%] Building CXX object src/blockchain_utilities/CMakeFiles/blockchain_usage.dir/blockchain_usage.cpp.obj
In file included from C:/msys64/home/vagrant/slave/monero-static-win64/build/src/cryptonote_core/tx_pool.h:43,
                 from C:/msys64/home/vagrant/slave/monero-static-win64/build/src/blockchain_utilities/blockchain_usage.cpp:33:
C:/msys64/home/vagrant/slave/monero-static-win64/build/contrib/epee/include/math_helper.h: In member function 'uint64_t epee::math_helper::once_a_time<scale, default_interval, start_immediate>::get_time() const':
C:/msys64/home/vagrant/slave/monero-static-win64/build/contrib/epee/include/math_helper.h:251:5: warning: no return statement in function returning non-void [-Wreturn-type]
     }
     ^
[ 70%] Linking CXX executable ../../bin/monero-blockchain-usage.exe
make[3]: Leaving directory '/home/vagrant/slave/monero-static-win64/build/build/release'
[ 70%] Built target blockchain_usage
make[3]: Entering directory '/home/vagrant/slave/monero-static-win64/build/build/release'
Scanning dependencies of target hash-target-tests
make[3]: Leaving directory '/home/vagrant/slave/monero-static-win64/build/build/release'
make[3]: Entering directory '/home/vagrant/slave/monero-static-win64/build/build/release'
[ 70%] Building CXX object tests/CMakeFiles/hash-target-tests.dir/hash-target.cpp.obj
[ 70%] Linking CXX executable hash-target-tests.exe
make[3]: Leaving directory '/home/vagrant/slave/monero-static-win64/build/build/release'
[ 70%] Built target hash-target-tests
make[3]: Entering directory '/home/vagrant/slave/monero-static-win64/build/build/release'
Scanning dependencies of target core_tests
make[3]: Leaving directory '/home/vagrant/slave/monero-static-win64/build/build/release'
make[3]: Entering directory '/home/vagrant/slave/monero-static-win64/build/build/release'
[ 70%] Building CXX object tests/core_tests/CMakeFiles/core_tests.dir/block_reward.cpp.obj
In file included from C:/msys64/home/vagrant/slave/monero-static-win64/build/src/cryptonote_core/tx_pool.h:43,
                 from C:/msys64/home/vagrant/slave/monero-static-win64/build/src/cryptonote_core/cryptonote_core.h:42,
                 from C:/msys64/home/vagrant/slave/monero-static-win64/build/tests/core_tests/chaingen.h:55,
                 from C:/msys64/home/vagrant/slave/monero-static-win64/build/tests/core_tests/block_reward.cpp:31:
C:/msys64/home/vagrant/slave/monero-static-win64/build/contrib/epee/include/math_helper.h: In member function 'uint64_t epee::math_helper::once_a_time<scale, default_interval, start_immediate>::get_time() const':
C:/msys64/home/vagrant/slave/monero-static-win64/build/contrib/epee/include/math_helper.h:251:5: warning: no return statement in function returning non-void [-Wreturn-type]
     }
     ^
[ 70%] Building CXX object tests/core_tests/CMakeFiles/core_tests.dir/block_validation.cpp.obj
In file included from C:/msys64/home/vagrant/slave/monero-static-win64/build/src/cryptonote_core/tx_pool.h:43,
                 from C:/msys64/home/vagrant/slave/monero-static-win64/build/src/cryptonote_core/cryptonote_core.h:42,
                 from C:/msys64/home/vagrant/slave/monero-static-win64/build/tests/core_tests/chaingen.h:55,
                 from C:/msys64/home/vagrant/slave/monero-static-win64/build/tests/core_tests/block_validation.cpp:31:
C:/msys64/home/vagrant/slave/monero-static-win64/build/contrib/epee/include/math_helper.h: In member function 'uint64_t epee::math_helper::once_a_time<scale, default_interval, start_immediate>::get_time() const':
C:/msys64/home/vagrant/slave/monero-static-win64/build/contrib/epee/include/math_helper.h:251:5: warning: no return statement in function returning non-void [-Wreturn-type]
     }
     ^
[ 70%] Building CXX object tests/core_tests/CMakeFiles/core_tests.dir/chain_split_1.cpp.obj
In file included from C:/msys64/home/vagrant/slave/monero-static-win64/build/src/cryptonote_core/tx_pool.h:43,
                 from C:/msys64/home/vagrant/slave/monero-static-win64/build/src/cryptonote_core/cryptonote_core.h:42,
                 from C:/msys64/home/vagrant/slave/monero-static-win64/build/tests/core_tests/chaingen.h:55,
                 from C:/msys64/home/vagrant/slave/monero-static-win64/build/tests/core_tests/chain_split_1.cpp:31:
C:/msys64/home/vagrant/slave/monero-static-win64/build/contrib/epee/include/math_helper.h: In member function 'uint64_t epee::math_helper::once_a_time<scale, default_interval, start_immediate>::get_time() const':
C:/msys64/home/vagrant/slave/monero-static-win64/build/contrib/epee/include/math_helper.h:251:5: warning: no return statement in function returning non-void [-Wreturn-type]
     }
     ^
[ 70%] Building CXX object tests/core_tests/CMakeFiles/core_tests.dir/chain_switch_1.cpp.obj
In file included from C:/msys64/home/vagrant/slave/monero-static-win64/build/src/cryptonote_core/tx_pool.h:43,
                 from C:/msys64/home/vagrant/slave/monero-static-win64/build/src/cryptonote_core/cryptonote_core.h:42,
                 from C:/msys64/home/vagrant/slave/monero-static-win64/build/tests/core_tests/chaingen.h:55,
                 from C:/msys64/home/vagrant/slave/monero-static-win64/build/tests/core_tests/chain_switch_1.cpp:31:
C:/msys64/home/vagrant/slave/monero-static-win64/build/contrib/epee/include/math_helper.h: In member function 'uint64_t epee::math_helper::once_a_time<scale, default_interval, start_immediate>::get_time() const':
C:/msys64/home/vagrant/slave/monero-static-win64/build/contrib/epee/include/math_helper.h:251:5: warning: no return statement in function returning non-void [-Wreturn-type]
     }
     ^
[ 71%] Building CXX object tests/core_tests/CMakeFiles/core_tests.dir/chaingen.cpp.obj
In file included from C:/msys64/home/vagrant/slave/monero-static-win64/build/src/p2p/net_node.h:53,
                 from C:/msys64/home/vagrant/slave/monero-static-win64/build/tests/core_tests/chaingen.cpp:44:
C:/msys64/home/vagrant/slave/monero-static-win64/build/contrib/epee/include/math_helper.h: In member function 'uint64_t epee::math_helper::once_a_time<scale, default_interval, start_immediate>::get_time() const':
C:/msys64/home/vagrant/slave/monero-static-win64/build/contrib/epee/include/math_helper.h:251:5: warning: no return statement in function returning non-void [-Wreturn-type]
     }
     ^
[ 71%] Building CXX object tests/core_tests/CMakeFiles/core_tests.dir/chaingen001.cpp.obj
In file included from C:/msys64/home/vagrant/slave/monero-static-win64/build/src/cryptonote_core/tx_pool.h:43,
                 from C:/msys64/home/vagrant/slave/monero-static-win64/build/src/cryptonote_core/cryptonote_core.h:42,
                 from C:/msys64/home/vagrant/slave/monero-static-win64/build/tests/core_tests/chaingen.h:55,
                 from C:/msys64/home/vagrant/slave/monero-static-win64/build/tests/core_tests/chaingen001.cpp:41:
C:/msys64/home/vagrant/slave/monero-static-win64/build/contrib/epee/include/math_helper.h: In member function 'uint64_t epee::math_helper::once_a_time<scale, default_interval, start_immediate>::get_time() const':
C:/msys64/home/vagrant/slave/monero-static-win64/build/contrib/epee/include/math_helper.h:251:5: warning: no return statement in function returning non-void [-Wreturn-type]
     }
     ^
[ 71%] Building CXX object tests/core_tests/CMakeFiles/core_tests.dir/chaingen_main.cpp.obj
In file included from C:/msys64/home/vagrant/slave/monero-static-win64/build/src/cryptonote_core/tx_pool.h:43,
                 from C:/msys64/home/vagrant/slave/monero-static-win64/build/src/cryptonote_core/cryptonote_core.h:42,
                 from C:/msys64/home/vagrant/slave/monero-static-win64/build/tests/core_tests/chaingen.h:55,
                 from C:/msys64/home/vagrant/slave/monero-static-win64/build/tests/core_tests/chaingen_main.cpp:31:
C:/msys64/home/vagrant/slave/monero-static-win64/build/contrib/epee/include/math_helper.h: In member function 'uint64_t epee::math_helper::once_a_time<scale, default_interval, start_immediate>::get_time() const':
C:/msys64/home/vagrant/slave/monero-static-win64/build/contrib/epee/include/math_helper.h:251:5: warning: no return statement in function returning non-void [-Wreturn-type]
     }
     ^
[ 71%] Building CXX object tests/core_tests/CMakeFiles/core_tests.dir/double_spend.cpp.obj
In file included from C:/msys64/home/vagrant/slave/monero-static-win64/build/src/cryptonote_core/tx_pool.h:43,
                 from C:/msys64/home/vagrant/slave/monero-static-win64/build/src/cryptonote_core/cryptonote_core.h:42,
                 from C:/msys64/home/vagrant/slave/monero-static-win64/build/tests/core_tests/chaingen.h:55,
                 from C:/msys64/home/vagrant/slave/monero-static-win64/build/tests/core_tests/double_spend.cpp:31:
C:/msys64/home/vagrant/slave/monero-static-win64/build/contrib/epee/include/math_helper.h: In member function 'uint64_t epee::math_helper::once_a_time<scale, default_interval, start_immediate>::get_time() const':
C:/msys64/home/vagrant/slave/monero-static-win64/build/contrib/epee/include/math_helper.h:251:5: warning: no return statement in function returning non-void [-Wreturn-type]
     }
     ^
[ 72%] Building CXX object tests/core_tests/CMakeFiles/core_tests.dir/integer_overflow.cpp.obj
In file included from C:/msys64/home/vagrant/slave/monero-static-win64/build/src/cryptonote_core/tx_pool.h:43,
                 from C:/msys64/home/vagrant/slave/monero-static-win64/build/src/cryptonote_core/cryptonote_core.h:42,
                 from C:/msys64/home/vagrant/slave/monero-static-win64/build/tests/core_tests/chaingen.h:55,
                 from C:/msys64/home/vagrant/slave/monero-static-win64/build/tests/core_tests/integer_overflow.cpp:31:
C:/msys64/home/vagrant/slave/monero-static-win64/build/contrib/epee/include/math_helper.h: In member function 'uint64_t epee::math_helper::once_a_time<scale, default_interval, start_immediate>::get_time() const':
C:/msys64/home/vagrant/slave/monero-static-win64/build/contrib/epee/include/math_helper.h:251:5: warning: no return statement in function returning non-void [-Wreturn-type]
     }
     ^
[ 72%] Building CXX object tests/core_tests/CMakeFiles/core_tests.dir/multisig.cpp.obj
In file included from C:/msys64/home/vagrant/slave/monero-static-win64/build/src/cryptonote_core/tx_pool.h:43,
                 from C:/msys64/home/vagrant/slave/monero-static-win64/build/src/cryptonote_core/cryptonote_core.h:42,
                 from C:/msys64/home/vagrant/slave/monero-static-win64/build/tests/core_tests/chaingen.h:55,
                 from C:/msys64/home/vagrant/slave/monero-static-win64/build/tests/core_tests/multisig.cpp:35:
C:/msys64/home/vagrant/slave/monero-static-win64/build/contrib/epee/include/math_helper.h: In member function 'uint64_t epee::math_helper::once_a_time<scale, default_interval, start_immediate>::get_time() const':
C:/msys64/home/vagrant/slave/monero-static-win64/build/contrib/epee/include/math_helper.h:251:5: warning: no return statement in function returning non-void [-Wreturn-type]
     }
     ^
[ 72%] Building CXX object tests/core_tests/CMakeFiles/core_tests.dir/ring_signature_1.cpp.obj
In file included from C:/msys64/home/vagrant/slave/monero-static-win64/build/src/cryptonote_core/tx_pool.h:43,
                 from C:/msys64/home/vagrant/slave/monero-static-win64/build/src/cryptonote_core/cryptonote_core.h:42,
                 from C:/msys64/home/vagrant/slave/monero-static-win64/build/tests/core_tests/chaingen.h:55,
                 from C:/msys64/home/vagrant/slave/monero-static-win64/build/tests/core_tests/ring_signature_1.cpp:31:
C:/msys64/home/vagrant/slave/monero-static-win64/build/contrib/epee/include/math_helper.h: In member function 'uint64_t epee::math_helper::once_a_time<scale, default_interval, start_immediate>::get_time() const':
C:/msys64/home/vagrant/slave/monero-static-win64/build/contrib/epee/include/math_helper.h:251:5: warning: no return statement in function returning non-void [-Wreturn-type]
     }
     ^
[ 72%] Building CXX object tests/core_tests/CMakeFiles/core_tests.dir/transaction_tests.cpp.obj
[ 72%] Building CXX object tests/core_tests/CMakeFiles/core_tests.dir/tx_validation.cpp.obj
In file included from C:/msys64/home/vagrant/slave/monero-static-win64/build/src/cryptonote_core/tx_pool.h:43,
                 from C:/msys64/home/vagrant/slave/monero-static-win64/build/src/cryptonote_core/cryptonote_core.h:42,
                 from C:/msys64/home/vagrant/slave/monero-static-win64/build/tests/core_tests/chaingen.h:55,
                 from C:/msys64/home/vagrant/slave/monero-static-win64/build/tests/core_tests/tx_validation.cpp:31:
C:/msys64/home/vagrant/slave/monero-static-win64/build/contrib/epee/include/math_helper.h: In member function 'uint64_t epee::math_helper::once_a_time<scale, default_interval, start_immediate>::get_time() const':
C:/msys64/home/vagrant/slave/monero-static-win64/build/contrib/epee/include/math_helper.h:251:5: warning: no return statement in function returning non-void [-Wreturn-type]
     }
     ^
[ 73%] Building CXX object tests/core_tests/CMakeFiles/core_tests.dir/v2_tests.cpp.obj
In file included from C:/msys64/home/vagrant/slave/monero-static-win64/build/src/cryptonote_core/tx_pool.h:43,
                 from C:/msys64/home/vagrant/slave/monero-static-win64/build/src/cryptonote_core/cryptonote_core.h:42,
                 from C:/msys64/home/vagrant/slave/monero-static-win64/build/tests/core_tests/chaingen.h:55,
                 from C:/msys64/home/vagrant/slave/monero-static-win64/build/tests/core_tests/v2_tests.cpp:31:
C:/msys64/home/vagrant/slave/monero-static-win64/build/contrib/epee/include/math_helper.h: In member function 'uint64_t epee::math_helper::once_a_time<scale, default_interval, start_immediate>::get_time() const':
C:/msys64/home/vagrant/slave/monero-static-win64/build/contrib/epee/include/math_helper.h:251:5: warning: no return statement in function returning non-void [-Wreturn-type]
     }
     ^
[ 73%] Building CXX object tests/core_tests/CMakeFiles/core_tests.dir/rct.cpp.obj
In file included from C:/msys64/home/vagrant/slave/monero-static-win64/build/src/cryptonote_core/tx_pool.h:43,
                 from C:/msys64/home/vagrant/slave/monero-static-win64/build/src/cryptonote_core/cryptonote_core.h:42,
                 from C:/msys64/home/vagrant/slave/monero-static-win64/build/tests/core_tests/chaingen.h:55,
                 from C:/msys64/home/vagrant/slave/monero-static-win64/build/tests/core_tests/rct.cpp:32:
C:/msys64/home/vagrant/slave/monero-static-win64/build/contrib/epee/include/math_helper.h: In member function 'uint64_t epee::math_helper::once_a_time<scale, default_interval, start_immediate>::get_time() const':
C:/msys64/home/vagrant/slave/monero-static-win64/build/contrib/epee/include/math_helper.h:251:5: warning: no return statement in function returning non-void [-Wreturn-type]
     }
     ^
[ 73%] Building CXX object tests/core_tests/CMakeFiles/core_tests.dir/bulletproofs.cpp.obj
In file included from C:/msys64/home/vagrant/slave/monero-static-win64/build/src/cryptonote_core/tx_pool.h:43,
                 from C:/msys64/home/vagrant/slave/monero-static-win64/build/src/cryptonote_core/cryptonote_core.h:42,
                 from C:/msys64/home/vagrant/slave/monero-static-win64/build/tests/core_tests/chaingen.h:55,
                 from C:/msys64/home/vagrant/slave/monero-static-win64/build/tests/core_tests/bulletproofs.cpp:33:
C:/msys64/home/vagrant/slave/monero-static-win64/build/contrib/epee/include/math_helper.h: In member function 'uint64_t epee::math_helper::once_a_time<scale, default_interval, start_immediate>::get_time() const':
C:/msys64/home/vagrant/slave/monero-static-win64/build/contrib/epee/include/math_helper.h:251:5: warning: no return statement in function returning non-void [-Wreturn-type]
     }
     ^
[ 73%] Building CXX object tests/core_tests/CMakeFiles/core_tests.dir/wallet_tools.cpp.obj
In file included from C:/msys64/home/vagrant/slave/monero-static-win64/build/src/cryptonote_core/tx_pool.h:43,
                 from C:/msys64/home/vagrant/slave/monero-static-win64/build/src/cryptonote_core/cryptonote_core.h:42,
                 from C:/msys64/home/vagrant/slave/monero-static-win64/build/tests/core_tests/chaingen.h:55,
                 from C:/msys64/home/vagrant/slave/monero-static-win64/build/tests/core_tests/wallet_tools.h:33,
                 from C:/msys64/home/vagrant/slave/monero-static-win64/build/tests/core_tests/wallet_tools.cpp:5:
C:/msys64/home/vagrant/slave/monero-static-win64/build/contrib/epee/include/math_helper.h: In member function 'uint64_t epee::math_helper::once_a_time<scale, default_interval, start_immediate>::get_time() const':
C:/msys64/home/vagrant/slave/monero-static-win64/build/contrib/epee/include/math_helper.h:251:5: warning: no return statement in function returning non-void [-Wreturn-type]
     }
     ^
[ 74%] Linking CXX executable core_tests.exe
make[3]: Leaving directory '/home/vagrant/slave/monero-static-win64/build/build/release'
[ 74%] Built target core_tests
make[3]: Entering directory '/home/vagrant/slave/monero-static-win64/build/build/release'
Scanning dependencies of target base58_fuzz_tests
make[3]: Leaving directory '/home/vagrant/slave/monero-static-win64/build/build/release'
make[3]: Entering directory '/home/vagrant/slave/monero-static-win64/build/build/release'
[ 74%] Building CXX object tests/fuzz/CMakeFiles/base58_fuzz_tests.dir/base58.cpp.obj
[ 74%] Building CXX object tests/fuzz/CMakeFiles/base58_fuzz_tests.dir/fuzzer.cpp.obj
[ 74%] Linking CXX executable base58_fuzz_tests.exe
make[3]: Leaving directory '/home/vagrant/slave/monero-static-win64/build/build/release'
[ 74%] Built target base58_fuzz_tests
make[3]: Entering directory '/home/vagrant/slave/monero-static-win64/build/build/release'
Scanning dependencies of target load-from-binary_fuzz_tests
make[3]: Leaving directory '/home/vagrant/slave/monero-static-win64/build/build/release'
make[3]: Entering directory '/home/vagrant/slave/monero-static-win64/build/build/release'
[ 74%] Building CXX object tests/fuzz/CMakeFiles/load-from-binary_fuzz_tests.dir/load_from_binary.cpp.obj
[ 74%] Building CXX object tests/fuzz/CMakeFiles/load-from-binary_fuzz_tests.dir/fuzzer.cpp.obj
[ 74%] Linking CXX executable load-from-binary_fuzz_tests.exe
make[3]: Leaving directory '/home/vagrant/slave/monero-static-win64/build/build/release'
[ 74%] Built target load-from-binary_fuzz_tests
make[3]: Entering directory '/home/vagrant/slave/monero-static-win64/build/build/release'
Scanning dependencies of target signature_fuzz_tests
make[3]: Leaving directory '/home/vagrant/slave/monero-static-win64/build/build/release'
make[3]: Entering directory '/home/vagrant/slave/monero-static-win64/build/build/release'
[ 74%] Building CXX object tests/fuzz/CMakeFiles/signature_fuzz_tests.dir/signature.cpp.obj
[ 74%] Building CXX object tests/fuzz/CMakeFiles/signature_fuzz_tests.dir/fuzzer.cpp.obj
[ 75%] Linking CXX executable signature_fuzz_tests.exe
make[3]: Leaving directory '/home/vagrant/slave/monero-static-win64/build/build/release'
make[2]: Leaving directory '/home/vagrant/slave/monero-static-win64/build/build/release'
make[1]: Leaving directory '/home/vagrant/slave/monero-static-win64/build/build/release'
../../external/unbound/libunbound.a(net_help.c.obj):net_help.c:(.text+0x15f8): undefined reference to `__imp_CertOpenStore'
../../external/unbound/libunbound.a(net_help.c.obj):net_help.c:(.text+0x1624): undefined reference to `__imp_CertEnumCertificatesInStore'
../../external/unbound/libunbound.a(net_help.c.obj):net_help.c:(.text+0x184a): undefined reference to `__imp_CertCloseStore'
collect2.exe: error: ld returned 1 exit status
make[3]: *** [tests/fuzz/CMakeFiles/signature_fuzz_tests.dir/build.make:138: tests/fuzz/signature_fuzz_tests.exe] Error 1
make[2]: *** [CMakeFiles/Makefile2:4242: tests/fuzz/CMakeFiles/signature_fuzz_tests.dir/all] Error 2
make[1]: *** [Makefile:141: all] Error 2
make: *** [Makefile:95: release-test] Error 2
program finished with exit code 2
elapsedTime=2328.049000