(view as text)
Determining if the function memset_s exists in the c failed with the following output:
Change Dir: C:/msys64/home/vagrant/slave/monero-static-win64/build/build/release/CMakeFiles/CMakeTmp

Run Build Command:"C:/msys64/usr/bin/make.exe" "cmTC_c0e9c/fast"
make[1]: Entering directory '/home/vagrant/slave/monero-static-win64/build/build/release/CMakeFiles/CMakeTmp'
/usr/bin/make -f CMakeFiles/cmTC_c0e9c.dir/build.make CMakeFiles/cmTC_c0e9c.dir/build
make[2]: Entering directory '/home/vagrant/slave/monero-static-win64/build/build/release/CMakeFiles/CMakeTmp'
Building C object CMakeFiles/cmTC_c0e9c.dir/CheckFunctionExists.c.obj

/C/msys64/mingw64/bin/x86_64-w64-mingw32-gcc.exe   -DCHECK_FUNCTION_EXISTS=memset_s   -o CMakeFiles/cmTC_c0e9c.dir/CheckFunctionExists.c.obj   -c /C/msys64/mingw64/share/cmake-3.12/Modules/CheckFunctionExists.c
Linking C executable cmTC_c0e9c.exe

/C/msys64/mingw64/bin/cmake.exe -E remove -f CMakeFiles/cmTC_c0e9c.dir/objects.a
ar cr CMakeFiles/cmTC_c0e9c.dir/objects.a "CMakeFiles/cmTC_c0e9c.dir/CheckFunctionExists.c.obj" 
/C/msys64/mingw64/bin/x86_64-w64-mingw32-gcc.exe  -DCHECK_FUNCTION_EXISTS=memset_s    -Wl,--whole-archive CMakeFiles/cmTC_c0e9c.dir/objects.a -Wl,--no-whole-archive  -o cmTC_c0e9c.exe -Wl,--major-image-version,0,--minor-image-version,0  -L/C/msys64/home/vagrant/slave/monero-static-win64/build/build/release/CMakeFiles/CMakeTmp/string.h -lc -lkernel32 -luser32 -lgdi32 -lwinspool -lshell32 -lole32 -loleaut32 -luuid -lcomdlg32 -ladvapi32 
C:/msys64/mingw64/bin/../lib/gcc/x86_64-w64-mingw32/8.2.1/../../../../x86_64-w64-mingw32/bin/ld.exe: cannot find -lc

collect2.exe: error: ld returned 1 exit status
make[2]: *** [CMakeFiles/cmTC_c0e9c.dir/build.make:88: cmTC_c0e9c.exe] Error 1
make[2]: Leaving directory '/home/vagrant/slave/monero-static-win64/build/build/release/CMakeFiles/CMakeTmp'
make[1]: *** [Makefile:121: cmTC_c0e9c/fast] Error 2
make[1]: Leaving directory '/home/vagrant/slave/monero-static-win64/build/build/release/CMakeFiles/CMakeTmp'


Determining if the function explicit_bzero exists in the c failed with the following output:
Change Dir: C:/msys64/home/vagrant/slave/monero-static-win64/build/build/release/CMakeFiles/CMakeTmp

Run Build Command:"C:/msys64/usr/bin/make.exe" "cmTC_c345e/fast"
make[1]: Entering directory '/home/vagrant/slave/monero-static-win64/build/build/release/CMakeFiles/CMakeTmp'
/usr/bin/make -f CMakeFiles/cmTC_c345e.dir/build.make CMakeFiles/cmTC_c345e.dir/build
make[2]: Entering directory '/home/vagrant/slave/monero-static-win64/build/build/release/CMakeFiles/CMakeTmp'
Building C object CMakeFiles/cmTC_c345e.dir/CheckFunctionExists.c.obj

/C/msys64/mingw64/bin/x86_64-w64-mingw32-gcc.exe   -DCHECK_FUNCTION_EXISTS=explicit_bzero   -o CMakeFiles/cmTC_c345e.dir/CheckFunctionExists.c.obj   -c /C/msys64/mingw64/share/cmake-3.12/Modules/CheckFunctionExists.c
Linking C executable cmTC_c345e.exe

/C/msys64/mingw64/bin/cmake.exe -E remove -f CMakeFiles/cmTC_c345e.dir/objects.a
ar cr CMakeFiles/cmTC_c345e.dir/objects.a "CMakeFiles/cmTC_c345e.dir/CheckFunctionExists.c.obj" 
/C/msys64/mingw64/bin/x86_64-w64-mingw32-gcc.exe  -DCHECK_FUNCTION_EXISTS=explicit_bzero    -Wl,--whole-archive CMakeFiles/cmTC_c345e.dir/objects.a -Wl,--no-whole-archive  -o cmTC_c345e.exe -Wl,--major-image-version,0,--minor-image-version,0  -L/C/msys64/home/vagrant/slave/monero-static-win64/build/build/release/CMakeFiles/CMakeTmp/strings.h -lc -lkernel32 -luser32 -lgdi32 -lwinspool -lshell32 -lole32 -loleaut32 -luuid -lcomdlg32 -ladvapi32 
C:/msys64/mingw64/bin/../lib/gcc/x86_64-w64-mingw32/8.2.1/../../../../x86_64-w64-mingw32/bin/ld.exe: cannot find -lc

collect2.exe: error: ld returned 1 exit status
make[2]: *** [CMakeFiles/cmTC_c345e.dir/build.make:88: cmTC_c345e.exe] Error 1
make[2]: Leaving directory '/home/vagrant/slave/monero-static-win64/build/build/release/CMakeFiles/CMakeTmp'
make[1]: *** [Makefile:121: cmTC_c345e/fast] Error 2
make[1]: Leaving directory '/home/vagrant/slave/monero-static-win64/build/build/release/CMakeFiles/CMakeTmp'


Determining if the function strptime exists failed with the following output:
Change Dir: C:/msys64/home/vagrant/slave/monero-static-win64/build/build/release/CMakeFiles/CMakeTmp

Run Build Command:"C:/msys64/usr/bin/make.exe" "cmTC_1eb95/fast"
make[1]: Entering directory '/home/vagrant/slave/monero-static-win64/build/build/release/CMakeFiles/CMakeTmp'
/usr/bin/make -f CMakeFiles/cmTC_1eb95.dir/build.make CMakeFiles/cmTC_1eb95.dir/build
make[2]: Entering directory '/home/vagrant/slave/monero-static-win64/build/build/release/CMakeFiles/CMakeTmp'
Building C object CMakeFiles/cmTC_1eb95.dir/CheckFunctionExists.c.obj

/C/msys64/mingw64/bin/x86_64-w64-mingw32-gcc.exe   -DCHECK_FUNCTION_EXISTS=strptime   -o CMakeFiles/cmTC_1eb95.dir/CheckFunctionExists.c.obj   -c /C/msys64/mingw64/share/cmake-3.12/Modules/CheckFunctionExists.c
Linking C executable cmTC_1eb95.exe

/C/msys64/mingw64/bin/cmake.exe -E remove -f CMakeFiles/cmTC_1eb95.dir/objects.a
ar cr CMakeFiles/cmTC_1eb95.dir/objects.a "CMakeFiles/cmTC_1eb95.dir/CheckFunctionExists.c.obj" 
/C/msys64/mingw64/bin/x86_64-w64-mingw32-gcc.exe  -DCHECK_FUNCTION_EXISTS=strptime    -Wl,--whole-archive CMakeFiles/cmTC_1eb95.dir/objects.a -Wl,--no-whole-archive  -o cmTC_1eb95.exe -Wl,--major-image-version,0,--minor-image-version,0 -lkernel32 -luser32 -lgdi32 -lwinspool -lshell32 -lole32 -loleaut32 -luuid -lcomdlg32 -ladvapi32 
CMakeFiles/cmTC_1eb95.dir/objects.a(CheckFunctionExists.c.obj):CheckFunctionExists.c:(.text+0x15): undefined reference to `strptime'

collect2.exe: error: ld returned 1 exit status
make[2]: *** [CMakeFiles/cmTC_1eb95.dir/build.make:88: cmTC_1eb95.exe] Error 1
make[2]: Leaving directory '/home/vagrant/slave/monero-static-win64/build/build/release/CMakeFiles/CMakeTmp'
make[1]: *** [Makefile:121: cmTC_1eb95/fast] Error 2
make[1]: Leaving directory '/home/vagrant/slave/monero-static-win64/build/build/release/CMakeFiles/CMakeTmp'


Determining if the include file arpa/inet.h exists failed with the following output:
Change Dir: C:/msys64/home/vagrant/slave/monero-static-win64/build/build/release/CMakeFiles/CMakeTmp

Run Build Command:"C:/msys64/usr/bin/make.exe" "cmTC_cf0ec/fast"
make[1]: Entering directory '/home/vagrant/slave/monero-static-win64/build/build/release/CMakeFiles/CMakeTmp'
/usr/bin/make -f CMakeFiles/cmTC_cf0ec.dir/build.make CMakeFiles/cmTC_cf0ec.dir/build
make[2]: Entering directory '/home/vagrant/slave/monero-static-win64/build/build/release/CMakeFiles/CMakeTmp'
Building C object CMakeFiles/cmTC_cf0ec.dir/CheckIncludeFile.c.obj

/C/msys64/mingw64/bin/x86_64-w64-mingw32-gcc.exe    -o CMakeFiles/cmTC_cf0ec.dir/CheckIncludeFile.c.obj   -c /C/msys64/home/vagrant/slave/monero-static-win64/build/build/release/CMakeFiles/CMakeTmp/CheckIncludeFile.c
C:/msys64/home/vagrant/slave/monero-static-win64/build/build/release/CMakeFiles/CMakeTmp/CheckIncludeFile.c:1:10: fatal error: arpa/inet.h: No such file or directory
 #include <arpa/inet.h>
          ^~~~~~~~~~~~~
compilation terminated.

make[2]: *** [CMakeFiles/cmTC_cf0ec.dir/build.make:66: CMakeFiles/cmTC_cf0ec.dir/CheckIncludeFile.c.obj] Error 1
make[2]: Leaving directory '/home/vagrant/slave/monero-static-win64/build/build/release/CMakeFiles/CMakeTmp'
make[1]: *** [Makefile:121: cmTC_cf0ec/fast] Error 2
make[1]: Leaving directory '/home/vagrant/slave/monero-static-win64/build/build/release/CMakeFiles/CMakeTmp'


Determining if the include file endian.h exists failed with the following output:
Change Dir: C:/msys64/home/vagrant/slave/monero-static-win64/build/build/release/CMakeFiles/CMakeTmp

Run Build Command:"C:/msys64/usr/bin/make.exe" "cmTC_3f1e9/fast"
make[1]: Entering directory '/home/vagrant/slave/monero-static-win64/build/build/release/CMakeFiles/CMakeTmp'
/usr/bin/make -f CMakeFiles/cmTC_3f1e9.dir/build.make CMakeFiles/cmTC_3f1e9.dir/build
make[2]: Entering directory '/home/vagrant/slave/monero-static-win64/build/build/release/CMakeFiles/CMakeTmp'
Building C object CMakeFiles/cmTC_3f1e9.dir/CheckIncludeFile.c.obj

/C/msys64/mingw64/bin/x86_64-w64-mingw32-gcc.exe    -o CMakeFiles/cmTC_3f1e9.dir/CheckIncludeFile.c.obj   -c /C/msys64/home/vagrant/slave/monero-static-win64/build/build/release/CMakeFiles/CMakeTmp/CheckIncludeFile.c
C:/msys64/home/vagrant/slave/monero-static-win64/build/build/release/CMakeFiles/CMakeTmp/CheckIncludeFile.c:1:10: fatal error: endian.h: No such file or directory
 #include <endian.h>
          ^~~~~~~~~~
compilation terminated.

make[2]: *** [CMakeFiles/cmTC_3f1e9.dir/build.make:66: CMakeFiles/cmTC_3f1e9.dir/CheckIncludeFile.c.obj] Error 1
make[2]: Leaving directory '/home/vagrant/slave/monero-static-win64/build/build/release/CMakeFiles/CMakeTmp'
make[1]: *** [Makefile:121: cmTC_3f1e9/fast] Error 2
make[1]: Leaving directory '/home/vagrant/slave/monero-static-win64/build/build/release/CMakeFiles/CMakeTmp'


Determining if the include file dlfcn.h exists failed with the following output:
Change Dir: C:/msys64/home/vagrant/slave/monero-static-win64/build/build/release/CMakeFiles/CMakeTmp

Run Build Command:"C:/msys64/usr/bin/make.exe" "cmTC_c5cad/fast"
make[1]: Entering directory '/home/vagrant/slave/monero-static-win64/build/build/release/CMakeFiles/CMakeTmp'
/usr/bin/make -f CMakeFiles/cmTC_c5cad.dir/build.make CMakeFiles/cmTC_c5cad.dir/build
make[2]: Entering directory '/home/vagrant/slave/monero-static-win64/build/build/release/CMakeFiles/CMakeTmp'
Building C object CMakeFiles/cmTC_c5cad.dir/CheckIncludeFile.c.obj

/C/msys64/mingw64/bin/x86_64-w64-mingw32-gcc.exe    -o CMakeFiles/cmTC_c5cad.dir/CheckIncludeFile.c.obj   -c /C/msys64/home/vagrant/slave/monero-static-win64/build/build/release/CMakeFiles/CMakeTmp/CheckIncludeFile.c
C:/msys64/home/vagrant/slave/monero-static-win64/build/build/release/CMakeFiles/CMakeTmp/CheckIncludeFile.c:1:10: fatal error: dlfcn.h: No such file or directory
 #include <dlfcn.h>
          ^~~~~~~~~
compilation terminated.

make[2]: *** [CMakeFiles/cmTC_c5cad.dir/build.make:66: CMakeFiles/cmTC_c5cad.dir/CheckIncludeFile.c.obj] Error 1
make[2]: Leaving directory '/home/vagrant/slave/monero-static-win64/build/build/release/CMakeFiles/CMakeTmp'
make[1]: *** [Makefile:121: cmTC_c5cad/fast] Error 2
make[1]: Leaving directory '/home/vagrant/slave/monero-static-win64/build/build/release/CMakeFiles/CMakeTmp'


Determining if the include file event.h exists failed with the following output:
Change Dir: C:/msys64/home/vagrant/slave/monero-static-win64/build/build/release/CMakeFiles/CMakeTmp

Run Build Command:"C:/msys64/usr/bin/make.exe" "cmTC_bb3a8/fast"
make[1]: Entering directory '/home/vagrant/slave/monero-static-win64/build/build/release/CMakeFiles/CMakeTmp'
/usr/bin/make -f CMakeFiles/cmTC_bb3a8.dir/build.make CMakeFiles/cmTC_bb3a8.dir/build
make[2]: Entering directory '/home/vagrant/slave/monero-static-win64/build/build/release/CMakeFiles/CMakeTmp'
Building C object CMakeFiles/cmTC_bb3a8.dir/CheckIncludeFile.c.obj

/C/msys64/mingw64/bin/x86_64-w64-mingw32-gcc.exe    -o CMakeFiles/cmTC_bb3a8.dir/CheckIncludeFile.c.obj   -c /C/msys64/home/vagrant/slave/monero-static-win64/build/build/release/CMakeFiles/CMakeTmp/CheckIncludeFile.c
C:/msys64/home/vagrant/slave/monero-static-win64/build/build/release/CMakeFiles/CMakeTmp/CheckIncludeFile.c:1:10: fatal error: event.h: No such file or directory
 #include <event.h>
          ^~~~~~~~~
compilation terminated.

make[2]: *** [CMakeFiles/cmTC_bb3a8.dir/build.make:66: CMakeFiles/cmTC_bb3a8.dir/CheckIncludeFile.c.obj] Error 1
make[2]: Leaving directory '/home/vagrant/slave/monero-static-win64/build/build/release/CMakeFiles/CMakeTmp'
make[1]: *** [Makefile:121: cmTC_bb3a8/fast] Error 2
make[1]: Leaving directory '/home/vagrant/slave/monero-static-win64/build/build/release/CMakeFiles/CMakeTmp'


Determining if the include file glob.h exists failed with the following output:
Change Dir: C:/msys64/home/vagrant/slave/monero-static-win64/build/build/release/CMakeFiles/CMakeTmp

Run Build Command:"C:/msys64/usr/bin/make.exe" "cmTC_ca751/fast"
make[1]: Entering directory '/home/vagrant/slave/monero-static-win64/build/build/release/CMakeFiles/CMakeTmp'
/usr/bin/make -f CMakeFiles/cmTC_ca751.dir/build.make CMakeFiles/cmTC_ca751.dir/build
make[2]: Entering directory '/home/vagrant/slave/monero-static-win64/build/build/release/CMakeFiles/CMakeTmp'
Building C object CMakeFiles/cmTC_ca751.dir/CheckIncludeFile.c.obj

/C/msys64/mingw64/bin/x86_64-w64-mingw32-gcc.exe    -o CMakeFiles/cmTC_ca751.dir/CheckIncludeFile.c.obj   -c /C/msys64/home/vagrant/slave/monero-static-win64/build/build/release/CMakeFiles/CMakeTmp/CheckIncludeFile.c
C:/msys64/home/vagrant/slave/monero-static-win64/build/build/release/CMakeFiles/CMakeTmp/CheckIncludeFile.c:1:10: fatal error: glob.h: No such file or directory
 #include <glob.h>
          ^~~~~~~~
compilation terminated.

make[2]: *** [CMakeFiles/cmTC_ca751.dir/build.make:66: CMakeFiles/cmTC_ca751.dir/CheckIncludeFile.c.obj] Error 1
make[2]: Leaving directory '/home/vagrant/slave/monero-static-win64/build/build/release/CMakeFiles/CMakeTmp'
make[1]: *** [Makefile:121: cmTC_ca751/fast] Error 2
make[1]: Leaving directory '/home/vagrant/slave/monero-static-win64/build/build/release/CMakeFiles/CMakeTmp'


Determining if the include file grp.h exists failed with the following output:
Change Dir: C:/msys64/home/vagrant/slave/monero-static-win64/build/build/release/CMakeFiles/CMakeTmp

Run Build Command:"C:/msys64/usr/bin/make.exe" "cmTC_37a32/fast"
make[1]: Entering directory '/home/vagrant/slave/monero-static-win64/build/build/release/CMakeFiles/CMakeTmp'
/usr/bin/make -f CMakeFiles/cmTC_37a32.dir/build.make CMakeFiles/cmTC_37a32.dir/build
make[2]: Entering directory '/home/vagrant/slave/monero-static-win64/build/build/release/CMakeFiles/CMakeTmp'
Building C object CMakeFiles/cmTC_37a32.dir/CheckIncludeFile.c.obj

/C/msys64/mingw64/bin/x86_64-w64-mingw32-gcc.exe    -o CMakeFiles/cmTC_37a32.dir/CheckIncludeFile.c.obj   -c /C/msys64/home/vagrant/slave/monero-static-win64/build/build/release/CMakeFiles/CMakeTmp/CheckIncludeFile.c
C:/msys64/home/vagrant/slave/monero-static-win64/build/build/release/CMakeFiles/CMakeTmp/CheckIncludeFile.c:1:10: fatal error: grp.h: No such file or directory
 #include <grp.h>
          ^~~~~~~
compilation terminated.

make[2]: *** [CMakeFiles/cmTC_37a32.dir/build.make:66: CMakeFiles/cmTC_37a32.dir/CheckIncludeFile.c.obj] Error 1
make[2]: Leaving directory '/home/vagrant/slave/monero-static-win64/build/build/release/CMakeFiles/CMakeTmp'
make[1]: *** [Makefile:121: cmTC_37a32/fast] Error 2
make[1]: Leaving directory '/home/vagrant/slave/monero-static-win64/build/build/release/CMakeFiles/CMakeTmp'


Determining if the include file login_cap.h exists failed with the following output:
Change Dir: C:/msys64/home/vagrant/slave/monero-static-win64/build/build/release/CMakeFiles/CMakeTmp

Run Build Command:"C:/msys64/usr/bin/make.exe" "cmTC_fbf8c/fast"
make[1]: Entering directory '/home/vagrant/slave/monero-static-win64/build/build/release/CMakeFiles/CMakeTmp'
/usr/bin/make -f CMakeFiles/cmTC_fbf8c.dir/build.make CMakeFiles/cmTC_fbf8c.dir/build
make[2]: Entering directory '/home/vagrant/slave/monero-static-win64/build/build/release/CMakeFiles/CMakeTmp'
Building C object CMakeFiles/cmTC_fbf8c.dir/CheckIncludeFile.c.obj

/C/msys64/mingw64/bin/x86_64-w64-mingw32-gcc.exe    -o CMakeFiles/cmTC_fbf8c.dir/CheckIncludeFile.c.obj   -c /C/msys64/home/vagrant/slave/monero-static-win64/build/build/release/CMakeFiles/CMakeTmp/CheckIncludeFile.c
C:/msys64/home/vagrant/slave/monero-static-win64/build/build/release/CMakeFiles/CMakeTmp/CheckIncludeFile.c:1:10: fatal error: login_cap.h: No such file or directory
 #include <login_cap.h>
          ^~~~~~~~~~~~~
compilation terminated.

make[2]: *** [CMakeFiles/cmTC_fbf8c.dir/build.make:66: CMakeFiles/cmTC_fbf8c.dir/CheckIncludeFile.c.obj] Error 1
make[2]: Leaving directory '/home/vagrant/slave/monero-static-win64/build/build/release/CMakeFiles/CMakeTmp'
make[1]: *** [Makefile:121: cmTC_fbf8c/fast] Error 2
make[1]: Leaving directory '/home/vagrant/slave/monero-static-win64/build/build/release/CMakeFiles/CMakeTmp'


Determining if the include file netdb.h exists failed with the following output:
Change Dir: C:/msys64/home/vagrant/slave/monero-static-win64/build/build/release/CMakeFiles/CMakeTmp

Run Build Command:"C:/msys64/usr/bin/make.exe" "cmTC_dd1c9/fast"
make[1]: Entering directory '/home/vagrant/slave/monero-static-win64/build/build/release/CMakeFiles/CMakeTmp'
/usr/bin/make -f CMakeFiles/cmTC_dd1c9.dir/build.make CMakeFiles/cmTC_dd1c9.dir/build
make[2]: Entering directory '/home/vagrant/slave/monero-static-win64/build/build/release/CMakeFiles/CMakeTmp'
Building C object CMakeFiles/cmTC_dd1c9.dir/CheckIncludeFile.c.obj

/C/msys64/mingw64/bin/x86_64-w64-mingw32-gcc.exe    -o CMakeFiles/cmTC_dd1c9.dir/CheckIncludeFile.c.obj   -c /C/msys64/home/vagrant/slave/monero-static-win64/build/build/release/CMakeFiles/CMakeTmp/CheckIncludeFile.c
C:/msys64/home/vagrant/slave/monero-static-win64/build/build/release/CMakeFiles/CMakeTmp/CheckIncludeFile.c:1:10: fatal error: netdb.h: No such file or directory
 #include <netdb.h>
          ^~~~~~~~~
compilation terminated.

make[2]: *** [CMakeFiles/cmTC_dd1c9.dir/build.make:66: CMakeFiles/cmTC_dd1c9.dir/CheckIncludeFile.c.obj] Error 1
make[2]: Leaving directory '/home/vagrant/slave/monero-static-win64/build/build/release/CMakeFiles/CMakeTmp'
make[1]: *** [Makefile:121: cmTC_dd1c9/fast] Error 2
make[1]: Leaving directory '/home/vagrant/slave/monero-static-win64/build/build/release/CMakeFiles/CMakeTmp'


Determining if the include file netinet/in.h exists failed with the following output:
Change Dir: C:/msys64/home/vagrant/slave/monero-static-win64/build/build/release/CMakeFiles/CMakeTmp

Run Build Command:"C:/msys64/usr/bin/make.exe" "cmTC_9ca97/fast"
make[1]: Entering directory '/home/vagrant/slave/monero-static-win64/build/build/release/CMakeFiles/CMakeTmp'
/usr/bin/make -f CMakeFiles/cmTC_9ca97.dir/build.make CMakeFiles/cmTC_9ca97.dir/build
make[2]: Entering directory '/home/vagrant/slave/monero-static-win64/build/build/release/CMakeFiles/CMakeTmp'
Building C object CMakeFiles/cmTC_9ca97.dir/CheckIncludeFile.c.obj

/C/msys64/mingw64/bin/x86_64-w64-mingw32-gcc.exe    -o CMakeFiles/cmTC_9ca97.dir/CheckIncludeFile.c.obj   -c /C/msys64/home/vagrant/slave/monero-static-win64/build/build/release/CMakeFiles/CMakeTmp/CheckIncludeFile.c
C:/msys64/home/vagrant/slave/monero-static-win64/build/build/release/CMakeFiles/CMakeTmp/CheckIncludeFile.c:1:10: fatal error: netinet/in.h: No such file or directory
 #include <netinet/in.h>
          ^~~~~~~~~~~~~~
compilation terminated.

make[2]: *** [CMakeFiles/cmTC_9ca97.dir/build.make:66: CMakeFiles/cmTC_9ca97.dir/CheckIncludeFile.c.obj] Error 1
make[2]: Leaving directory '/home/vagrant/slave/monero-static-win64/build/build/release/CMakeFiles/CMakeTmp'
make[1]: *** [Makefile:121: cmTC_9ca97/fast] Error 2
make[1]: Leaving directory '/home/vagrant/slave/monero-static-win64/build/build/release/CMakeFiles/CMakeTmp'


Determining if the include file pwd.h exists failed with the following output:
Change Dir: C:/msys64/home/vagrant/slave/monero-static-win64/build/build/release/CMakeFiles/CMakeTmp

Run Build Command:"C:/msys64/usr/bin/make.exe" "cmTC_1280f/fast"
make[1]: Entering directory '/home/vagrant/slave/monero-static-win64/build/build/release/CMakeFiles/CMakeTmp'
/usr/bin/make -f CMakeFiles/cmTC_1280f.dir/build.make CMakeFiles/cmTC_1280f.dir/build
make[2]: Entering directory '/home/vagrant/slave/monero-static-win64/build/build/release/CMakeFiles/CMakeTmp'
Building C object CMakeFiles/cmTC_1280f.dir/CheckIncludeFile.c.obj

/C/msys64/mingw64/bin/x86_64-w64-mingw32-gcc.exe    -o CMakeFiles/cmTC_1280f.dir/CheckIncludeFile.c.obj   -c /C/msys64/home/vagrant/slave/monero-static-win64/build/build/release/CMakeFiles/CMakeTmp/CheckIncludeFile.c
C:/msys64/home/vagrant/slave/monero-static-win64/build/build/release/CMakeFiles/CMakeTmp/CheckIncludeFile.c:1:10: fatal error: pwd.h: No such file or directory
 #include <pwd.h>
          ^~~~~~~
compilation terminated.

make[2]: *** [CMakeFiles/cmTC_1280f.dir/build.make:66: CMakeFiles/cmTC_1280f.dir/CheckIncludeFile.c.obj] Error 1
make[2]: Leaving directory '/home/vagrant/slave/monero-static-win64/build/build/release/CMakeFiles/CMakeTmp'
make[1]: *** [Makefile:121: cmTC_1280f/fast] Error 2
make[1]: Leaving directory '/home/vagrant/slave/monero-static-win64/build/build/release/CMakeFiles/CMakeTmp'


Determining if the include file sys/resource.h exists failed with the following output:
Change Dir: C:/msys64/home/vagrant/slave/monero-static-win64/build/build/release/CMakeFiles/CMakeTmp

Run Build Command:"C:/msys64/usr/bin/make.exe" "cmTC_ab362/fast"
make[1]: Entering directory '/home/vagrant/slave/monero-static-win64/build/build/release/CMakeFiles/CMakeTmp'
/usr/bin/make -f CMakeFiles/cmTC_ab362.dir/build.make CMakeFiles/cmTC_ab362.dir/build
make[2]: Entering directory '/home/vagrant/slave/monero-static-win64/build/build/release/CMakeFiles/CMakeTmp'
Building C object CMakeFiles/cmTC_ab362.dir/CheckIncludeFile.c.obj

/C/msys64/mingw64/bin/x86_64-w64-mingw32-gcc.exe    -o CMakeFiles/cmTC_ab362.dir/CheckIncludeFile.c.obj   -c /C/msys64/home/vagrant/slave/monero-static-win64/build/build/release/CMakeFiles/CMakeTmp/CheckIncludeFile.c
C:/msys64/home/vagrant/slave/monero-static-win64/build/build/release/CMakeFiles/CMakeTmp/CheckIncludeFile.c:1:10: fatal error: sys/resource.h: No such file or directory
 #include <sys/resource.h>
          ^~~~~~~~~~~~~~~~
compilation terminated.

make[2]: *** [CMakeFiles/cmTC_ab362.dir/build.make:66: CMakeFiles/cmTC_ab362.dir/CheckIncludeFile.c.obj] Error 1
make[2]: Leaving directory '/home/vagrant/slave/monero-static-win64/build/build/release/CMakeFiles/CMakeTmp'
make[1]: *** [Makefile:121: cmTC_ab362/fast] Error 2
make[1]: Leaving directory '/home/vagrant/slave/monero-static-win64/build/build/release/CMakeFiles/CMakeTmp'


Determining if the include file sys/sha2.h exists failed with the following output:
Change Dir: C:/msys64/home/vagrant/slave/monero-static-win64/build/build/release/CMakeFiles/CMakeTmp

Run Build Command:"C:/msys64/usr/bin/make.exe" "cmTC_56c84/fast"
make[1]: Entering directory '/home/vagrant/slave/monero-static-win64/build/build/release/CMakeFiles/CMakeTmp'
/usr/bin/make -f CMakeFiles/cmTC_56c84.dir/build.make CMakeFiles/cmTC_56c84.dir/build
make[2]: Entering directory '/home/vagrant/slave/monero-static-win64/build/build/release/CMakeFiles/CMakeTmp'
Building C object CMakeFiles/cmTC_56c84.dir/CheckIncludeFile.c.obj

/C/msys64/mingw64/bin/x86_64-w64-mingw32-gcc.exe    -o CMakeFiles/cmTC_56c84.dir/CheckIncludeFile.c.obj   -c /C/msys64/home/vagrant/slave/monero-static-win64/build/build/release/CMakeFiles/CMakeTmp/CheckIncludeFile.c
C:/msys64/home/vagrant/slave/monero-static-win64/build/build/release/CMakeFiles/CMakeTmp/CheckIncludeFile.c:1:10: fatal error: sys/sha2.h: No such file or directory
 #include <sys/sha2.h>
          ^~~~~~~~~~~~
compilation terminated.

make[2]: *** [CMakeFiles/cmTC_56c84.dir/build.make:66: CMakeFiles/cmTC_56c84.dir/CheckIncludeFile.c.obj] Error 1
make[2]: Leaving directory '/home/vagrant/slave/monero-static-win64/build/build/release/CMakeFiles/CMakeTmp'
make[1]: *** [Makefile:121: cmTC_56c84/fast] Error 2
make[1]: Leaving directory '/home/vagrant/slave/monero-static-win64/build/build/release/CMakeFiles/CMakeTmp'


Determining if the include file sys/socket.h exists failed with the following output:
Change Dir: C:/msys64/home/vagrant/slave/monero-static-win64/build/build/release/CMakeFiles/CMakeTmp

Run Build Command:"C:/msys64/usr/bin/make.exe" "cmTC_c80fc/fast"
make[1]: Entering directory '/home/vagrant/slave/monero-static-win64/build/build/release/CMakeFiles/CMakeTmp'
/usr/bin/make -f CMakeFiles/cmTC_c80fc.dir/build.make CMakeFiles/cmTC_c80fc.dir/build
make[2]: Entering directory '/home/vagrant/slave/monero-static-win64/build/build/release/CMakeFiles/CMakeTmp'
Building C object CMakeFiles/cmTC_c80fc.dir/CheckIncludeFile.c.obj

/C/msys64/mingw64/bin/x86_64-w64-mingw32-gcc.exe    -o CMakeFiles/cmTC_c80fc.dir/CheckIncludeFile.c.obj   -c /C/msys64/home/vagrant/slave/monero-static-win64/build/build/release/CMakeFiles/CMakeTmp/CheckIncludeFile.c
C:/msys64/home/vagrant/slave/monero-static-win64/build/build/release/CMakeFiles/CMakeTmp/CheckIncludeFile.c:1:10: fatal error: sys/socket.h: No such file or directory
 #include <sys/socket.h>
          ^~~~~~~~~~~~~~
compilation terminated.

make[2]: *** [CMakeFiles/cmTC_c80fc.dir/build.make:66: CMakeFiles/cmTC_c80fc.dir/CheckIncludeFile.c.obj] Error 1
make[2]: Leaving directory '/home/vagrant/slave/monero-static-win64/build/build/release/CMakeFiles/CMakeTmp'
make[1]: *** [Makefile:121: cmTC_c80fc/fast] Error 2
make[1]: Leaving directory '/home/vagrant/slave/monero-static-win64/build/build/release/CMakeFiles/CMakeTmp'


Determining if the include file sys/sysctl.h exists failed with the following output:
Change Dir: C:/msys64/home/vagrant/slave/monero-static-win64/build/build/release/CMakeFiles/CMakeTmp

Run Build Command:"C:/msys64/usr/bin/make.exe" "cmTC_da4a9/fast"
make[1]: Entering directory '/home/vagrant/slave/monero-static-win64/build/build/release/CMakeFiles/CMakeTmp'
/usr/bin/make -f CMakeFiles/cmTC_da4a9.dir/build.make CMakeFiles/cmTC_da4a9.dir/build
make[2]: Entering directory '/home/vagrant/slave/monero-static-win64/build/build/release/CMakeFiles/CMakeTmp'
Building C object CMakeFiles/cmTC_da4a9.dir/CheckIncludeFile.c.obj

/C/msys64/mingw64/bin/x86_64-w64-mingw32-gcc.exe    -o CMakeFiles/cmTC_da4a9.dir/CheckIncludeFile.c.obj   -c /C/msys64/home/vagrant/slave/monero-static-win64/build/build/release/CMakeFiles/CMakeTmp/CheckIncludeFile.c
C:/msys64/home/vagrant/slave/monero-static-win64/build/build/release/CMakeFiles/CMakeTmp/CheckIncludeFile.c:1:10: fatal error: sys/sysctl.h: No such file or directory
 #include <sys/sysctl.h>
          ^~~~~~~~~~~~~~
compilation terminated.

make[2]: *** [CMakeFiles/cmTC_da4a9.dir/build.make:66: CMakeFiles/cmTC_da4a9.dir/CheckIncludeFile.c.obj] Error 1
make[2]: Leaving directory '/home/vagrant/slave/monero-static-win64/build/build/release/CMakeFiles/CMakeTmp'
make[1]: *** [Makefile:121: cmTC_da4a9/fast] Error 2
make[1]: Leaving directory '/home/vagrant/slave/monero-static-win64/build/build/release/CMakeFiles/CMakeTmp'


Determining if the include file sys/uio.h exists failed with the following output:
Change Dir: C:/msys64/home/vagrant/slave/monero-static-win64/build/build/release/CMakeFiles/CMakeTmp

Run Build Command:"C:/msys64/usr/bin/make.exe" "cmTC_3aefe/fast"
make[1]: Entering directory '/home/vagrant/slave/monero-static-win64/build/build/release/CMakeFiles/CMakeTmp'
/usr/bin/make -f CMakeFiles/cmTC_3aefe.dir/build.make CMakeFiles/cmTC_3aefe.dir/build
make[2]: Entering directory '/home/vagrant/slave/monero-static-win64/build/build/release/CMakeFiles/CMakeTmp'
Building C object CMakeFiles/cmTC_3aefe.dir/CheckIncludeFile.c.obj

/C/msys64/mingw64/bin/x86_64-w64-mingw32-gcc.exe    -o CMakeFiles/cmTC_3aefe.dir/CheckIncludeFile.c.obj   -c /C/msys64/home/vagrant/slave/monero-static-win64/build/build/release/CMakeFiles/CMakeTmp/CheckIncludeFile.c
C:/msys64/home/vagrant/slave/monero-static-win64/build/build/release/CMakeFiles/CMakeTmp/CheckIncludeFile.c:1:10: fatal error: sys/uio.h: No such file or directory
 #include <sys/uio.h>
          ^~~~~~~~~~~
compilation terminated.

make[2]: *** [CMakeFiles/cmTC_3aefe.dir/build.make:66: CMakeFiles/cmTC_3aefe.dir/CheckIncludeFile.c.obj] Error 1
make[2]: Leaving directory '/home/vagrant/slave/monero-static-win64/build/build/release/CMakeFiles/CMakeTmp'
make[1]: *** [Makefile:121: cmTC_3aefe/fast] Error 2
make[1]: Leaving directory '/home/vagrant/slave/monero-static-win64/build/build/release/CMakeFiles/CMakeTmp'


Determining if the include file sys/un.h exists failed with the following output:
Change Dir: C:/msys64/home/vagrant/slave/monero-static-win64/build/build/release/CMakeFiles/CMakeTmp

Run Build Command:"C:/msys64/usr/bin/make.exe" "cmTC_40d1d/fast"
make[1]: Entering directory '/home/vagrant/slave/monero-static-win64/build/build/release/CMakeFiles/CMakeTmp'
/usr/bin/make -f CMakeFiles/cmTC_40d1d.dir/build.make CMakeFiles/cmTC_40d1d.dir/build
make[2]: Entering directory '/home/vagrant/slave/monero-static-win64/build/build/release/CMakeFiles/CMakeTmp'
Building C object CMakeFiles/cmTC_40d1d.dir/CheckIncludeFile.c.obj

/C/msys64/mingw64/bin/x86_64-w64-mingw32-gcc.exe    -o CMakeFiles/cmTC_40d1d.dir/CheckIncludeFile.c.obj   -c /C/msys64/home/vagrant/slave/monero-static-win64/build/build/release/CMakeFiles/CMakeTmp/CheckIncludeFile.c
C:/msys64/home/vagrant/slave/monero-static-win64/build/build/release/CMakeFiles/CMakeTmp/CheckIncludeFile.c:1:10: fatal error: sys/un.h: No such file or directory
 #include <sys/un.h>
          ^~~~~~~~~~
compilation terminated.

make[2]: *** [CMakeFiles/cmTC_40d1d.dir/build.make:66: CMakeFiles/cmTC_40d1d.dir/CheckIncludeFile.c.obj] Error 1
make[2]: Leaving directory '/home/vagrant/slave/monero-static-win64/build/build/release/CMakeFiles/CMakeTmp'
make[1]: *** [Makefile:121: cmTC_40d1d/fast] Error 2
make[1]: Leaving directory '/home/vagrant/slave/monero-static-win64/build/build/release/CMakeFiles/CMakeTmp'


Determining if the include file sys/wait.h exists failed with the following output:
Change Dir: C:/msys64/home/vagrant/slave/monero-static-win64/build/build/release/CMakeFiles/CMakeTmp

Run Build Command:"C:/msys64/usr/bin/make.exe" "cmTC_29604/fast"
make[1]: Entering directory '/home/vagrant/slave/monero-static-win64/build/build/release/CMakeFiles/CMakeTmp'
/usr/bin/make -f CMakeFiles/cmTC_29604.dir/build.make CMakeFiles/cmTC_29604.dir/build
make[2]: Entering directory '/home/vagrant/slave/monero-static-win64/build/build/release/CMakeFiles/CMakeTmp'
Building C object CMakeFiles/cmTC_29604.dir/CheckIncludeFile.c.obj

/C/msys64/mingw64/bin/x86_64-w64-mingw32-gcc.exe    -o CMakeFiles/cmTC_29604.dir/CheckIncludeFile.c.obj   -c /C/msys64/home/vagrant/slave/monero-static-win64/build/build/release/CMakeFiles/CMakeTmp/CheckIncludeFile.c
C:/msys64/home/vagrant/slave/monero-static-win64/build/build/release/CMakeFiles/CMakeTmp/CheckIncludeFile.c:1:10: fatal error: sys/wait.h: No such file or directory
 #include <sys/wait.h>
          ^~~~~~~~~~~~
compilation terminated.

make[2]: *** [CMakeFiles/cmTC_29604.dir/build.make:66: CMakeFiles/cmTC_29604.dir/CheckIncludeFile.c.obj] Error 1
make[2]: Leaving directory '/home/vagrant/slave/monero-static-win64/build/build/release/CMakeFiles/CMakeTmp'
make[1]: *** [Makefile:121: cmTC_29604/fast] Error 2
make[1]: Leaving directory '/home/vagrant/slave/monero-static-win64/build/build/release/CMakeFiles/CMakeTmp'


Determining if the include file syslog.h exists failed with the following output:
Change Dir: C:/msys64/home/vagrant/slave/monero-static-win64/build/build/release/CMakeFiles/CMakeTmp

Run Build Command:"C:/msys64/usr/bin/make.exe" "cmTC_17ac3/fast"
make[1]: Entering directory '/home/vagrant/slave/monero-static-win64/build/build/release/CMakeFiles/CMakeTmp'
/usr/bin/make -f CMakeFiles/cmTC_17ac3.dir/build.make CMakeFiles/cmTC_17ac3.dir/build
make[2]: Entering directory '/home/vagrant/slave/monero-static-win64/build/build/release/CMakeFiles/CMakeTmp'
Building C object CMakeFiles/cmTC_17ac3.dir/CheckIncludeFile.c.obj

/C/msys64/mingw64/bin/x86_64-w64-mingw32-gcc.exe    -o CMakeFiles/cmTC_17ac3.dir/CheckIncludeFile.c.obj   -c /C/msys64/home/vagrant/slave/monero-static-win64/build/build/release/CMakeFiles/CMakeTmp/CheckIncludeFile.c
C:/msys64/home/vagrant/slave/monero-static-win64/build/build/release/CMakeFiles/CMakeTmp/CheckIncludeFile.c:1:10: fatal error: syslog.h: No such file or directory
 #include <syslog.h>
          ^~~~~~~~~~
compilation terminated.

make[2]: *** [CMakeFiles/cmTC_17ac3.dir/build.make:66: CMakeFiles/cmTC_17ac3.dir/CheckIncludeFile.c.obj] Error 1
make[2]: Leaving directory '/home/vagrant/slave/monero-static-win64/build/build/release/CMakeFiles/CMakeTmp'
make[1]: *** [Makefile:121: cmTC_17ac3/fast] Error 2
make[1]: Leaving directory '/home/vagrant/slave/monero-static-win64/build/build/release/CMakeFiles/CMakeTmp'


Determining if the include file vfork.h exists failed with the following output:
Change Dir: C:/msys64/home/vagrant/slave/monero-static-win64/build/build/release/CMakeFiles/CMakeTmp

Run Build Command:"C:/msys64/usr/bin/make.exe" "cmTC_6ca1c/fast"
make[1]: Entering directory '/home/vagrant/slave/monero-static-win64/build/build/release/CMakeFiles/CMakeTmp'
/usr/bin/make -f CMakeFiles/cmTC_6ca1c.dir/build.make CMakeFiles/cmTC_6ca1c.dir/build
make[2]: Entering directory '/home/vagrant/slave/monero-static-win64/build/build/release/CMakeFiles/CMakeTmp'
Building C object CMakeFiles/cmTC_6ca1c.dir/CheckIncludeFile.c.obj

/C/msys64/mingw64/bin/x86_64-w64-mingw32-gcc.exe    -o CMakeFiles/cmTC_6ca1c.dir/CheckIncludeFile.c.obj   -c /C/msys64/home/vagrant/slave/monero-static-win64/build/build/release/CMakeFiles/CMakeTmp/CheckIncludeFile.c
C:/msys64/home/vagrant/slave/monero-static-win64/build/build/release/CMakeFiles/CMakeTmp/CheckIncludeFile.c:1:10: fatal error: vfork.h: No such file or directory
 #include <vfork.h>
          ^~~~~~~~~
compilation terminated.

make[2]: *** [CMakeFiles/cmTC_6ca1c.dir/build.make:66: CMakeFiles/cmTC_6ca1c.dir/CheckIncludeFile.c.obj] Error 1
make[2]: Leaving directory '/home/vagrant/slave/monero-static-win64/build/build/release/CMakeFiles/CMakeTmp'
make[1]: *** [Makefile:121: cmTC_6ca1c/fast] Error 2
make[1]: Leaving directory '/home/vagrant/slave/monero-static-win64/build/build/release/CMakeFiles/CMakeTmp'


Determining if the function arc4random exists failed with the following output:
Change Dir: C:/msys64/home/vagrant/slave/monero-static-win64/build/build/release/CMakeFiles/CMakeTmp

Run Build Command:"C:/msys64/usr/bin/make.exe" "cmTC_bd9d8/fast"
make[1]: Entering directory '/home/vagrant/slave/monero-static-win64/build/build/release/CMakeFiles/CMakeTmp'
/usr/bin/make -f CMakeFiles/cmTC_bd9d8.dir/build.make CMakeFiles/cmTC_bd9d8.dir/build
make[2]: Entering directory '/home/vagrant/slave/monero-static-win64/build/build/release/CMakeFiles/CMakeTmp'
Building C object CMakeFiles/cmTC_bd9d8.dir/CheckFunctionExists.c.obj

/C/msys64/mingw64/bin/x86_64-w64-mingw32-gcc.exe   -DCHECK_FUNCTION_EXISTS=arc4random   -o CMakeFiles/cmTC_bd9d8.dir/CheckFunctionExists.c.obj   -c /C/msys64/mingw64/share/cmake-3.12/Modules/CheckFunctionExists.c
Linking C executable cmTC_bd9d8.exe

/C/msys64/mingw64/bin/cmake.exe -E remove -f CMakeFiles/cmTC_bd9d8.dir/objects.a
ar cr CMakeFiles/cmTC_bd9d8.dir/objects.a "CMakeFiles/cmTC_bd9d8.dir/CheckFunctionExists.c.obj" 
/C/msys64/mingw64/bin/x86_64-w64-mingw32-gcc.exe  -DCHECK_FUNCTION_EXISTS=arc4random    -Wl,--whole-archive CMakeFiles/cmTC_bd9d8.dir/objects.a -Wl,--no-whole-archive  -o cmTC_bd9d8.exe -Wl,--major-image-version,0,--minor-image-version,0 -liphlpapi -lws2_32 -lkernel32 -luser32 -lgdi32 -lwinspool -lshell32 -lole32 -loleaut32 -luuid -lcomdlg32 -ladvapi32 
CMakeFiles/cmTC_bd9d8.dir/objects.a(CheckFunctionExists.c.obj):CheckFunctionExists.c:(.text+0x15): undefined reference to `arc4random'

collect2.exe: error: ld returned 1 exit status
make[2]: *** [CMakeFiles/cmTC_bd9d8.dir/build.make:88: cmTC_bd9d8.exe] Error 1
make[2]: Leaving directory '/home/vagrant/slave/monero-static-win64/build/build/release/CMakeFiles/CMakeTmp'
make[1]: *** [Makefile:121: cmTC_bd9d8/fast] Error 2
make[1]: Leaving directory '/home/vagrant/slave/monero-static-win64/build/build/release/CMakeFiles/CMakeTmp'


Determining if the function arc4random_uniform exists failed with the following output:
Change Dir: C:/msys64/home/vagrant/slave/monero-static-win64/build/build/release/CMakeFiles/CMakeTmp

Run Build Command:"C:/msys64/usr/bin/make.exe" "cmTC_b3306/fast"
make[1]: Entering directory '/home/vagrant/slave/monero-static-win64/build/build/release/CMakeFiles/CMakeTmp'
/usr/bin/make -f CMakeFiles/cmTC_b3306.dir/build.make CMakeFiles/cmTC_b3306.dir/build
make[2]: Entering directory '/home/vagrant/slave/monero-static-win64/build/build/release/CMakeFiles/CMakeTmp'
Building C object CMakeFiles/cmTC_b3306.dir/CheckFunctionExists.c.obj

/C/msys64/mingw64/bin/x86_64-w64-mingw32-gcc.exe   -DCHECK_FUNCTION_EXISTS=arc4random_uniform   -o CMakeFiles/cmTC_b3306.dir/CheckFunctionExists.c.obj   -c /C/msys64/mingw64/share/cmake-3.12/Modules/CheckFunctionExists.c
Linking C executable cmTC_b3306.exe

/C/msys64/mingw64/bin/cmake.exe -E remove -f CMakeFiles/cmTC_b3306.dir/objects.a
ar cr CMakeFiles/cmTC_b3306.dir/objects.a "CMakeFiles/cmTC_b3306.dir/CheckFunctionExists.c.obj" 
/C/msys64/mingw64/bin/x86_64-w64-mingw32-gcc.exe  -DCHECK_FUNCTION_EXISTS=arc4random_uniform    -Wl,--whole-archive CMakeFiles/cmTC_b3306.dir/objects.a -Wl,--no-whole-archive  -o cmTC_b3306.exe -Wl,--major-image-version,0,--minor-image-version,0 -liphlpapi -lws2_32 -lkernel32 -luser32 -lgdi32 -lwinspool -lshell32 -lole32 -loleaut32 -luuid -lcomdlg32 -ladvapi32 
CMakeFiles/cmTC_b3306.dir/objects.a(CheckFunctionExists.c.obj):CheckFunctionExists.c:(.text+0x15): undefined reference to `arc4random_uniform'

collect2.exe: error: ld returned 1 exit status
make[2]: *** [CMakeFiles/cmTC_b3306.dir/build.make:88: cmTC_b3306.exe] Error 1
make[2]: Leaving directory '/home/vagrant/slave/monero-static-win64/build/build/release/CMakeFiles/CMakeTmp'
make[1]: *** [Makefile:121: cmTC_b3306/fast] Error 2
make[1]: Leaving directory '/home/vagrant/slave/monero-static-win64/build/build/release/CMakeFiles/CMakeTmp'


Determining if the function chown exists failed with the following output:
Change Dir: C:/msys64/home/vagrant/slave/monero-static-win64/build/build/release/CMakeFiles/CMakeTmp

Run Build Command:"C:/msys64/usr/bin/make.exe" "cmTC_e91cd/fast"
make[1]: Entering directory '/home/vagrant/slave/monero-static-win64/build/build/release/CMakeFiles/CMakeTmp'
/usr/bin/make -f CMakeFiles/cmTC_e91cd.dir/build.make CMakeFiles/cmTC_e91cd.dir/build
make[2]: Entering directory '/home/vagrant/slave/monero-static-win64/build/build/release/CMakeFiles/CMakeTmp'
Building C object CMakeFiles/cmTC_e91cd.dir/CheckFunctionExists.c.obj

/C/msys64/mingw64/bin/x86_64-w64-mingw32-gcc.exe   -DCHECK_FUNCTION_EXISTS=chown   -o CMakeFiles/cmTC_e91cd.dir/CheckFunctionExists.c.obj   -c /C/msys64/mingw64/share/cmake-3.12/Modules/CheckFunctionExists.c
Linking C executable cmTC_e91cd.exe

/C/msys64/mingw64/bin/cmake.exe -E remove -f CMakeFiles/cmTC_e91cd.dir/objects.a
ar cr CMakeFiles/cmTC_e91cd.dir/objects.a "CMakeFiles/cmTC_e91cd.dir/CheckFunctionExists.c.obj" 
/C/msys64/mingw64/bin/x86_64-w64-mingw32-gcc.exe  -DCHECK_FUNCTION_EXISTS=chown    -Wl,--whole-archive CMakeFiles/cmTC_e91cd.dir/objects.a -Wl,--no-whole-archive  -o cmTC_e91cd.exe -Wl,--major-image-version,0,--minor-image-version,0 -liphlpapi -lws2_32 -lkernel32 -luser32 -lgdi32 -lwinspool -lshell32 -lole32 -loleaut32 -luuid -lcomdlg32 -ladvapi32 
CMakeFiles/cmTC_e91cd.dir/objects.a(CheckFunctionExists.c.obj):CheckFunctionExists.c:(.text+0x15): undefined reference to `chown'

collect2.exe: error: ld returned 1 exit status
make[2]: *** [CMakeFiles/cmTC_e91cd.dir/build.make:88: cmTC_e91cd.exe] Error 1
make[2]: Leaving directory '/home/vagrant/slave/monero-static-win64/build/build/release/CMakeFiles/CMakeTmp'
make[1]: *** [Makefile:121: cmTC_e91cd/fast] Error 2
make[1]: Leaving directory '/home/vagrant/slave/monero-static-win64/build/build/release/CMakeFiles/CMakeTmp'


Determining if the function chroot exists failed with the following output:
Change Dir: C:/msys64/home/vagrant/slave/monero-static-win64/build/build/release/CMakeFiles/CMakeTmp

Run Build Command:"C:/msys64/usr/bin/make.exe" "cmTC_b55af/fast"
make[1]: Entering directory '/home/vagrant/slave/monero-static-win64/build/build/release/CMakeFiles/CMakeTmp'
/usr/bin/make -f CMakeFiles/cmTC_b55af.dir/build.make CMakeFiles/cmTC_b55af.dir/build
make[2]: Entering directory '/home/vagrant/slave/monero-static-win64/build/build/release/CMakeFiles/CMakeTmp'
Building C object CMakeFiles/cmTC_b55af.dir/CheckFunctionExists.c.obj

/C/msys64/mingw64/bin/x86_64-w64-mingw32-gcc.exe   -DCHECK_FUNCTION_EXISTS=chroot   -o CMakeFiles/cmTC_b55af.dir/CheckFunctionExists.c.obj   -c /C/msys64/mingw64/share/cmake-3.12/Modules/CheckFunctionExists.c
Linking C executable cmTC_b55af.exe

/C/msys64/mingw64/bin/cmake.exe -E remove -f CMakeFiles/cmTC_b55af.dir/objects.a
ar cr CMakeFiles/cmTC_b55af.dir/objects.a "CMakeFiles/cmTC_b55af.dir/CheckFunctionExists.c.obj" 
/C/msys64/mingw64/bin/x86_64-w64-mingw32-gcc.exe  -DCHECK_FUNCTION_EXISTS=chroot    -Wl,--whole-archive CMakeFiles/cmTC_b55af.dir/objects.a -Wl,--no-whole-archive  -o cmTC_b55af.exe -Wl,--major-image-version,0,--minor-image-version,0 -liphlpapi -lws2_32 -lkernel32 -luser32 -lgdi32 -lwinspool -lshell32 -lole32 -loleaut32 -luuid -lcomdlg32 -ladvapi32 
CMakeFiles/cmTC_b55af.dir/objects.a(CheckFunctionExists.c.obj):CheckFunctionExists.c:(.text+0x15): undefined reference to `chroot'

collect2.exe: error: ld returned 1 exit status
make[2]: *** [CMakeFiles/cmTC_b55af.dir/build.make:88: cmTC_b55af.exe] Error 1
make[2]: Leaving directory '/home/vagrant/slave/monero-static-win64/build/build/release/CMakeFiles/CMakeTmp'
make[1]: *** [Makefile:121: cmTC_b55af/fast] Error 2
make[1]: Leaving directory '/home/vagrant/slave/monero-static-win64/build/build/release/CMakeFiles/CMakeTmp'


Determining if the function ctime_r exists failed with the following output:
Change Dir: C:/msys64/home/vagrant/slave/monero-static-win64/build/build/release/CMakeFiles/CMakeTmp

Run Build Command:"C:/msys64/usr/bin/make.exe" "cmTC_5eba2/fast"
make[1]: Entering directory '/home/vagrant/slave/monero-static-win64/build/build/release/CMakeFiles/CMakeTmp'
/usr/bin/make -f CMakeFiles/cmTC_5eba2.dir/build.make CMakeFiles/cmTC_5eba2.dir/build
make[2]: Entering directory '/home/vagrant/slave/monero-static-win64/build/build/release/CMakeFiles/CMakeTmp'
Building C object CMakeFiles/cmTC_5eba2.dir/CheckFunctionExists.c.obj

/C/msys64/mingw64/bin/x86_64-w64-mingw32-gcc.exe   -DCHECK_FUNCTION_EXISTS=ctime_r   -o CMakeFiles/cmTC_5eba2.dir/CheckFunctionExists.c.obj   -c /C/msys64/mingw64/share/cmake-3.12/Modules/CheckFunctionExists.c
Linking C executable cmTC_5eba2.exe

/C/msys64/mingw64/bin/cmake.exe -E remove -f CMakeFiles/cmTC_5eba2.dir/objects.a
ar cr CMakeFiles/cmTC_5eba2.dir/objects.a "CMakeFiles/cmTC_5eba2.dir/CheckFunctionExists.c.obj" 
/C/msys64/mingw64/bin/x86_64-w64-mingw32-gcc.exe  -DCHECK_FUNCTION_EXISTS=ctime_r    -Wl,--whole-archive CMakeFiles/cmTC_5eba2.dir/objects.a -Wl,--no-whole-archive  -o cmTC_5eba2.exe -Wl,--major-image-version,0,--minor-image-version,0 -liphlpapi -lws2_32 -lkernel32 -luser32 -lgdi32 -lwinspool -lshell32 -lole32 -loleaut32 -luuid -lcomdlg32 -ladvapi32 
CMakeFiles/cmTC_5eba2.dir/objects.a(CheckFunctionExists.c.obj):CheckFunctionExists.c:(.text+0x15): undefined reference to `ctime_r'

collect2.exe: error: ld returned 1 exit status
make[2]: *** [CMakeFiles/cmTC_5eba2.dir/build.make:88: cmTC_5eba2.exe] Error 1
make[2]: Leaving directory '/home/vagrant/slave/monero-static-win64/build/build/release/CMakeFiles/CMakeTmp'
make[1]: *** [Makefile:121: cmTC_5eba2/fast] Error 2
make[1]: Leaving directory '/home/vagrant/slave/monero-static-win64/build/build/release/CMakeFiles/CMakeTmp'


Determining if the function daemon exists failed with the following output:
Change Dir: C:/msys64/home/vagrant/slave/monero-static-win64/build/build/release/CMakeFiles/CMakeTmp

Run Build Command:"C:/msys64/usr/bin/make.exe" "cmTC_47bac/fast"
make[1]: Entering directory '/home/vagrant/slave/monero-static-win64/build/build/release/CMakeFiles/CMakeTmp'
/usr/bin/make -f CMakeFiles/cmTC_47bac.dir/build.make CMakeFiles/cmTC_47bac.dir/build
make[2]: Entering directory '/home/vagrant/slave/monero-static-win64/build/build/release/CMakeFiles/CMakeTmp'
Building C object CMakeFiles/cmTC_47bac.dir/CheckFunctionExists.c.obj

/C/msys64/mingw64/bin/x86_64-w64-mingw32-gcc.exe   -DCHECK_FUNCTION_EXISTS=daemon   -o CMakeFiles/cmTC_47bac.dir/CheckFunctionExists.c.obj   -c /C/msys64/mingw64/share/cmake-3.12/Modules/CheckFunctionExists.c
Linking C executable cmTC_47bac.exe

/C/msys64/mingw64/bin/cmake.exe -E remove -f CMakeFiles/cmTC_47bac.dir/objects.a
ar cr CMakeFiles/cmTC_47bac.dir/objects.a "CMakeFiles/cmTC_47bac.dir/CheckFunctionExists.c.obj" 
/C/msys64/mingw64/bin/x86_64-w64-mingw32-gcc.exe  -DCHECK_FUNCTION_EXISTS=daemon    -Wl,--whole-archive CMakeFiles/cmTC_47bac.dir/objects.a -Wl,--no-whole-archive  -o cmTC_47bac.exe -Wl,--major-image-version,0,--minor-image-version,0 -liphlpapi -lws2_32 -lkernel32 -luser32 -lgdi32 -lwinspool -lshell32 -lole32 -loleaut32 -luuid -lcomdlg32 -ladvapi32 
CMakeFiles/cmTC_47bac.dir/objects.a(CheckFunctionExists.c.obj):CheckFunctionExists.c:(.text+0x15): undefined reference to `daemon'

collect2.exe: error: ld returned 1 exit status
make[2]: *** [CMakeFiles/cmTC_47bac.dir/build.make:88: cmTC_47bac.exe] Error 1
make[2]: Leaving directory '/home/vagrant/slave/monero-static-win64/build/build/release/CMakeFiles/CMakeTmp'
make[1]: *** [Makefile:121: cmTC_47bac/fast] Error 2
make[1]: Leaving directory '/home/vagrant/slave/monero-static-win64/build/build/release/CMakeFiles/CMakeTmp'


Determining if the function endprotoent exists failed with the following output:
Change Dir: C:/msys64/home/vagrant/slave/monero-static-win64/build/build/release/CMakeFiles/CMakeTmp

Run Build Command:"C:/msys64/usr/bin/make.exe" "cmTC_7ec1e/fast"
make[1]: Entering directory '/home/vagrant/slave/monero-static-win64/build/build/release/CMakeFiles/CMakeTmp'
/usr/bin/make -f CMakeFiles/cmTC_7ec1e.dir/build.make CMakeFiles/cmTC_7ec1e.dir/build
make[2]: Entering directory '/home/vagrant/slave/monero-static-win64/build/build/release/CMakeFiles/CMakeTmp'
Building C object CMakeFiles/cmTC_7ec1e.dir/CheckFunctionExists.c.obj

/C/msys64/mingw64/bin/x86_64-w64-mingw32-gcc.exe   -DCHECK_FUNCTION_EXISTS=endprotoent   -o CMakeFiles/cmTC_7ec1e.dir/CheckFunctionExists.c.obj   -c /C/msys64/mingw64/share/cmake-3.12/Modules/CheckFunctionExists.c
Linking C executable cmTC_7ec1e.exe

/C/msys64/mingw64/bin/cmake.exe -E remove -f CMakeFiles/cmTC_7ec1e.dir/objects.a
ar cr CMakeFiles/cmTC_7ec1e.dir/objects.a "CMakeFiles/cmTC_7ec1e.dir/CheckFunctionExists.c.obj" 
/C/msys64/mingw64/bin/x86_64-w64-mingw32-gcc.exe  -DCHECK_FUNCTION_EXISTS=endprotoent    -Wl,--whole-archive CMakeFiles/cmTC_7ec1e.dir/objects.a -Wl,--no-whole-archive  -o cmTC_7ec1e.exe -Wl,--major-image-version,0,--minor-image-version,0 -liphlpapi -lws2_32 -lkernel32 -luser32 -lgdi32 -lwinspool -lshell32 -lole32 -loleaut32 -luuid -lcomdlg32 -ladvapi32 
CMakeFiles/cmTC_7ec1e.dir/objects.a(CheckFunctionExists.c.obj):CheckFunctionExists.c:(.text+0x15): undefined reference to `endprotoent'

collect2.exe: error: ld returned 1 exit status
make[2]: *** [CMakeFiles/cmTC_7ec1e.dir/build.make:88: cmTC_7ec1e.exe] Error 1
make[2]: Leaving directory '/home/vagrant/slave/monero-static-win64/build/build/release/CMakeFiles/CMakeTmp'
make[1]: *** [Makefile:121: cmTC_7ec1e/fast] Error 2
make[1]: Leaving directory '/home/vagrant/slave/monero-static-win64/build/build/release/CMakeFiles/CMakeTmp'


Determining if the function endservent exists failed with the following output:
Change Dir: C:/msys64/home/vagrant/slave/monero-static-win64/build/build/release/CMakeFiles/CMakeTmp

Run Build Command:"C:/msys64/usr/bin/make.exe" "cmTC_5287d/fast"
make[1]: Entering directory '/home/vagrant/slave/monero-static-win64/build/build/release/CMakeFiles/CMakeTmp'
/usr/bin/make -f CMakeFiles/cmTC_5287d.dir/build.make CMakeFiles/cmTC_5287d.dir/build
make[2]: Entering directory '/home/vagrant/slave/monero-static-win64/build/build/release/CMakeFiles/CMakeTmp'
Building C object CMakeFiles/cmTC_5287d.dir/CheckFunctionExists.c.obj

/C/msys64/mingw64/bin/x86_64-w64-mingw32-gcc.exe   -DCHECK_FUNCTION_EXISTS=endservent   -o CMakeFiles/cmTC_5287d.dir/CheckFunctionExists.c.obj   -c /C/msys64/mingw64/share/cmake-3.12/Modules/CheckFunctionExists.c
Linking C executable cmTC_5287d.exe

/C/msys64/mingw64/bin/cmake.exe -E remove -f CMakeFiles/cmTC_5287d.dir/objects.a
ar cr CMakeFiles/cmTC_5287d.dir/objects.a "CMakeFiles/cmTC_5287d.dir/CheckFunctionExists.c.obj" 
/C/msys64/mingw64/bin/x86_64-w64-mingw32-gcc.exe  -DCHECK_FUNCTION_EXISTS=endservent    -Wl,--whole-archive CMakeFiles/cmTC_5287d.dir/objects.a -Wl,--no-whole-archive  -o cmTC_5287d.exe -Wl,--major-image-version,0,--minor-image-version,0 -liphlpapi -lws2_32 -lkernel32 -luser32 -lgdi32 -lwinspool -lshell32 -lole32 -loleaut32 -luuid -lcomdlg32 -ladvapi32 
CMakeFiles/cmTC_5287d.dir/objects.a(CheckFunctionExists.c.obj):CheckFunctionExists.c:(.text+0x15): undefined reference to `endservent'

collect2.exe: error: ld returned 1 exit status
make[2]: *** [CMakeFiles/cmTC_5287d.dir/build.make:88: cmTC_5287d.exe] Error 1
make[2]: Leaving directory '/home/vagrant/slave/monero-static-win64/build/build/release/CMakeFiles/CMakeTmp'
make[1]: *** [Makefile:121: cmTC_5287d/fast] Error 2
make[1]: Leaving directory '/home/vagrant/slave/monero-static-win64/build/build/release/CMakeFiles/CMakeTmp'


Determining if the function fork exists failed with the following output:
Change Dir: C:/msys64/home/vagrant/slave/monero-static-win64/build/build/release/CMakeFiles/CMakeTmp

Run Build Command:"C:/msys64/usr/bin/make.exe" "cmTC_f068a/fast"
make[1]: Entering directory '/home/vagrant/slave/monero-static-win64/build/build/release/CMakeFiles/CMakeTmp'
/usr/bin/make -f CMakeFiles/cmTC_f068a.dir/build.make CMakeFiles/cmTC_f068a.dir/build
make[2]: Entering directory '/home/vagrant/slave/monero-static-win64/build/build/release/CMakeFiles/CMakeTmp'
Building C object CMakeFiles/cmTC_f068a.dir/CheckFunctionExists.c.obj

/C/msys64/mingw64/bin/x86_64-w64-mingw32-gcc.exe   -DCHECK_FUNCTION_EXISTS=fork   -o CMakeFiles/cmTC_f068a.dir/CheckFunctionExists.c.obj   -c /C/msys64/mingw64/share/cmake-3.12/Modules/CheckFunctionExists.c
<command-line>: warning: conflicting types for built-in function 'fork' [-Wbuiltin-declaration-mismatch]
C:/msys64/mingw64/share/cmake-3.12/Modules/CheckFunctionExists.c:7:3: note: in expansion of macro 'CHECK_FUNCTION_EXISTS'
   CHECK_FUNCTION_EXISTS(void);
   ^~~~~~~~~~~~~~~~~~~~~
Linking C executable cmTC_f068a.exe

/C/msys64/mingw64/bin/cmake.exe -E remove -f CMakeFiles/cmTC_f068a.dir/objects.a
ar cr CMakeFiles/cmTC_f068a.dir/objects.a "CMakeFiles/cmTC_f068a.dir/CheckFunctionExists.c.obj" 
/C/msys64/mingw64/bin/x86_64-w64-mingw32-gcc.exe  -DCHECK_FUNCTION_EXISTS=fork    -Wl,--whole-archive CMakeFiles/cmTC_f068a.dir/objects.a -Wl,--no-whole-archive  -o cmTC_f068a.exe -Wl,--major-image-version,0,--minor-image-version,0 -liphlpapi -lws2_32 -lkernel32 -luser32 -lgdi32 -lwinspool -lshell32 -lole32 -loleaut32 -luuid -lcomdlg32 -ladvapi32 
CMakeFiles/cmTC_f068a.dir/objects.a(CheckFunctionExists.c.obj):CheckFunctionExists.c:(.text+0x15): undefined reference to `fork'

collect2.exe: error: ld returned 1 exit status
make[2]: *** [CMakeFiles/cmTC_f068a.dir/build.make:88: cmTC_f068a.exe] Error 1
make[2]: Leaving directory '/home/vagrant/slave/monero-static-win64/build/build/release/CMakeFiles/CMakeTmp'
make[1]: *** [Makefile:121: cmTC_f068a/fast] Error 2
make[1]: Leaving directory '/home/vagrant/slave/monero-static-win64/build/build/release/CMakeFiles/CMakeTmp'


Determining if the function fsync exists failed with the following output:
Change Dir: C:/msys64/home/vagrant/slave/monero-static-win64/build/build/release/CMakeFiles/CMakeTmp

Run Build Command:"C:/msys64/usr/bin/make.exe" "cmTC_8a42f/fast"
make[1]: Entering directory '/home/vagrant/slave/monero-static-win64/build/build/release/CMakeFiles/CMakeTmp'
/usr/bin/make -f CMakeFiles/cmTC_8a42f.dir/build.make CMakeFiles/cmTC_8a42f.dir/build
make[2]: Entering directory '/home/vagrant/slave/monero-static-win64/build/build/release/CMakeFiles/CMakeTmp'
Building C object CMakeFiles/cmTC_8a42f.dir/CheckFunctionExists.c.obj

/C/msys64/mingw64/bin/x86_64-w64-mingw32-gcc.exe   -DCHECK_FUNCTION_EXISTS=fsync   -o CMakeFiles/cmTC_8a42f.dir/CheckFunctionExists.c.obj   -c /C/msys64/mingw64/share/cmake-3.12/Modules/CheckFunctionExists.c
Linking C executable cmTC_8a42f.exe

/C/msys64/mingw64/bin/cmake.exe -E remove -f CMakeFiles/cmTC_8a42f.dir/objects.a
ar cr CMakeFiles/cmTC_8a42f.dir/objects.a "CMakeFiles/cmTC_8a42f.dir/CheckFunctionExists.c.obj" 
/C/msys64/mingw64/bin/x86_64-w64-mingw32-gcc.exe  -DCHECK_FUNCTION_EXISTS=fsync    -Wl,--whole-archive CMakeFiles/cmTC_8a42f.dir/objects.a -Wl,--no-whole-archive  -o cmTC_8a42f.exe -Wl,--major-image-version,0,--minor-image-version,0 -liphlpapi -lws2_32 -lkernel32 -luser32 -lgdi32 -lwinspool -lshell32 -lole32 -loleaut32 -luuid -lcomdlg32 -ladvapi32 
CMakeFiles/cmTC_8a42f.dir/objects.a(CheckFunctionExists.c.obj):CheckFunctionExists.c:(.text+0x15): undefined reference to `fsync'

collect2.exe: error: ld returned 1 exit status
make[2]: *** [CMakeFiles/cmTC_8a42f.dir/build.make:88: cmTC_8a42f.exe] Error 1
make[2]: Leaving directory '/home/vagrant/slave/monero-static-win64/build/build/release/CMakeFiles/CMakeTmp'
make[1]: *** [Makefile:121: cmTC_8a42f/fast] Error 2
make[1]: Leaving directory '/home/vagrant/slave/monero-static-win64/build/build/release/CMakeFiles/CMakeTmp'


Determining if the function getauxval exists failed with the following output:
Change Dir: C:/msys64/home/vagrant/slave/monero-static-win64/build/build/release/CMakeFiles/CMakeTmp

Run Build Command:"C:/msys64/usr/bin/make.exe" "cmTC_2c31a/fast"
make[1]: Entering directory '/home/vagrant/slave/monero-static-win64/build/build/release/CMakeFiles/CMakeTmp'
/usr/bin/make -f CMakeFiles/cmTC_2c31a.dir/build.make CMakeFiles/cmTC_2c31a.dir/build
make[2]: Entering directory '/home/vagrant/slave/monero-static-win64/build/build/release/CMakeFiles/CMakeTmp'
Building C object CMakeFiles/cmTC_2c31a.dir/CheckFunctionExists.c.obj

/C/msys64/mingw64/bin/x86_64-w64-mingw32-gcc.exe   -DCHECK_FUNCTION_EXISTS=getauxval   -o CMakeFiles/cmTC_2c31a.dir/CheckFunctionExists.c.obj   -c /C/msys64/mingw64/share/cmake-3.12/Modules/CheckFunctionExists.c
Linking C executable cmTC_2c31a.exe

/C/msys64/mingw64/bin/cmake.exe -E remove -f CMakeFiles/cmTC_2c31a.dir/objects.a
ar cr CMakeFiles/cmTC_2c31a.dir/objects.a "CMakeFiles/cmTC_2c31a.dir/CheckFunctionExists.c.obj" 
/C/msys64/mingw64/bin/x86_64-w64-mingw32-gcc.exe  -DCHECK_FUNCTION_EXISTS=getauxval    -Wl,--whole-archive CMakeFiles/cmTC_2c31a.dir/objects.a -Wl,--no-whole-archive  -o cmTC_2c31a.exe -Wl,--major-image-version,0,--minor-image-version,0 -liphlpapi -lws2_32 -lkernel32 -luser32 -lgdi32 -lwinspool -lshell32 -lole32 -loleaut32 -luuid -lcomdlg32 -ladvapi32 
CMakeFiles/cmTC_2c31a.dir/objects.a(CheckFunctionExists.c.obj):CheckFunctionExists.c:(.text+0x15): undefined reference to `getauxval'

collect2.exe: error: ld returned 1 exit status
make[2]: *** [CMakeFiles/cmTC_2c31a.dir/build.make:88: cmTC_2c31a.exe] Error 1
make[2]: Leaving directory '/home/vagrant/slave/monero-static-win64/build/build/release/CMakeFiles/CMakeTmp'
make[1]: *** [Makefile:121: cmTC_2c31a/fast] Error 2
make[1]: Leaving directory '/home/vagrant/slave/monero-static-win64/build/build/release/CMakeFiles/CMakeTmp'


Determining if the function getentropy exists failed with the following output:
Change Dir: C:/msys64/home/vagrant/slave/monero-static-win64/build/build/release/CMakeFiles/CMakeTmp

Run Build Command:"C:/msys64/usr/bin/make.exe" "cmTC_ae29f/fast"
make[1]: Entering directory '/home/vagrant/slave/monero-static-win64/build/build/release/CMakeFiles/CMakeTmp'
/usr/bin/make -f CMakeFiles/cmTC_ae29f.dir/build.make CMakeFiles/cmTC_ae29f.dir/build
make[2]: Entering directory '/home/vagrant/slave/monero-static-win64/build/build/release/CMakeFiles/CMakeTmp'
Building C object CMakeFiles/cmTC_ae29f.dir/CheckFunctionExists.c.obj

/C/msys64/mingw64/bin/x86_64-w64-mingw32-gcc.exe   -DCHECK_FUNCTION_EXISTS=getentropy   -o CMakeFiles/cmTC_ae29f.dir/CheckFunctionExists.c.obj   -c /C/msys64/mingw64/share/cmake-3.12/Modules/CheckFunctionExists.c
Linking C executable cmTC_ae29f.exe

/C/msys64/mingw64/bin/cmake.exe -E remove -f CMakeFiles/cmTC_ae29f.dir/objects.a
ar cr CMakeFiles/cmTC_ae29f.dir/objects.a "CMakeFiles/cmTC_ae29f.dir/CheckFunctionExists.c.obj" 
/C/msys64/mingw64/bin/x86_64-w64-mingw32-gcc.exe  -DCHECK_FUNCTION_EXISTS=getentropy    -Wl,--whole-archive CMakeFiles/cmTC_ae29f.dir/objects.a -Wl,--no-whole-archive  -o cmTC_ae29f.exe -Wl,--major-image-version,0,--minor-image-version,0 -liphlpapi -lws2_32 -lkernel32 -luser32 -lgdi32 -lwinspool -lshell32 -lole32 -loleaut32 -luuid -lcomdlg32 -ladvapi32 
CMakeFiles/cmTC_ae29f.dir/objects.a(CheckFunctionExists.c.obj):CheckFunctionExists.c:(.text+0x15): undefined reference to `getentropy'

collect2.exe: error: ld returned 1 exit status
make[2]: *** [CMakeFiles/cmTC_ae29f.dir/build.make:88: cmTC_ae29f.exe] Error 1
make[2]: Leaving directory '/home/vagrant/slave/monero-static-win64/build/build/release/CMakeFiles/CMakeTmp'
make[1]: *** [Makefile:121: cmTC_ae29f/fast] Error 2
make[1]: Leaving directory '/home/vagrant/slave/monero-static-win64/build/build/release/CMakeFiles/CMakeTmp'


Determining if the function getpwnam exists failed with the following output:
Change Dir: C:/msys64/home/vagrant/slave/monero-static-win64/build/build/release/CMakeFiles/CMakeTmp

Run Build Command:"C:/msys64/usr/bin/make.exe" "cmTC_09445/fast"
make[1]: Entering directory '/home/vagrant/slave/monero-static-win64/build/build/release/CMakeFiles/CMakeTmp'
/usr/bin/make -f CMakeFiles/cmTC_09445.dir/build.make CMakeFiles/cmTC_09445.dir/build
make[2]: Entering directory '/home/vagrant/slave/monero-static-win64/build/build/release/CMakeFiles/CMakeTmp'
Building C object CMakeFiles/cmTC_09445.dir/CheckFunctionExists.c.obj

/C/msys64/mingw64/bin/x86_64-w64-mingw32-gcc.exe   -DCHECK_FUNCTION_EXISTS=getpwnam   -o CMakeFiles/cmTC_09445.dir/CheckFunctionExists.c.obj   -c /C/msys64/mingw64/share/cmake-3.12/Modules/CheckFunctionExists.c
Linking C executable cmTC_09445.exe

/C/msys64/mingw64/bin/cmake.exe -E remove -f CMakeFiles/cmTC_09445.dir/objects.a
ar cr CMakeFiles/cmTC_09445.dir/objects.a "CMakeFiles/cmTC_09445.dir/CheckFunctionExists.c.obj" 
/C/msys64/mingw64/bin/x86_64-w64-mingw32-gcc.exe  -DCHECK_FUNCTION_EXISTS=getpwnam    -Wl,--whole-archive CMakeFiles/cmTC_09445.dir/objects.a -Wl,--no-whole-archive  -o cmTC_09445.exe -Wl,--major-image-version,0,--minor-image-version,0 -liphlpapi -lws2_32 -lkernel32 -luser32 -lgdi32 -lwinspool -lshell32 -lole32 -loleaut32 -luuid -lcomdlg32 -ladvapi32 
CMakeFiles/cmTC_09445.dir/objects.a(CheckFunctionExists.c.obj):CheckFunctionExists.c:(.text+0x15): undefined reference to `getpwnam'

collect2.exe: error: ld returned 1 exit status
make[2]: *** [CMakeFiles/cmTC_09445.dir/build.make:88: cmTC_09445.exe] Error 1
make[2]: Leaving directory '/home/vagrant/slave/monero-static-win64/build/build/release/CMakeFiles/CMakeTmp'
make[1]: *** [Makefile:121: cmTC_09445/fast] Error 2
make[1]: Leaving directory '/home/vagrant/slave/monero-static-win64/build/build/release/CMakeFiles/CMakeTmp'


Determining if the function getrlimit exists failed with the following output:
Change Dir: C:/msys64/home/vagrant/slave/monero-static-win64/build/build/release/CMakeFiles/CMakeTmp

Run Build Command:"C:/msys64/usr/bin/make.exe" "cmTC_64e4a/fast"
make[1]: Entering directory '/home/vagrant/slave/monero-static-win64/build/build/release/CMakeFiles/CMakeTmp'
/usr/bin/make -f CMakeFiles/cmTC_64e4a.dir/build.make CMakeFiles/cmTC_64e4a.dir/build
make[2]: Entering directory '/home/vagrant/slave/monero-static-win64/build/build/release/CMakeFiles/CMakeTmp'
Building C object CMakeFiles/cmTC_64e4a.dir/CheckFunctionExists.c.obj

/C/msys64/mingw64/bin/x86_64-w64-mingw32-gcc.exe   -DCHECK_FUNCTION_EXISTS=getrlimit   -o CMakeFiles/cmTC_64e4a.dir/CheckFunctionExists.c.obj   -c /C/msys64/mingw64/share/cmake-3.12/Modules/CheckFunctionExists.c
Linking C executable cmTC_64e4a.exe

/C/msys64/mingw64/bin/cmake.exe -E remove -f CMakeFiles/cmTC_64e4a.dir/objects.a
ar cr CMakeFiles/cmTC_64e4a.dir/objects.a "CMakeFiles/cmTC_64e4a.dir/CheckFunctionExists.c.obj" 
/C/msys64/mingw64/bin/x86_64-w64-mingw32-gcc.exe  -DCHECK_FUNCTION_EXISTS=getrlimit    -Wl,--whole-archive CMakeFiles/cmTC_64e4a.dir/objects.a -Wl,--no-whole-archive  -o cmTC_64e4a.exe -Wl,--major-image-version,0,--minor-image-version,0 -liphlpapi -lws2_32 -lkernel32 -luser32 -lgdi32 -lwinspool -lshell32 -lole32 -loleaut32 -luuid -lcomdlg32 -ladvapi32 
CMakeFiles/cmTC_64e4a.dir/objects.a(CheckFunctionExists.c.obj):CheckFunctionExists.c:(.text+0x15): undefined reference to `getrlimit'

collect2.exe: error: ld returned 1 exit status
make[2]: *** [CMakeFiles/cmTC_64e4a.dir/build.make:88: cmTC_64e4a.exe] Error 1
make[2]: Leaving directory '/home/vagrant/slave/monero-static-win64/build/build/release/CMakeFiles/CMakeTmp'
make[1]: *** [Makefile:121: cmTC_64e4a/fast] Error 2
make[1]: Leaving directory '/home/vagrant/slave/monero-static-win64/build/build/release/CMakeFiles/CMakeTmp'


Determining if the function glob exists failed with the following output:
Change Dir: C:/msys64/home/vagrant/slave/monero-static-win64/build/build/release/CMakeFiles/CMakeTmp

Run Build Command:"C:/msys64/usr/bin/make.exe" "cmTC_25502/fast"
make[1]: Entering directory '/home/vagrant/slave/monero-static-win64/build/build/release/CMakeFiles/CMakeTmp'
/usr/bin/make -f CMakeFiles/cmTC_25502.dir/build.make CMakeFiles/cmTC_25502.dir/build
make[2]: Entering directory '/home/vagrant/slave/monero-static-win64/build/build/release/CMakeFiles/CMakeTmp'
Building C object CMakeFiles/cmTC_25502.dir/CheckFunctionExists.c.obj

/C/msys64/mingw64/bin/x86_64-w64-mingw32-gcc.exe   -DCHECK_FUNCTION_EXISTS=glob   -o CMakeFiles/cmTC_25502.dir/CheckFunctionExists.c.obj   -c /C/msys64/mingw64/share/cmake-3.12/Modules/CheckFunctionExists.c
Linking C executable cmTC_25502.exe

/C/msys64/mingw64/bin/cmake.exe -E remove -f CMakeFiles/cmTC_25502.dir/objects.a
ar cr CMakeFiles/cmTC_25502.dir/objects.a "CMakeFiles/cmTC_25502.dir/CheckFunctionExists.c.obj" 
/C/msys64/mingw64/bin/x86_64-w64-mingw32-gcc.exe  -DCHECK_FUNCTION_EXISTS=glob    -Wl,--whole-archive CMakeFiles/cmTC_25502.dir/objects.a -Wl,--no-whole-archive  -o cmTC_25502.exe -Wl,--major-image-version,0,--minor-image-version,0 -liphlpapi -lws2_32 -lkernel32 -luser32 -lgdi32 -lwinspool -lshell32 -lole32 -loleaut32 -luuid -lcomdlg32 -ladvapi32 
CMakeFiles/cmTC_25502.dir/objects.a(CheckFunctionExists.c.obj):CheckFunctionExists.c:(.text+0x15): undefined reference to `glob'

collect2.exe: error: ld returned 1 exit status
make[2]: *** [CMakeFiles/cmTC_25502.dir/build.make:88: cmTC_25502.exe] Error 1
make[2]: Leaving directory '/home/vagrant/slave/monero-static-win64/build/build/release/CMakeFiles/CMakeTmp'
make[1]: *** [Makefile:121: cmTC_25502/fast] Error 2
make[1]: Leaving directory '/home/vagrant/slave/monero-static-win64/build/build/release/CMakeFiles/CMakeTmp'


Determining if the function gmtime_r exists failed with the following output:
Change Dir: C:/msys64/home/vagrant/slave/monero-static-win64/build/build/release/CMakeFiles/CMakeTmp

Run Build Command:"C:/msys64/usr/bin/make.exe" "cmTC_798c3/fast"
make[1]: Entering directory '/home/vagrant/slave/monero-static-win64/build/build/release/CMakeFiles/CMakeTmp'
/usr/bin/make -f CMakeFiles/cmTC_798c3.dir/build.make CMakeFiles/cmTC_798c3.dir/build
make[2]: Entering directory '/home/vagrant/slave/monero-static-win64/build/build/release/CMakeFiles/CMakeTmp'
Building C object CMakeFiles/cmTC_798c3.dir/CheckFunctionExists.c.obj

/C/msys64/mingw64/bin/x86_64-w64-mingw32-gcc.exe   -DCHECK_FUNCTION_EXISTS=gmtime_r   -o CMakeFiles/cmTC_798c3.dir/CheckFunctionExists.c.obj   -c /C/msys64/mingw64/share/cmake-3.12/Modules/CheckFunctionExists.c
Linking C executable cmTC_798c3.exe

/C/msys64/mingw64/bin/cmake.exe -E remove -f CMakeFiles/cmTC_798c3.dir/objects.a
ar cr CMakeFiles/cmTC_798c3.dir/objects.a "CMakeFiles/cmTC_798c3.dir/CheckFunctionExists.c.obj" 
/C/msys64/mingw64/bin/x86_64-w64-mingw32-gcc.exe  -DCHECK_FUNCTION_EXISTS=gmtime_r    -Wl,--whole-archive CMakeFiles/cmTC_798c3.dir/objects.a -Wl,--no-whole-archive  -o cmTC_798c3.exe -Wl,--major-image-version,0,--minor-image-version,0 -liphlpapi -lws2_32 -lkernel32 -luser32 -lgdi32 -lwinspool -lshell32 -lole32 -loleaut32 -luuid -lcomdlg32 -ladvapi32 
CMakeFiles/cmTC_798c3.dir/objects.a(CheckFunctionExists.c.obj):CheckFunctionExists.c:(.text+0x15): undefined reference to `gmtime_r'

collect2.exe: error: ld returned 1 exit status
make[2]: *** [CMakeFiles/cmTC_798c3.dir/build.make:88: cmTC_798c3.exe] Error 1
make[2]: Leaving directory '/home/vagrant/slave/monero-static-win64/build/build/release/CMakeFiles/CMakeTmp'
make[1]: *** [Makefile:121: cmTC_798c3/fast] Error 2
make[1]: Leaving directory '/home/vagrant/slave/monero-static-win64/build/build/release/CMakeFiles/CMakeTmp'


Determining if the function fcntl exists failed with the following output:
Change Dir: C:/msys64/home/vagrant/slave/monero-static-win64/build/build/release/CMakeFiles/CMakeTmp

Run Build Command:"C:/msys64/usr/bin/make.exe" "cmTC_43d7d/fast"
make[1]: Entering directory '/home/vagrant/slave/monero-static-win64/build/build/release/CMakeFiles/CMakeTmp'
/usr/bin/make -f CMakeFiles/cmTC_43d7d.dir/build.make CMakeFiles/cmTC_43d7d.dir/build
make[2]: Entering directory '/home/vagrant/slave/monero-static-win64/build/build/release/CMakeFiles/CMakeTmp'
Building C object CMakeFiles/cmTC_43d7d.dir/CheckFunctionExists.c.obj

/C/msys64/mingw64/bin/x86_64-w64-mingw32-gcc.exe   -DCHECK_FUNCTION_EXISTS=fcntl   -o CMakeFiles/cmTC_43d7d.dir/CheckFunctionExists.c.obj   -c /C/msys64/mingw64/share/cmake-3.12/Modules/CheckFunctionExists.c
Linking C executable cmTC_43d7d.exe

/C/msys64/mingw64/bin/cmake.exe -E remove -f CMakeFiles/cmTC_43d7d.dir/objects.a
ar cr CMakeFiles/cmTC_43d7d.dir/objects.a "CMakeFiles/cmTC_43d7d.dir/CheckFunctionExists.c.obj" 
/C/msys64/mingw64/bin/x86_64-w64-mingw32-gcc.exe  -DCHECK_FUNCTION_EXISTS=fcntl    -Wl,--whole-archive CMakeFiles/cmTC_43d7d.dir/objects.a -Wl,--no-whole-archive  -o cmTC_43d7d.exe -Wl,--major-image-version,0,--minor-image-version,0 -liphlpapi -lws2_32 -lkernel32 -luser32 -lgdi32 -lwinspool -lshell32 -lole32 -loleaut32 -luuid -lcomdlg32 -ladvapi32 
CMakeFiles/cmTC_43d7d.dir/objects.a(CheckFunctionExists.c.obj):CheckFunctionExists.c:(.text+0x15): undefined reference to `fcntl'

collect2.exe: error: ld returned 1 exit status
make[2]: *** [CMakeFiles/cmTC_43d7d.dir/build.make:88: cmTC_43d7d.exe] Error 1
make[2]: Leaving directory '/home/vagrant/slave/monero-static-win64/build/build/release/CMakeFiles/CMakeTmp'
make[1]: *** [Makefile:121: cmTC_43d7d/fast] Error 2
make[1]: Leaving directory '/home/vagrant/slave/monero-static-win64/build/build/release/CMakeFiles/CMakeTmp'


Determining if the function inet_aton exists failed with the following output:
Change Dir: C:/msys64/home/vagrant/slave/monero-static-win64/build/build/release/CMakeFiles/CMakeTmp

Run Build Command:"C:/msys64/usr/bin/make.exe" "cmTC_be5f8/fast"
make[1]: Entering directory '/home/vagrant/slave/monero-static-win64/build/build/release/CMakeFiles/CMakeTmp'
/usr/bin/make -f CMakeFiles/cmTC_be5f8.dir/build.make CMakeFiles/cmTC_be5f8.dir/build
make[2]: Entering directory '/home/vagrant/slave/monero-static-win64/build/build/release/CMakeFiles/CMakeTmp'
Building C object CMakeFiles/cmTC_be5f8.dir/CheckFunctionExists.c.obj

/C/msys64/mingw64/bin/x86_64-w64-mingw32-gcc.exe   -DCHECK_FUNCTION_EXISTS=inet_aton   -o CMakeFiles/cmTC_be5f8.dir/CheckFunctionExists.c.obj   -c /C/msys64/mingw64/share/cmake-3.12/Modules/CheckFunctionExists.c
Linking C executable cmTC_be5f8.exe

/C/msys64/mingw64/bin/cmake.exe -E remove -f CMakeFiles/cmTC_be5f8.dir/objects.a
ar cr CMakeFiles/cmTC_be5f8.dir/objects.a "CMakeFiles/cmTC_be5f8.dir/CheckFunctionExists.c.obj" 
/C/msys64/mingw64/bin/x86_64-w64-mingw32-gcc.exe  -DCHECK_FUNCTION_EXISTS=inet_aton    -Wl,--whole-archive CMakeFiles/cmTC_be5f8.dir/objects.a -Wl,--no-whole-archive  -o cmTC_be5f8.exe -Wl,--major-image-version,0,--minor-image-version,0 -liphlpapi -lws2_32 -lkernel32 -luser32 -lgdi32 -lwinspool -lshell32 -lole32 -loleaut32 -luuid -lcomdlg32 -ladvapi32 
CMakeFiles/cmTC_be5f8.dir/objects.a(CheckFunctionExists.c.obj):CheckFunctionExists.c:(.text+0x15): undefined reference to `inet_aton'

collect2.exe: error: ld returned 1 exit status
make[2]: *** [CMakeFiles/cmTC_be5f8.dir/build.make:88: cmTC_be5f8.exe] Error 1
make[2]: Leaving directory '/home/vagrant/slave/monero-static-win64/build/build/release/CMakeFiles/CMakeTmp'
make[1]: *** [Makefile:121: cmTC_be5f8/fast] Error 2
make[1]: Leaving directory '/home/vagrant/slave/monero-static-win64/build/build/release/CMakeFiles/CMakeTmp'


Determining if the function initgroups exists failed with the following output:
Change Dir: C:/msys64/home/vagrant/slave/monero-static-win64/build/build/release/CMakeFiles/CMakeTmp

Run Build Command:"C:/msys64/usr/bin/make.exe" "cmTC_a3bb6/fast"
make[1]: Entering directory '/home/vagrant/slave/monero-static-win64/build/build/release/CMakeFiles/CMakeTmp'
/usr/bin/make -f CMakeFiles/cmTC_a3bb6.dir/build.make CMakeFiles/cmTC_a3bb6.dir/build
make[2]: Entering directory '/home/vagrant/slave/monero-static-win64/build/build/release/CMakeFiles/CMakeTmp'
Building C object CMakeFiles/cmTC_a3bb6.dir/CheckFunctionExists.c.obj

/C/msys64/mingw64/bin/x86_64-w64-mingw32-gcc.exe   -DCHECK_FUNCTION_EXISTS=initgroups   -o CMakeFiles/cmTC_a3bb6.dir/CheckFunctionExists.c.obj   -c /C/msys64/mingw64/share/cmake-3.12/Modules/CheckFunctionExists.c
Linking C executable cmTC_a3bb6.exe

/C/msys64/mingw64/bin/cmake.exe -E remove -f CMakeFiles/cmTC_a3bb6.dir/objects.a
ar cr CMakeFiles/cmTC_a3bb6.dir/objects.a "CMakeFiles/cmTC_a3bb6.dir/CheckFunctionExists.c.obj" 
/C/msys64/mingw64/bin/x86_64-w64-mingw32-gcc.exe  -DCHECK_FUNCTION_EXISTS=initgroups    -Wl,--whole-archive CMakeFiles/cmTC_a3bb6.dir/objects.a -Wl,--no-whole-archive  -o cmTC_a3bb6.exe -Wl,--major-image-version,0,--minor-image-version,0 -liphlpapi -lws2_32 -lkernel32 -luser32 -lgdi32 -lwinspool -lshell32 -lole32 -loleaut32 -luuid -lcomdlg32 -ladvapi32 
CMakeFiles/cmTC_a3bb6.dir/objects.a(CheckFunctionExists.c.obj):CheckFunctionExists.c:(.text+0x15): undefined reference to `initgroups'

collect2.exe: error: ld returned 1 exit status
make[2]: *** [CMakeFiles/cmTC_a3bb6.dir/build.make:88: cmTC_a3bb6.exe] Error 1
make[2]: Leaving directory '/home/vagrant/slave/monero-static-win64/build/build/release/CMakeFiles/CMakeTmp'
make[1]: *** [Makefile:121: cmTC_a3bb6/fast] Error 2
make[1]: Leaving directory '/home/vagrant/slave/monero-static-win64/build/build/release/CMakeFiles/CMakeTmp'


Determining if the function kill exists failed with the following output:
Change Dir: C:/msys64/home/vagrant/slave/monero-static-win64/build/build/release/CMakeFiles/CMakeTmp

Run Build Command:"C:/msys64/usr/bin/make.exe" "cmTC_019c6/fast"
make[1]: Entering directory '/home/vagrant/slave/monero-static-win64/build/build/release/CMakeFiles/CMakeTmp'
/usr/bin/make -f CMakeFiles/cmTC_019c6.dir/build.make CMakeFiles/cmTC_019c6.dir/build
make[2]: Entering directory '/home/vagrant/slave/monero-static-win64/build/build/release/CMakeFiles/CMakeTmp'
Building C object CMakeFiles/cmTC_019c6.dir/CheckFunctionExists.c.obj

/C/msys64/mingw64/bin/x86_64-w64-mingw32-gcc.exe   -DCHECK_FUNCTION_EXISTS=kill   -o CMakeFiles/cmTC_019c6.dir/CheckFunctionExists.c.obj   -c /C/msys64/mingw64/share/cmake-3.12/Modules/CheckFunctionExists.c
Linking C executable cmTC_019c6.exe

/C/msys64/mingw64/bin/cmake.exe -E remove -f CMakeFiles/cmTC_019c6.dir/objects.a
ar cr CMakeFiles/cmTC_019c6.dir/objects.a "CMakeFiles/cmTC_019c6.dir/CheckFunctionExists.c.obj" 
/C/msys64/mingw64/bin/x86_64-w64-mingw32-gcc.exe  -DCHECK_FUNCTION_EXISTS=kill    -Wl,--whole-archive CMakeFiles/cmTC_019c6.dir/objects.a -Wl,--no-whole-archive  -o cmTC_019c6.exe -Wl,--major-image-version,0,--minor-image-version,0 -liphlpapi -lws2_32 -lkernel32 -luser32 -lgdi32 -lwinspool -lshell32 -lole32 -loleaut32 -luuid -lcomdlg32 -ladvapi32 
CMakeFiles/cmTC_019c6.dir/objects.a(CheckFunctionExists.c.obj):CheckFunctionExists.c:(.text+0x15): undefined reference to `kill'

collect2.exe: error: ld returned 1 exit status
make[2]: *** [CMakeFiles/cmTC_019c6.dir/build.make:88: cmTC_019c6.exe] Error 1
make[2]: Leaving directory '/home/vagrant/slave/monero-static-win64/build/build/release/CMakeFiles/CMakeTmp'
make[1]: *** [Makefile:121: cmTC_019c6/fast] Error 2
make[1]: Leaving directory '/home/vagrant/slave/monero-static-win64/build/build/release/CMakeFiles/CMakeTmp'


Determining if the function localtime_r exists failed with the following output:
Change Dir: C:/msys64/home/vagrant/slave/monero-static-win64/build/build/release/CMakeFiles/CMakeTmp

Run Build Command:"C:/msys64/usr/bin/make.exe" "cmTC_9032f/fast"
make[1]: Entering directory '/home/vagrant/slave/monero-static-win64/build/build/release/CMakeFiles/CMakeTmp'
/usr/bin/make -f CMakeFiles/cmTC_9032f.dir/build.make CMakeFiles/cmTC_9032f.dir/build
make[2]: Entering directory '/home/vagrant/slave/monero-static-win64/build/build/release/CMakeFiles/CMakeTmp'
Building C object CMakeFiles/cmTC_9032f.dir/CheckFunctionExists.c.obj

/C/msys64/mingw64/bin/x86_64-w64-mingw32-gcc.exe   -DCHECK_FUNCTION_EXISTS=localtime_r   -o CMakeFiles/cmTC_9032f.dir/CheckFunctionExists.c.obj   -c /C/msys64/mingw64/share/cmake-3.12/Modules/CheckFunctionExists.c
Linking C executable cmTC_9032f.exe

/C/msys64/mingw64/bin/cmake.exe -E remove -f CMakeFiles/cmTC_9032f.dir/objects.a
ar cr CMakeFiles/cmTC_9032f.dir/objects.a "CMakeFiles/cmTC_9032f.dir/CheckFunctionExists.c.obj" 
/C/msys64/mingw64/bin/x86_64-w64-mingw32-gcc.exe  -DCHECK_FUNCTION_EXISTS=localtime_r    -Wl,--whole-archive CMakeFiles/cmTC_9032f.dir/objects.a -Wl,--no-whole-archive  -o cmTC_9032f.exe -Wl,--major-image-version,0,--minor-image-version,0 -liphlpapi -lws2_32 -lkernel32 -luser32 -lgdi32 -lwinspool -lshell32 -lole32 -loleaut32 -luuid -lcomdlg32 -ladvapi32 
CMakeFiles/cmTC_9032f.dir/objects.a(CheckFunctionExists.c.obj):CheckFunctionExists.c:(.text+0x15): undefined reference to `localtime_r'

collect2.exe: error: ld returned 1 exit status
make[2]: *** [CMakeFiles/cmTC_9032f.dir/build.make:88: cmTC_9032f.exe] Error 1
make[2]: Leaving directory '/home/vagrant/slave/monero-static-win64/build/build/release/CMakeFiles/CMakeTmp'
make[1]: *** [Makefile:121: cmTC_9032f/fast] Error 2
make[1]: Leaving directory '/home/vagrant/slave/monero-static-win64/build/build/release/CMakeFiles/CMakeTmp'


Determining if the function random exists failed with the following output:
Change Dir: C:/msys64/home/vagrant/slave/monero-static-win64/build/build/release/CMakeFiles/CMakeTmp

Run Build Command:"C:/msys64/usr/bin/make.exe" "cmTC_81a76/fast"
make[1]: Entering directory '/home/vagrant/slave/monero-static-win64/build/build/release/CMakeFiles/CMakeTmp'
/usr/bin/make -f CMakeFiles/cmTC_81a76.dir/build.make CMakeFiles/cmTC_81a76.dir/build
make[2]: Entering directory '/home/vagrant/slave/monero-static-win64/build/build/release/CMakeFiles/CMakeTmp'
Building C object CMakeFiles/cmTC_81a76.dir/CheckFunctionExists.c.obj

/C/msys64/mingw64/bin/x86_64-w64-mingw32-gcc.exe   -DCHECK_FUNCTION_EXISTS=random   -o CMakeFiles/cmTC_81a76.dir/CheckFunctionExists.c.obj   -c /C/msys64/mingw64/share/cmake-3.12/Modules/CheckFunctionExists.c
Linking C executable cmTC_81a76.exe

/C/msys64/mingw64/bin/cmake.exe -E remove -f CMakeFiles/cmTC_81a76.dir/objects.a
ar cr CMakeFiles/cmTC_81a76.dir/objects.a "CMakeFiles/cmTC_81a76.dir/CheckFunctionExists.c.obj" 
/C/msys64/mingw64/bin/x86_64-w64-mingw32-gcc.exe  -DCHECK_FUNCTION_EXISTS=random    -Wl,--whole-archive CMakeFiles/cmTC_81a76.dir/objects.a -Wl,--no-whole-archive  -o cmTC_81a76.exe -Wl,--major-image-version,0,--minor-image-version,0 -liphlpapi -lws2_32 -lkernel32 -luser32 -lgdi32 -lwinspool -lshell32 -lole32 -loleaut32 -luuid -lcomdlg32 -ladvapi32 
CMakeFiles/cmTC_81a76.dir/objects.a(CheckFunctionExists.c.obj):CheckFunctionExists.c:(.text+0x15): undefined reference to `random'

collect2.exe: error: ld returned 1 exit status
make[2]: *** [CMakeFiles/cmTC_81a76.dir/build.make:88: cmTC_81a76.exe] Error 1
make[2]: Leaving directory '/home/vagrant/slave/monero-static-win64/build/build/release/CMakeFiles/CMakeTmp'
make[1]: *** [Makefile:121: cmTC_81a76/fast] Error 2
make[1]: Leaving directory '/home/vagrant/slave/monero-static-win64/build/build/release/CMakeFiles/CMakeTmp'


Determining if the function reallocarray exists failed with the following output:
Change Dir: C:/msys64/home/vagrant/slave/monero-static-win64/build/build/release/CMakeFiles/CMakeTmp

Run Build Command:"C:/msys64/usr/bin/make.exe" "cmTC_9dd0f/fast"
make[1]: Entering directory '/home/vagrant/slave/monero-static-win64/build/build/release/CMakeFiles/CMakeTmp'
/usr/bin/make -f CMakeFiles/cmTC_9dd0f.dir/build.make CMakeFiles/cmTC_9dd0f.dir/build
make[2]: Entering directory '/home/vagrant/slave/monero-static-win64/build/build/release/CMakeFiles/CMakeTmp'
Building C object CMakeFiles/cmTC_9dd0f.dir/CheckFunctionExists.c.obj

/C/msys64/mingw64/bin/x86_64-w64-mingw32-gcc.exe   -DCHECK_FUNCTION_EXISTS=reallocarray   -o CMakeFiles/cmTC_9dd0f.dir/CheckFunctionExists.c.obj   -c /C/msys64/mingw64/share/cmake-3.12/Modules/CheckFunctionExists.c
Linking C executable cmTC_9dd0f.exe

/C/msys64/mingw64/bin/cmake.exe -E remove -f CMakeFiles/cmTC_9dd0f.dir/objects.a
ar cr CMakeFiles/cmTC_9dd0f.dir/objects.a "CMakeFiles/cmTC_9dd0f.dir/CheckFunctionExists.c.obj" 
/C/msys64/mingw64/bin/x86_64-w64-mingw32-gcc.exe  -DCHECK_FUNCTION_EXISTS=reallocarray    -Wl,--whole-archive CMakeFiles/cmTC_9dd0f.dir/objects.a -Wl,--no-whole-archive  -o cmTC_9dd0f.exe -Wl,--major-image-version,0,--minor-image-version,0 -liphlpapi -lws2_32 -lkernel32 -luser32 -lgdi32 -lwinspool -lshell32 -lole32 -loleaut32 -luuid -lcomdlg32 -ladvapi32 
CMakeFiles/cmTC_9dd0f.dir/objects.a(CheckFunctionExists.c.obj):CheckFunctionExists.c:(.text+0x15): undefined reference to `reallocarray'

collect2.exe: error: ld returned 1 exit status
make[2]: *** [CMakeFiles/cmTC_9dd0f.dir/build.make:88: cmTC_9dd0f.exe] Error 1
make[2]: Leaving directory '/home/vagrant/slave/monero-static-win64/build/build/release/CMakeFiles/CMakeTmp'
make[1]: *** [Makefile:121: cmTC_9dd0f/fast] Error 2
make[1]: Leaving directory '/home/vagrant/slave/monero-static-win64/build/build/release/CMakeFiles/CMakeTmp'


Determining if the function recvmsg exists failed with the following output:
Change Dir: C:/msys64/home/vagrant/slave/monero-static-win64/build/build/release/CMakeFiles/CMakeTmp

Run Build Command:"C:/msys64/usr/bin/make.exe" "cmTC_08220/fast"
make[1]: Entering directory '/home/vagrant/slave/monero-static-win64/build/build/release/CMakeFiles/CMakeTmp'
/usr/bin/make -f CMakeFiles/cmTC_08220.dir/build.make CMakeFiles/cmTC_08220.dir/build
make[2]: Entering directory '/home/vagrant/slave/monero-static-win64/build/build/release/CMakeFiles/CMakeTmp'
Building C object CMakeFiles/cmTC_08220.dir/CheckFunctionExists.c.obj

/C/msys64/mingw64/bin/x86_64-w64-mingw32-gcc.exe   -DCHECK_FUNCTION_EXISTS=recvmsg   -o CMakeFiles/cmTC_08220.dir/CheckFunctionExists.c.obj   -c /C/msys64/mingw64/share/cmake-3.12/Modules/CheckFunctionExists.c
Linking C executable cmTC_08220.exe

/C/msys64/mingw64/bin/cmake.exe -E remove -f CMakeFiles/cmTC_08220.dir/objects.a
ar cr CMakeFiles/cmTC_08220.dir/objects.a "CMakeFiles/cmTC_08220.dir/CheckFunctionExists.c.obj" 
/C/msys64/mingw64/bin/x86_64-w64-mingw32-gcc.exe  -DCHECK_FUNCTION_EXISTS=recvmsg    -Wl,--whole-archive CMakeFiles/cmTC_08220.dir/objects.a -Wl,--no-whole-archive  -o cmTC_08220.exe -Wl,--major-image-version,0,--minor-image-version,0 -liphlpapi -lws2_32 -lkernel32 -luser32 -lgdi32 -lwinspool -lshell32 -lole32 -loleaut32 -luuid -lcomdlg32 -ladvapi32 
CMakeFiles/cmTC_08220.dir/objects.a(CheckFunctionExists.c.obj):CheckFunctionExists.c:(.text+0x15): undefined reference to `recvmsg'

collect2.exe: error: ld returned 1 exit status
make[2]: *** [CMakeFiles/cmTC_08220.dir/build.make:88: cmTC_08220.exe] Error 1
make[2]: Leaving directory '/home/vagrant/slave/monero-static-win64/build/build/release/CMakeFiles/CMakeTmp'
make[1]: *** [Makefile:121: cmTC_08220/fast] Error 2
make[1]: Leaving directory '/home/vagrant/slave/monero-static-win64/build/build/release/CMakeFiles/CMakeTmp'


Determining if the function sbrk exists failed with the following output:
Change Dir: C:/msys64/home/vagrant/slave/monero-static-win64/build/build/release/CMakeFiles/CMakeTmp

Run Build Command:"C:/msys64/usr/bin/make.exe" "cmTC_6e536/fast"
make[1]: Entering directory '/home/vagrant/slave/monero-static-win64/build/build/release/CMakeFiles/CMakeTmp'
/usr/bin/make -f CMakeFiles/cmTC_6e536.dir/build.make CMakeFiles/cmTC_6e536.dir/build
make[2]: Entering directory '/home/vagrant/slave/monero-static-win64/build/build/release/CMakeFiles/CMakeTmp'
Building C object CMakeFiles/cmTC_6e536.dir/CheckFunctionExists.c.obj

/C/msys64/mingw64/bin/x86_64-w64-mingw32-gcc.exe   -DCHECK_FUNCTION_EXISTS=sbrk   -o CMakeFiles/cmTC_6e536.dir/CheckFunctionExists.c.obj   -c /C/msys64/mingw64/share/cmake-3.12/Modules/CheckFunctionExists.c
Linking C executable cmTC_6e536.exe

/C/msys64/mingw64/bin/cmake.exe -E remove -f CMakeFiles/cmTC_6e536.dir/objects.a
ar cr CMakeFiles/cmTC_6e536.dir/objects.a "CMakeFiles/cmTC_6e536.dir/CheckFunctionExists.c.obj" 
/C/msys64/mingw64/bin/x86_64-w64-mingw32-gcc.exe  -DCHECK_FUNCTION_EXISTS=sbrk    -Wl,--whole-archive CMakeFiles/cmTC_6e536.dir/objects.a -Wl,--no-whole-archive  -o cmTC_6e536.exe -Wl,--major-image-version,0,--minor-image-version,0 -liphlpapi -lws2_32 -lkernel32 -luser32 -lgdi32 -lwinspool -lshell32 -lole32 -loleaut32 -luuid -lcomdlg32 -ladvapi32 
CMakeFiles/cmTC_6e536.dir/objects.a(CheckFunctionExists.c.obj):CheckFunctionExists.c:(.text+0x15): undefined reference to `sbrk'

collect2.exe: error: ld returned 1 exit status
make[2]: *** [CMakeFiles/cmTC_6e536.dir/build.make:88: cmTC_6e536.exe] Error 1
make[2]: Leaving directory '/home/vagrant/slave/monero-static-win64/build/build/release/CMakeFiles/CMakeTmp'
make[1]: *** [Makefile:121: cmTC_6e536/fast] Error 2
make[1]: Leaving directory '/home/vagrant/slave/monero-static-win64/build/build/release/CMakeFiles/CMakeTmp'


Determining if the function sendmsg exists failed with the following output:
Change Dir: C:/msys64/home/vagrant/slave/monero-static-win64/build/build/release/CMakeFiles/CMakeTmp

Run Build Command:"C:/msys64/usr/bin/make.exe" "cmTC_3d2bc/fast"
make[1]: Entering directory '/home/vagrant/slave/monero-static-win64/build/build/release/CMakeFiles/CMakeTmp'
/usr/bin/make -f CMakeFiles/cmTC_3d2bc.dir/build.make CMakeFiles/cmTC_3d2bc.dir/build
make[2]: Entering directory '/home/vagrant/slave/monero-static-win64/build/build/release/CMakeFiles/CMakeTmp'
Building C object CMakeFiles/cmTC_3d2bc.dir/CheckFunctionExists.c.obj

/C/msys64/mingw64/bin/x86_64-w64-mingw32-gcc.exe   -DCHECK_FUNCTION_EXISTS=sendmsg   -o CMakeFiles/cmTC_3d2bc.dir/CheckFunctionExists.c.obj   -c /C/msys64/mingw64/share/cmake-3.12/Modules/CheckFunctionExists.c
Linking C executable cmTC_3d2bc.exe

/C/msys64/mingw64/bin/cmake.exe -E remove -f CMakeFiles/cmTC_3d2bc.dir/objects.a
ar cr CMakeFiles/cmTC_3d2bc.dir/objects.a "CMakeFiles/cmTC_3d2bc.dir/CheckFunctionExists.c.obj" 
/C/msys64/mingw64/bin/x86_64-w64-mingw32-gcc.exe  -DCHECK_FUNCTION_EXISTS=sendmsg    -Wl,--whole-archive CMakeFiles/cmTC_3d2bc.dir/objects.a -Wl,--no-whole-archive  -o cmTC_3d2bc.exe -Wl,--major-image-version,0,--minor-image-version,0 -liphlpapi -lws2_32 -lkernel32 -luser32 -lgdi32 -lwinspool -lshell32 -lole32 -loleaut32 -luuid -lcomdlg32 -ladvapi32 
CMakeFiles/cmTC_3d2bc.dir/objects.a(CheckFunctionExists.c.obj):CheckFunctionExists.c:(.text+0x15): undefined reference to `sendmsg'

collect2.exe: error: ld returned 1 exit status
make[2]: *** [CMakeFiles/cmTC_3d2bc.dir/build.make:88: cmTC_3d2bc.exe] Error 1
make[2]: Leaving directory '/home/vagrant/slave/monero-static-win64/build/build/release/CMakeFiles/CMakeTmp'
make[1]: *** [Makefile:121: cmTC_3d2bc/fast] Error 2
make[1]: Leaving directory '/home/vagrant/slave/monero-static-win64/build/build/release/CMakeFiles/CMakeTmp'


Determining if the function setregid exists failed with the following output:
Change Dir: C:/msys64/home/vagrant/slave/monero-static-win64/build/build/release/CMakeFiles/CMakeTmp

Run Build Command:"C:/msys64/usr/bin/make.exe" "cmTC_317af/fast"
make[1]: Entering directory '/home/vagrant/slave/monero-static-win64/build/build/release/CMakeFiles/CMakeTmp'
/usr/bin/make -f CMakeFiles/cmTC_317af.dir/build.make CMakeFiles/cmTC_317af.dir/build
make[2]: Entering directory '/home/vagrant/slave/monero-static-win64/build/build/release/CMakeFiles/CMakeTmp'
Building C object CMakeFiles/cmTC_317af.dir/CheckFunctionExists.c.obj

/C/msys64/mingw64/bin/x86_64-w64-mingw32-gcc.exe   -DCHECK_FUNCTION_EXISTS=setregid   -o CMakeFiles/cmTC_317af.dir/CheckFunctionExists.c.obj   -c /C/msys64/mingw64/share/cmake-3.12/Modules/CheckFunctionExists.c
Linking C executable cmTC_317af.exe

/C/msys64/mingw64/bin/cmake.exe -E remove -f CMakeFiles/cmTC_317af.dir/objects.a
ar cr CMakeFiles/cmTC_317af.dir/objects.a "CMakeFiles/cmTC_317af.dir/CheckFunctionExists.c.obj" 
/C/msys64/mingw64/bin/x86_64-w64-mingw32-gcc.exe  -DCHECK_FUNCTION_EXISTS=setregid    -Wl,--whole-archive CMakeFiles/cmTC_317af.dir/objects.a -Wl,--no-whole-archive  -o cmTC_317af.exe -Wl,--major-image-version,0,--minor-image-version,0 -liphlpapi -lws2_32 -lkernel32 -luser32 -lgdi32 -lwinspool -lshell32 -lole32 -loleaut32 -luuid -lcomdlg32 -ladvapi32 
CMakeFiles/cmTC_317af.dir/objects.a(CheckFunctionExists.c.obj):CheckFunctionExists.c:(.text+0x15): undefined reference to `setregid'

collect2.exe: error: ld returned 1 exit status
make[2]: *** [CMakeFiles/cmTC_317af.dir/build.make:88: cmTC_317af.exe] Error 1
make[2]: Leaving directory '/home/vagrant/slave/monero-static-win64/build/build/release/CMakeFiles/CMakeTmp'
make[1]: *** [Makefile:121: cmTC_317af/fast] Error 2
make[1]: Leaving directory '/home/vagrant/slave/monero-static-win64/build/build/release/CMakeFiles/CMakeTmp'


Determining if the function setresgid exists failed with the following output:
Change Dir: C:/msys64/home/vagrant/slave/monero-static-win64/build/build/release/CMakeFiles/CMakeTmp

Run Build Command:"C:/msys64/usr/bin/make.exe" "cmTC_f8497/fast"
make[1]: Entering directory '/home/vagrant/slave/monero-static-win64/build/build/release/CMakeFiles/CMakeTmp'
/usr/bin/make -f CMakeFiles/cmTC_f8497.dir/build.make CMakeFiles/cmTC_f8497.dir/build
make[2]: Entering directory '/home/vagrant/slave/monero-static-win64/build/build/release/CMakeFiles/CMakeTmp'
Building C object CMakeFiles/cmTC_f8497.dir/CheckFunctionExists.c.obj

/C/msys64/mingw64/bin/x86_64-w64-mingw32-gcc.exe   -DCHECK_FUNCTION_EXISTS=setresgid   -o CMakeFiles/cmTC_f8497.dir/CheckFunctionExists.c.obj   -c /C/msys64/mingw64/share/cmake-3.12/Modules/CheckFunctionExists.c
Linking C executable cmTC_f8497.exe

/C/msys64/mingw64/bin/cmake.exe -E remove -f CMakeFiles/cmTC_f8497.dir/objects.a
ar cr CMakeFiles/cmTC_f8497.dir/objects.a "CMakeFiles/cmTC_f8497.dir/CheckFunctionExists.c.obj" 
/C/msys64/mingw64/bin/x86_64-w64-mingw32-gcc.exe  -DCHECK_FUNCTION_EXISTS=setresgid    -Wl,--whole-archive CMakeFiles/cmTC_f8497.dir/objects.a -Wl,--no-whole-archive  -o cmTC_f8497.exe -Wl,--major-image-version,0,--minor-image-version,0 -liphlpapi -lws2_32 -lkernel32 -luser32 -lgdi32 -lwinspool -lshell32 -lole32 -loleaut32 -luuid -lcomdlg32 -ladvapi32 
CMakeFiles/cmTC_f8497.dir/objects.a(CheckFunctionExists.c.obj):CheckFunctionExists.c:(.text+0x15): undefined reference to `setresgid'

collect2.exe: error: ld returned 1 exit status
make[2]: *** [CMakeFiles/cmTC_f8497.dir/build.make:88: cmTC_f8497.exe] Error 1
make[2]: Leaving directory '/home/vagrant/slave/monero-static-win64/build/build/release/CMakeFiles/CMakeTmp'
make[1]: *** [Makefile:121: cmTC_f8497/fast] Error 2
make[1]: Leaving directory '/home/vagrant/slave/monero-static-win64/build/build/release/CMakeFiles/CMakeTmp'


Determining if the function setresuid exists failed with the following output:
Change Dir: C:/msys64/home/vagrant/slave/monero-static-win64/build/build/release/CMakeFiles/CMakeTmp

Run Build Command:"C:/msys64/usr/bin/make.exe" "cmTC_e96f0/fast"
make[1]: Entering directory '/home/vagrant/slave/monero-static-win64/build/build/release/CMakeFiles/CMakeTmp'
/usr/bin/make -f CMakeFiles/cmTC_e96f0.dir/build.make CMakeFiles/cmTC_e96f0.dir/build
make[2]: Entering directory '/home/vagrant/slave/monero-static-win64/build/build/release/CMakeFiles/CMakeTmp'
Building C object CMakeFiles/cmTC_e96f0.dir/CheckFunctionExists.c.obj

/C/msys64/mingw64/bin/x86_64-w64-mingw32-gcc.exe   -DCHECK_FUNCTION_EXISTS=setresuid   -o CMakeFiles/cmTC_e96f0.dir/CheckFunctionExists.c.obj   -c /C/msys64/mingw64/share/cmake-3.12/Modules/CheckFunctionExists.c
Linking C executable cmTC_e96f0.exe

/C/msys64/mingw64/bin/cmake.exe -E remove -f CMakeFiles/cmTC_e96f0.dir/objects.a
ar cr CMakeFiles/cmTC_e96f0.dir/objects.a "CMakeFiles/cmTC_e96f0.dir/CheckFunctionExists.c.obj" 
/C/msys64/mingw64/bin/x86_64-w64-mingw32-gcc.exe  -DCHECK_FUNCTION_EXISTS=setresuid    -Wl,--whole-archive CMakeFiles/cmTC_e96f0.dir/objects.a -Wl,--no-whole-archive  -o cmTC_e96f0.exe -Wl,--major-image-version,0,--minor-image-version,0 -liphlpapi -lws2_32 -lkernel32 -luser32 -lgdi32 -lwinspool -lshell32 -lole32 -loleaut32 -luuid -lcomdlg32 -ladvapi32 
CMakeFiles/cmTC_e96f0.dir/objects.a(CheckFunctionExists.c.obj):CheckFunctionExists.c:(.text+0x15): undefined reference to `setresuid'

collect2.exe: error: ld returned 1 exit status
make[2]: *** [CMakeFiles/cmTC_e96f0.dir/build.make:88: cmTC_e96f0.exe] Error 1
make[2]: Leaving directory '/home/vagrant/slave/monero-static-win64/build/build/release/CMakeFiles/CMakeTmp'
make[1]: *** [Makefile:121: cmTC_e96f0/fast] Error 2
make[1]: Leaving directory '/home/vagrant/slave/monero-static-win64/build/build/release/CMakeFiles/CMakeTmp'


Determining if the function setreuid exists failed with the following output:
Change Dir: C:/msys64/home/vagrant/slave/monero-static-win64/build/build/release/CMakeFiles/CMakeTmp

Run Build Command:"C:/msys64/usr/bin/make.exe" "cmTC_2bb5a/fast"
make[1]: Entering directory '/home/vagrant/slave/monero-static-win64/build/build/release/CMakeFiles/CMakeTmp'
/usr/bin/make -f CMakeFiles/cmTC_2bb5a.dir/build.make CMakeFiles/cmTC_2bb5a.dir/build
make[2]: Entering directory '/home/vagrant/slave/monero-static-win64/build/build/release/CMakeFiles/CMakeTmp'
Building C object CMakeFiles/cmTC_2bb5a.dir/CheckFunctionExists.c.obj

/C/msys64/mingw64/bin/x86_64-w64-mingw32-gcc.exe   -DCHECK_FUNCTION_EXISTS=setreuid   -o CMakeFiles/cmTC_2bb5a.dir/CheckFunctionExists.c.obj   -c /C/msys64/mingw64/share/cmake-3.12/Modules/CheckFunctionExists.c
Linking C executable cmTC_2bb5a.exe

/C/msys64/mingw64/bin/cmake.exe -E remove -f CMakeFiles/cmTC_2bb5a.dir/objects.a
ar cr CMakeFiles/cmTC_2bb5a.dir/objects.a "CMakeFiles/cmTC_2bb5a.dir/CheckFunctionExists.c.obj" 
/C/msys64/mingw64/bin/x86_64-w64-mingw32-gcc.exe  -DCHECK_FUNCTION_EXISTS=setreuid    -Wl,--whole-archive CMakeFiles/cmTC_2bb5a.dir/objects.a -Wl,--no-whole-archive  -o cmTC_2bb5a.exe -Wl,--major-image-version,0,--minor-image-version,0 -liphlpapi -lws2_32 -lkernel32 -luser32 -lgdi32 -lwinspool -lshell32 -lole32 -loleaut32 -luuid -lcomdlg32 -ladvapi32 
CMakeFiles/cmTC_2bb5a.dir/objects.a(CheckFunctionExists.c.obj):CheckFunctionExists.c:(.text+0x15): undefined reference to `setreuid'

collect2.exe: error: ld returned 1 exit status
make[2]: *** [CMakeFiles/cmTC_2bb5a.dir/build.make:88: cmTC_2bb5a.exe] Error 1
make[2]: Leaving directory '/home/vagrant/slave/monero-static-win64/build/build/release/CMakeFiles/CMakeTmp'
make[1]: *** [Makefile:121: cmTC_2bb5a/fast] Error 2
make[1]: Leaving directory '/home/vagrant/slave/monero-static-win64/build/build/release/CMakeFiles/CMakeTmp'


Determining if the function setrlimit exists failed with the following output:
Change Dir: C:/msys64/home/vagrant/slave/monero-static-win64/build/build/release/CMakeFiles/CMakeTmp

Run Build Command:"C:/msys64/usr/bin/make.exe" "cmTC_42210/fast"
make[1]: Entering directory '/home/vagrant/slave/monero-static-win64/build/build/release/CMakeFiles/CMakeTmp'
/usr/bin/make -f CMakeFiles/cmTC_42210.dir/build.make CMakeFiles/cmTC_42210.dir/build
make[2]: Entering directory '/home/vagrant/slave/monero-static-win64/build/build/release/CMakeFiles/CMakeTmp'
Building C object CMakeFiles/cmTC_42210.dir/CheckFunctionExists.c.obj

/C/msys64/mingw64/bin/x86_64-w64-mingw32-gcc.exe   -DCHECK_FUNCTION_EXISTS=setrlimit   -o CMakeFiles/cmTC_42210.dir/CheckFunctionExists.c.obj   -c /C/msys64/mingw64/share/cmake-3.12/Modules/CheckFunctionExists.c
Linking C executable cmTC_42210.exe

/C/msys64/mingw64/bin/cmake.exe -E remove -f CMakeFiles/cmTC_42210.dir/objects.a
ar cr CMakeFiles/cmTC_42210.dir/objects.a "CMakeFiles/cmTC_42210.dir/CheckFunctionExists.c.obj" 
/C/msys64/mingw64/bin/x86_64-w64-mingw32-gcc.exe  -DCHECK_FUNCTION_EXISTS=setrlimit    -Wl,--whole-archive CMakeFiles/cmTC_42210.dir/objects.a -Wl,--no-whole-archive  -o cmTC_42210.exe -Wl,--major-image-version,0,--minor-image-version,0 -liphlpapi -lws2_32 -lkernel32 -luser32 -lgdi32 -lwinspool -lshell32 -lole32 -loleaut32 -luuid -lcomdlg32 -ladvapi32 
CMakeFiles/cmTC_42210.dir/objects.a(CheckFunctionExists.c.obj):CheckFunctionExists.c:(.text+0x15): undefined reference to `setrlimit'

collect2.exe: error: ld returned 1 exit status
make[2]: *** [CMakeFiles/cmTC_42210.dir/build.make:88: cmTC_42210.exe] Error 1
make[2]: Leaving directory '/home/vagrant/slave/monero-static-win64/build/build/release/CMakeFiles/CMakeTmp'
make[1]: *** [Makefile:121: cmTC_42210/fast] Error 2
make[1]: Leaving directory '/home/vagrant/slave/monero-static-win64/build/build/release/CMakeFiles/CMakeTmp'


Determining if the function setsid exists failed with the following output:
Change Dir: C:/msys64/home/vagrant/slave/monero-static-win64/build/build/release/CMakeFiles/CMakeTmp

Run Build Command:"C:/msys64/usr/bin/make.exe" "cmTC_6aac5/fast"
make[1]: Entering directory '/home/vagrant/slave/monero-static-win64/build/build/release/CMakeFiles/CMakeTmp'
/usr/bin/make -f CMakeFiles/cmTC_6aac5.dir/build.make CMakeFiles/cmTC_6aac5.dir/build
make[2]: Entering directory '/home/vagrant/slave/monero-static-win64/build/build/release/CMakeFiles/CMakeTmp'
Building C object CMakeFiles/cmTC_6aac5.dir/CheckFunctionExists.c.obj

/C/msys64/mingw64/bin/x86_64-w64-mingw32-gcc.exe   -DCHECK_FUNCTION_EXISTS=setsid   -o CMakeFiles/cmTC_6aac5.dir/CheckFunctionExists.c.obj   -c /C/msys64/mingw64/share/cmake-3.12/Modules/CheckFunctionExists.c
Linking C executable cmTC_6aac5.exe

/C/msys64/mingw64/bin/cmake.exe -E remove -f CMakeFiles/cmTC_6aac5.dir/objects.a
ar cr CMakeFiles/cmTC_6aac5.dir/objects.a "CMakeFiles/cmTC_6aac5.dir/CheckFunctionExists.c.obj" 
/C/msys64/mingw64/bin/x86_64-w64-mingw32-gcc.exe  -DCHECK_FUNCTION_EXISTS=setsid    -Wl,--whole-archive CMakeFiles/cmTC_6aac5.dir/objects.a -Wl,--no-whole-archive  -o cmTC_6aac5.exe -Wl,--major-image-version,0,--minor-image-version,0 -liphlpapi -lws2_32 -lkernel32 -luser32 -lgdi32 -lwinspool -lshell32 -lole32 -loleaut32 -luuid -lcomdlg32 -ladvapi32 
CMakeFiles/cmTC_6aac5.dir/objects.a(CheckFunctionExists.c.obj):CheckFunctionExists.c:(.text+0x15): undefined reference to `setsid'

collect2.exe: error: ld returned 1 exit status
make[2]: *** [CMakeFiles/cmTC_6aac5.dir/build.make:88: cmTC_6aac5.exe] Error 1
make[2]: Leaving directory '/home/vagrant/slave/monero-static-win64/build/build/release/CMakeFiles/CMakeTmp'
make[1]: *** [Makefile:121: cmTC_6aac5/fast] Error 2
make[1]: Leaving directory '/home/vagrant/slave/monero-static-win64/build/build/release/CMakeFiles/CMakeTmp'


Determining if the function setusercontent exists failed with the following output:
Change Dir: C:/msys64/home/vagrant/slave/monero-static-win64/build/build/release/CMakeFiles/CMakeTmp

Run Build Command:"C:/msys64/usr/bin/make.exe" "cmTC_3ee78/fast"
make[1]: Entering directory '/home/vagrant/slave/monero-static-win64/build/build/release/CMakeFiles/CMakeTmp'
/usr/bin/make -f CMakeFiles/cmTC_3ee78.dir/build.make CMakeFiles/cmTC_3ee78.dir/build
make[2]: Entering directory '/home/vagrant/slave/monero-static-win64/build/build/release/CMakeFiles/CMakeTmp'
Building C object CMakeFiles/cmTC_3ee78.dir/CheckFunctionExists.c.obj

/C/msys64/mingw64/bin/x86_64-w64-mingw32-gcc.exe   -DCHECK_FUNCTION_EXISTS=setusercontent   -o CMakeFiles/cmTC_3ee78.dir/CheckFunctionExists.c.obj   -c /C/msys64/mingw64/share/cmake-3.12/Modules/CheckFunctionExists.c
Linking C executable cmTC_3ee78.exe

/C/msys64/mingw64/bin/cmake.exe -E remove -f CMakeFiles/cmTC_3ee78.dir/objects.a
ar cr CMakeFiles/cmTC_3ee78.dir/objects.a "CMakeFiles/cmTC_3ee78.dir/CheckFunctionExists.c.obj" 
/C/msys64/mingw64/bin/x86_64-w64-mingw32-gcc.exe  -DCHECK_FUNCTION_EXISTS=setusercontent    -Wl,--whole-archive CMakeFiles/cmTC_3ee78.dir/objects.a -Wl,--no-whole-archive  -o cmTC_3ee78.exe -Wl,--major-image-version,0,--minor-image-version,0 -liphlpapi -lws2_32 -lkernel32 -luser32 -lgdi32 -lwinspool -lshell32 -lole32 -loleaut32 -luuid -lcomdlg32 -ladvapi32 
CMakeFiles/cmTC_3ee78.dir/objects.a(CheckFunctionExists.c.obj):CheckFunctionExists.c:(.text+0x15): undefined reference to `setusercontent'

collect2.exe: error: ld returned 1 exit status
make[2]: *** [CMakeFiles/cmTC_3ee78.dir/build.make:88: cmTC_3ee78.exe] Error 1
make[2]: Leaving directory '/home/vagrant/slave/monero-static-win64/build/build/release/CMakeFiles/CMakeTmp'
make[1]: *** [Makefile:121: cmTC_3ee78/fast] Error 2
make[1]: Leaving directory '/home/vagrant/slave/monero-static-win64/build/build/release/CMakeFiles/CMakeTmp'


Determining if the function sigprocmask exists failed with the following output:
Change Dir: C:/msys64/home/vagrant/slave/monero-static-win64/build/build/release/CMakeFiles/CMakeTmp

Run Build Command:"C:/msys64/usr/bin/make.exe" "cmTC_dfb64/fast"
make[1]: Entering directory '/home/vagrant/slave/monero-static-win64/build/build/release/CMakeFiles/CMakeTmp'
/usr/bin/make -f CMakeFiles/cmTC_dfb64.dir/build.make CMakeFiles/cmTC_dfb64.dir/build
make[2]: Entering directory '/home/vagrant/slave/monero-static-win64/build/build/release/CMakeFiles/CMakeTmp'
Building C object CMakeFiles/cmTC_dfb64.dir/CheckFunctionExists.c.obj

/C/msys64/mingw64/bin/x86_64-w64-mingw32-gcc.exe   -DCHECK_FUNCTION_EXISTS=sigprocmask   -o CMakeFiles/cmTC_dfb64.dir/CheckFunctionExists.c.obj   -c /C/msys64/mingw64/share/cmake-3.12/Modules/CheckFunctionExists.c
Linking C executable cmTC_dfb64.exe

/C/msys64/mingw64/bin/cmake.exe -E remove -f CMakeFiles/cmTC_dfb64.dir/objects.a
ar cr CMakeFiles/cmTC_dfb64.dir/objects.a "CMakeFiles/cmTC_dfb64.dir/CheckFunctionExists.c.obj" 
/C/msys64/mingw64/bin/x86_64-w64-mingw32-gcc.exe  -DCHECK_FUNCTION_EXISTS=sigprocmask    -Wl,--whole-archive CMakeFiles/cmTC_dfb64.dir/objects.a -Wl,--no-whole-archive  -o cmTC_dfb64.exe -Wl,--major-image-version,0,--minor-image-version,0 -liphlpapi -lws2_32 -lkernel32 -luser32 -lgdi32 -lwinspool -lshell32 -lole32 -loleaut32 -luuid -lcomdlg32 -ladvapi32 
CMakeFiles/cmTC_dfb64.dir/objects.a(CheckFunctionExists.c.obj):CheckFunctionExists.c:(.text+0x15): undefined reference to `sigprocmask'

collect2.exe: error: ld returned 1 exit status
make[2]: *** [CMakeFiles/cmTC_dfb64.dir/build.make:88: cmTC_dfb64.exe] Error 1
make[2]: Leaving directory '/home/vagrant/slave/monero-static-win64/build/build/release/CMakeFiles/CMakeTmp'
make[1]: *** [Makefile:121: cmTC_dfb64/fast] Error 2
make[1]: Leaving directory '/home/vagrant/slave/monero-static-win64/build/build/release/CMakeFiles/CMakeTmp'


Determining if the function socketpair exists failed with the following output:
Change Dir: C:/msys64/home/vagrant/slave/monero-static-win64/build/build/release/CMakeFiles/CMakeTmp

Run Build Command:"C:/msys64/usr/bin/make.exe" "cmTC_4da6b/fast"
make[1]: Entering directory '/home/vagrant/slave/monero-static-win64/build/build/release/CMakeFiles/CMakeTmp'
/usr/bin/make -f CMakeFiles/cmTC_4da6b.dir/build.make CMakeFiles/cmTC_4da6b.dir/build
make[2]: Entering directory '/home/vagrant/slave/monero-static-win64/build/build/release/CMakeFiles/CMakeTmp'
Building C object CMakeFiles/cmTC_4da6b.dir/CheckFunctionExists.c.obj

/C/msys64/mingw64/bin/x86_64-w64-mingw32-gcc.exe   -DCHECK_FUNCTION_EXISTS=socketpair   -o CMakeFiles/cmTC_4da6b.dir/CheckFunctionExists.c.obj   -c /C/msys64/mingw64/share/cmake-3.12/Modules/CheckFunctionExists.c
Linking C executable cmTC_4da6b.exe

/C/msys64/mingw64/bin/cmake.exe -E remove -f CMakeFiles/cmTC_4da6b.dir/objects.a
ar cr CMakeFiles/cmTC_4da6b.dir/objects.a "CMakeFiles/cmTC_4da6b.dir/CheckFunctionExists.c.obj" 
/C/msys64/mingw64/bin/x86_64-w64-mingw32-gcc.exe  -DCHECK_FUNCTION_EXISTS=socketpair    -Wl,--whole-archive CMakeFiles/cmTC_4da6b.dir/objects.a -Wl,--no-whole-archive  -o cmTC_4da6b.exe -Wl,--major-image-version,0,--minor-image-version,0 -liphlpapi -lws2_32 -lkernel32 -luser32 -lgdi32 -lwinspool -lshell32 -lole32 -loleaut32 -luuid -lcomdlg32 -ladvapi32 
CMakeFiles/cmTC_4da6b.dir/objects.a(CheckFunctionExists.c.obj):CheckFunctionExists.c:(.text+0x15): undefined reference to `socketpair'

collect2.exe: error: ld returned 1 exit status
make[2]: *** [CMakeFiles/cmTC_4da6b.dir/build.make:88: cmTC_4da6b.exe] Error 1
make[2]: Leaving directory '/home/vagrant/slave/monero-static-win64/build/build/release/CMakeFiles/CMakeTmp'
make[1]: *** [Makefile:121: cmTC_4da6b/fast] Error 2
make[1]: Leaving directory '/home/vagrant/slave/monero-static-win64/build/build/release/CMakeFiles/CMakeTmp'


Determining if the function srandom exists failed with the following output:
Change Dir: C:/msys64/home/vagrant/slave/monero-static-win64/build/build/release/CMakeFiles/CMakeTmp

Run Build Command:"C:/msys64/usr/bin/make.exe" "cmTC_57a65/fast"
make[1]: Entering directory '/home/vagrant/slave/monero-static-win64/build/build/release/CMakeFiles/CMakeTmp'
/usr/bin/make -f CMakeFiles/cmTC_57a65.dir/build.make CMakeFiles/cmTC_57a65.dir/build
make[2]: Entering directory '/home/vagrant/slave/monero-static-win64/build/build/release/CMakeFiles/CMakeTmp'
Building C object CMakeFiles/cmTC_57a65.dir/CheckFunctionExists.c.obj

/C/msys64/mingw64/bin/x86_64-w64-mingw32-gcc.exe   -DCHECK_FUNCTION_EXISTS=srandom   -o CMakeFiles/cmTC_57a65.dir/CheckFunctionExists.c.obj   -c /C/msys64/mingw64/share/cmake-3.12/Modules/CheckFunctionExists.c
Linking C executable cmTC_57a65.exe

/C/msys64/mingw64/bin/cmake.exe -E remove -f CMakeFiles/cmTC_57a65.dir/objects.a
ar cr CMakeFiles/cmTC_57a65.dir/objects.a "CMakeFiles/cmTC_57a65.dir/CheckFunctionExists.c.obj" 
/C/msys64/mingw64/bin/x86_64-w64-mingw32-gcc.exe  -DCHECK_FUNCTION_EXISTS=srandom    -Wl,--whole-archive CMakeFiles/cmTC_57a65.dir/objects.a -Wl,--no-whole-archive  -o cmTC_57a65.exe -Wl,--major-image-version,0,--minor-image-version,0 -liphlpapi -lws2_32 -lkernel32 -luser32 -lgdi32 -lwinspool -lshell32 -lole32 -loleaut32 -luuid -lcomdlg32 -ladvapi32 
CMakeFiles/cmTC_57a65.dir/objects.a(CheckFunctionExists.c.obj):CheckFunctionExists.c:(.text+0x15): undefined reference to `srandom'

collect2.exe: error: ld returned 1 exit status
make[2]: *** [CMakeFiles/cmTC_57a65.dir/build.make:88: cmTC_57a65.exe] Error 1
make[2]: Leaving directory '/home/vagrant/slave/monero-static-win64/build/build/release/CMakeFiles/CMakeTmp'
make[1]: *** [Makefile:121: cmTC_57a65/fast] Error 2
make[1]: Leaving directory '/home/vagrant/slave/monero-static-win64/build/build/release/CMakeFiles/CMakeTmp'


Determining if the function strsep exists failed with the following output:
Change Dir: C:/msys64/home/vagrant/slave/monero-static-win64/build/build/release/CMakeFiles/CMakeTmp

Run Build Command:"C:/msys64/usr/bin/make.exe" "cmTC_97d92/fast"
make[1]: Entering directory '/home/vagrant/slave/monero-static-win64/build/build/release/CMakeFiles/CMakeTmp'
/usr/bin/make -f CMakeFiles/cmTC_97d92.dir/build.make CMakeFiles/cmTC_97d92.dir/build
make[2]: Entering directory '/home/vagrant/slave/monero-static-win64/build/build/release/CMakeFiles/CMakeTmp'
Building C object CMakeFiles/cmTC_97d92.dir/CheckFunctionExists.c.obj

/C/msys64/mingw64/bin/x86_64-w64-mingw32-gcc.exe   -DCHECK_FUNCTION_EXISTS=strsep   -o CMakeFiles/cmTC_97d92.dir/CheckFunctionExists.c.obj   -c /C/msys64/mingw64/share/cmake-3.12/Modules/CheckFunctionExists.c
Linking C executable cmTC_97d92.exe

/C/msys64/mingw64/bin/cmake.exe -E remove -f CMakeFiles/cmTC_97d92.dir/objects.a
ar cr CMakeFiles/cmTC_97d92.dir/objects.a "CMakeFiles/cmTC_97d92.dir/CheckFunctionExists.c.obj" 
/C/msys64/mingw64/bin/x86_64-w64-mingw32-gcc.exe  -DCHECK_FUNCTION_EXISTS=strsep    -Wl,--whole-archive CMakeFiles/cmTC_97d92.dir/objects.a -Wl,--no-whole-archive  -o cmTC_97d92.exe -Wl,--major-image-version,0,--minor-image-version,0 -liphlpapi -lws2_32 -lkernel32 -luser32 -lgdi32 -lwinspool -lshell32 -lole32 -loleaut32 -luuid -lcomdlg32 -ladvapi32 
CMakeFiles/cmTC_97d92.dir/objects.a(CheckFunctionExists.c.obj):CheckFunctionExists.c:(.text+0x15): undefined reference to `strsep'

collect2.exe: error: ld returned 1 exit status
make[2]: *** [CMakeFiles/cmTC_97d92.dir/build.make:88: cmTC_97d92.exe] Error 1
make[2]: Leaving directory '/home/vagrant/slave/monero-static-win64/build/build/release/CMakeFiles/CMakeTmp'
make[1]: *** [Makefile:121: cmTC_97d92/fast] Error 2
make[1]: Leaving directory '/home/vagrant/slave/monero-static-win64/build/build/release/CMakeFiles/CMakeTmp'


Determining if the function strlcat exists failed with the following output:
Change Dir: C:/msys64/home/vagrant/slave/monero-static-win64/build/build/release/CMakeFiles/CMakeTmp

Run Build Command:"C:/msys64/usr/bin/make.exe" "cmTC_e77f8/fast"
make[1]: Entering directory '/home/vagrant/slave/monero-static-win64/build/build/release/CMakeFiles/CMakeTmp'
/usr/bin/make -f CMakeFiles/cmTC_e77f8.dir/build.make CMakeFiles/cmTC_e77f8.dir/build
make[2]: Entering directory '/home/vagrant/slave/monero-static-win64/build/build/release/CMakeFiles/CMakeTmp'
Building C object CMakeFiles/cmTC_e77f8.dir/CheckFunctionExists.c.obj

/C/msys64/mingw64/bin/x86_64-w64-mingw32-gcc.exe   -DCHECK_FUNCTION_EXISTS=strlcat   -o CMakeFiles/cmTC_e77f8.dir/CheckFunctionExists.c.obj   -c /C/msys64/mingw64/share/cmake-3.12/Modules/CheckFunctionExists.c
Linking C executable cmTC_e77f8.exe

/C/msys64/mingw64/bin/cmake.exe -E remove -f CMakeFiles/cmTC_e77f8.dir/objects.a
ar cr CMakeFiles/cmTC_e77f8.dir/objects.a "CMakeFiles/cmTC_e77f8.dir/CheckFunctionExists.c.obj" 
/C/msys64/mingw64/bin/x86_64-w64-mingw32-gcc.exe  -DCHECK_FUNCTION_EXISTS=strlcat    -Wl,--whole-archive CMakeFiles/cmTC_e77f8.dir/objects.a -Wl,--no-whole-archive  -o cmTC_e77f8.exe -Wl,--major-image-version,0,--minor-image-version,0 -liphlpapi -lws2_32 -lkernel32 -luser32 -lgdi32 -lwinspool -lshell32 -lole32 -loleaut32 -luuid -lcomdlg32 -ladvapi32 
CMakeFiles/cmTC_e77f8.dir/objects.a(CheckFunctionExists.c.obj):CheckFunctionExists.c:(.text+0x15): undefined reference to `strlcat'

collect2.exe: error: ld returned 1 exit status
make[2]: *** [CMakeFiles/cmTC_e77f8.dir/build.make:88: cmTC_e77f8.exe] Error 1
make[2]: Leaving directory '/home/vagrant/slave/monero-static-win64/build/build/release/CMakeFiles/CMakeTmp'
make[1]: *** [Makefile:121: cmTC_e77f8/fast] Error 2
make[1]: Leaving directory '/home/vagrant/slave/monero-static-win64/build/build/release/CMakeFiles/CMakeTmp'


Determining if the function strlcpy exists failed with the following output:
Change Dir: C:/msys64/home/vagrant/slave/monero-static-win64/build/build/release/CMakeFiles/CMakeTmp

Run Build Command:"C:/msys64/usr/bin/make.exe" "cmTC_0617e/fast"
make[1]: Entering directory '/home/vagrant/slave/monero-static-win64/build/build/release/CMakeFiles/CMakeTmp'
/usr/bin/make -f CMakeFiles/cmTC_0617e.dir/build.make CMakeFiles/cmTC_0617e.dir/build
make[2]: Entering directory '/home/vagrant/slave/monero-static-win64/build/build/release/CMakeFiles/CMakeTmp'
Building C object CMakeFiles/cmTC_0617e.dir/CheckFunctionExists.c.obj

/C/msys64/mingw64/bin/x86_64-w64-mingw32-gcc.exe   -DCHECK_FUNCTION_EXISTS=strlcpy   -o CMakeFiles/cmTC_0617e.dir/CheckFunctionExists.c.obj   -c /C/msys64/mingw64/share/cmake-3.12/Modules/CheckFunctionExists.c
Linking C executable cmTC_0617e.exe

/C/msys64/mingw64/bin/cmake.exe -E remove -f CMakeFiles/cmTC_0617e.dir/objects.a
ar cr CMakeFiles/cmTC_0617e.dir/objects.a "CMakeFiles/cmTC_0617e.dir/CheckFunctionExists.c.obj" 
/C/msys64/mingw64/bin/x86_64-w64-mingw32-gcc.exe  -DCHECK_FUNCTION_EXISTS=strlcpy    -Wl,--whole-archive CMakeFiles/cmTC_0617e.dir/objects.a -Wl,--no-whole-archive  -o cmTC_0617e.exe -Wl,--major-image-version,0,--minor-image-version,0 -liphlpapi -lws2_32 -lkernel32 -luser32 -lgdi32 -lwinspool -lshell32 -lole32 -loleaut32 -luuid -lcomdlg32 -ladvapi32 
CMakeFiles/cmTC_0617e.dir/objects.a(CheckFunctionExists.c.obj):CheckFunctionExists.c:(.text+0x15): undefined reference to `strlcpy'

collect2.exe: error: ld returned 1 exit status
make[2]: *** [CMakeFiles/cmTC_0617e.dir/build.make:88: cmTC_0617e.exe] Error 1
make[2]: Leaving directory '/home/vagrant/slave/monero-static-win64/build/build/release/CMakeFiles/CMakeTmp'
make[1]: *** [Makefile:121: cmTC_0617e/fast] Error 2
make[1]: Leaving directory '/home/vagrant/slave/monero-static-win64/build/build/release/CMakeFiles/CMakeTmp'


Determining if the function strptime exists failed with the following output:
Change Dir: C:/msys64/home/vagrant/slave/monero-static-win64/build/build/release/CMakeFiles/CMakeTmp

Run Build Command:"C:/msys64/usr/bin/make.exe" "cmTC_71f84/fast"
make[1]: Entering directory '/home/vagrant/slave/monero-static-win64/build/build/release/CMakeFiles/CMakeTmp'
/usr/bin/make -f CMakeFiles/cmTC_71f84.dir/build.make CMakeFiles/cmTC_71f84.dir/build
make[2]: Entering directory '/home/vagrant/slave/monero-static-win64/build/build/release/CMakeFiles/CMakeTmp'
Building C object CMakeFiles/cmTC_71f84.dir/CheckFunctionExists.c.obj

/C/msys64/mingw64/bin/x86_64-w64-mingw32-gcc.exe   -DCHECK_FUNCTION_EXISTS=strptime   -o CMakeFiles/cmTC_71f84.dir/CheckFunctionExists.c.obj   -c /C/msys64/mingw64/share/cmake-3.12/Modules/CheckFunctionExists.c
Linking C executable cmTC_71f84.exe

/C/msys64/mingw64/bin/cmake.exe -E remove -f CMakeFiles/cmTC_71f84.dir/objects.a
ar cr CMakeFiles/cmTC_71f84.dir/objects.a "CMakeFiles/cmTC_71f84.dir/CheckFunctionExists.c.obj" 
/C/msys64/mingw64/bin/x86_64-w64-mingw32-gcc.exe  -DCHECK_FUNCTION_EXISTS=strptime    -Wl,--whole-archive CMakeFiles/cmTC_71f84.dir/objects.a -Wl,--no-whole-archive  -o cmTC_71f84.exe -Wl,--major-image-version,0,--minor-image-version,0 -liphlpapi -lws2_32 -lkernel32 -luser32 -lgdi32 -lwinspool -lshell32 -lole32 -loleaut32 -luuid -lcomdlg32 -ladvapi32 
CMakeFiles/cmTC_71f84.dir/objects.a(CheckFunctionExists.c.obj):CheckFunctionExists.c:(.text+0x15): undefined reference to `strptime'

collect2.exe: error: ld returned 1 exit status
make[2]: *** [CMakeFiles/cmTC_71f84.dir/build.make:88: cmTC_71f84.exe] Error 1
make[2]: Leaving directory '/home/vagrant/slave/monero-static-win64/build/build/release/CMakeFiles/CMakeTmp'
make[1]: *** [Makefile:121: cmTC_71f84/fast] Error 2
make[1]: Leaving directory '/home/vagrant/slave/monero-static-win64/build/build/release/CMakeFiles/CMakeTmp'


Determining if the function writev exists failed with the following output:
Change Dir: C:/msys64/home/vagrant/slave/monero-static-win64/build/build/release/CMakeFiles/CMakeTmp

Run Build Command:"C:/msys64/usr/bin/make.exe" "cmTC_280b1/fast"
make[1]: Entering directory '/home/vagrant/slave/monero-static-win64/build/build/release/CMakeFiles/CMakeTmp'
/usr/bin/make -f CMakeFiles/cmTC_280b1.dir/build.make CMakeFiles/cmTC_280b1.dir/build
make[2]: Entering directory '/home/vagrant/slave/monero-static-win64/build/build/release/CMakeFiles/CMakeTmp'
Building C object CMakeFiles/cmTC_280b1.dir/CheckFunctionExists.c.obj

/C/msys64/mingw64/bin/x86_64-w64-mingw32-gcc.exe   -DCHECK_FUNCTION_EXISTS=writev   -o CMakeFiles/cmTC_280b1.dir/CheckFunctionExists.c.obj   -c /C/msys64/mingw64/share/cmake-3.12/Modules/CheckFunctionExists.c
Linking C executable cmTC_280b1.exe

/C/msys64/mingw64/bin/cmake.exe -E remove -f CMakeFiles/cmTC_280b1.dir/objects.a
ar cr CMakeFiles/cmTC_280b1.dir/objects.a "CMakeFiles/cmTC_280b1.dir/CheckFunctionExists.c.obj" 
/C/msys64/mingw64/bin/x86_64-w64-mingw32-gcc.exe  -DCHECK_FUNCTION_EXISTS=writev    -Wl,--whole-archive CMakeFiles/cmTC_280b1.dir/objects.a -Wl,--no-whole-archive  -o cmTC_280b1.exe -Wl,--major-image-version,0,--minor-image-version,0 -liphlpapi -lws2_32 -lkernel32 -luser32 -lgdi32 -lwinspool -lshell32 -lole32 -loleaut32 -luuid -lcomdlg32 -ladvapi32 
CMakeFiles/cmTC_280b1.dir/objects.a(CheckFunctionExists.c.obj):CheckFunctionExists.c:(.text+0x15): undefined reference to `writev'

collect2.exe: error: ld returned 1 exit status
make[2]: *** [CMakeFiles/cmTC_280b1.dir/build.make:88: cmTC_280b1.exe] Error 1
make[2]: Leaving directory '/home/vagrant/slave/monero-static-win64/build/build/release/CMakeFiles/CMakeTmp'
make[1]: *** [Makefile:121: cmTC_280b1/fast] Error 2
make[1]: Leaving directory '/home/vagrant/slave/monero-static-win64/build/build/release/CMakeFiles/CMakeTmp'


Determining size of gid_t failed with the following output:
Change Dir: C:/msys64/home/vagrant/slave/monero-static-win64/build/build/release/CMakeFiles/CMakeTmp

Run Build Command:"C:/msys64/usr/bin/make.exe" "cmTC_0dbb6/fast"
make[1]: Entering directory '/home/vagrant/slave/monero-static-win64/build/build/release/CMakeFiles/CMakeTmp'
/usr/bin/make -f CMakeFiles/cmTC_0dbb6.dir/build.make CMakeFiles/cmTC_0dbb6.dir/build
make[2]: Entering directory '/home/vagrant/slave/monero-static-win64/build/build/release/CMakeFiles/CMakeTmp'
Building C object CMakeFiles/cmTC_0dbb6.dir/gid_t.c.obj

/C/msys64/mingw64/bin/x86_64-w64-mingw32-gcc.exe    -o CMakeFiles/cmTC_0dbb6.dir/gid_t.c.obj   -c /C/msys64/home/vagrant/slave/monero-static-win64/build/build/release/CMakeFiles/CheckTypeSize/gid_t.c
C:/msys64/home/vagrant/slave/monero-static-win64/build/build/release/CMakeFiles/CheckTypeSize/gid_t.c:24:22: error: 'gid_t' undeclared here (not in a function); did you mean 'pid_t'?
 #define SIZE (sizeof(gid_t))
                      ^~~~~
C:/msys64/home/vagrant/slave/monero-static-win64/build/build/release/CMakeFiles/CheckTypeSize/gid_t.c:26:12: note: in expansion of macro 'SIZE'
   ('0' + ((SIZE / 10000)%10)),
            ^~~~
make[2]: *** [CMakeFiles/cmTC_0dbb6.dir/build.make:66: CMakeFiles/cmTC_0dbb6.dir/gid_t.c.obj] Error 1
make[2]: Leaving directory '/home/vagrant/slave/monero-static-win64/build/build/release/CMakeFiles/CMakeTmp'
make[1]: *** [Makefile:121: cmTC_0dbb6/fast] Error 2
make[1]: Leaving directory '/home/vagrant/slave/monero-static-win64/build/build/release/CMakeFiles/CMakeTmp'

C:/msys64/home/vagrant/slave/monero-static-win64/build/build/release/CMakeFiles/CheckTypeSize/gid_t.c:
#include <sys/types.h>
#include <stdint.h>
#include <stddef.h>
#include "sys/types.h"


#undef KEY
#if defined(__i386)
# define KEY '_','_','i','3','8','6'
#elif defined(__x86_64)
# define KEY '_','_','x','8','6','_','6','4'
#elif defined(__ppc__)
# define KEY '_','_','p','p','c','_','_'
#elif defined(__ppc64__)
# define KEY '_','_','p','p','c','6','4','_','_'
#elif defined(__aarch64__)
# define KEY '_','_','a','a','r','c','h','6','4','_','_'
#elif defined(__ARM_ARCH_7A__)
# define KEY '_','_','A','R','M','_','A','R','C','H','_','7','A','_','_'
#elif defined(__ARM_ARCH_7S__)
# define KEY '_','_','A','R','M','_','A','R','C','H','_','7','S','_','_'
#endif

#define SIZE (sizeof(gid_t))
char info_size[] =  {'I', 'N', 'F', 'O', ':', 's','i','z','e','[',
  ('0' + ((SIZE / 10000)%10)),
  ('0' + ((SIZE / 1000)%10)),
  ('0' + ((SIZE / 100)%10)),
  ('0' + ((SIZE / 10)%10)),
  ('0' +  (SIZE    % 10)),
  ']',
#ifdef KEY
  ' ','k','e','y','[', KEY, ']',
#endif
  '\0'};

#ifdef __CLASSIC_C__
int main(argc, argv) int argc; char *argv[];
#else
int main(int argc, char *argv[])
#endif
{
  int require = 0;
  require += info_size[argc];
  (void)argv;
  return require;
}


Determining size of in_addr_t failed with the following output:
Change Dir: C:/msys64/home/vagrant/slave/monero-static-win64/build/build/release/CMakeFiles/CMakeTmp

Run Build Command:"C:/msys64/usr/bin/make.exe" "cmTC_4304e/fast"
make[1]: Entering directory '/home/vagrant/slave/monero-static-win64/build/build/release/CMakeFiles/CMakeTmp'
/usr/bin/make -f CMakeFiles/cmTC_4304e.dir/build.make CMakeFiles/cmTC_4304e.dir/build
make[2]: Entering directory '/home/vagrant/slave/monero-static-win64/build/build/release/CMakeFiles/CMakeTmp'
Building C object CMakeFiles/cmTC_4304e.dir/in_addr_t.c.obj

/C/msys64/mingw64/bin/x86_64-w64-mingw32-gcc.exe    -o CMakeFiles/cmTC_4304e.dir/in_addr_t.c.obj   -c /C/msys64/home/vagrant/slave/monero-static-win64/build/build/release/CMakeFiles/CheckTypeSize/in_addr_t.c
C:/msys64/home/vagrant/slave/monero-static-win64/build/build/release/CMakeFiles/CheckTypeSize/in_addr_t.c:4:10: fatal error: netinet/in.h: No such file or directory
 #include "netinet/in.h"
          ^~~~~~~~~~~~~~
compilation terminated.

make[2]: *** [CMakeFiles/cmTC_4304e.dir/build.make:66: CMakeFiles/cmTC_4304e.dir/in_addr_t.c.obj] Error 1
make[2]: Leaving directory '/home/vagrant/slave/monero-static-win64/build/build/release/CMakeFiles/CMakeTmp'
make[1]: *** [Makefile:121: cmTC_4304e/fast] Error 2
make[1]: Leaving directory '/home/vagrant/slave/monero-static-win64/build/build/release/CMakeFiles/CMakeTmp'

C:/msys64/home/vagrant/slave/monero-static-win64/build/build/release/CMakeFiles/CheckTypeSize/in_addr_t.c:
#include <sys/types.h>
#include <stdint.h>
#include <stddef.h>
#include "netinet/in.h"


#undef KEY
#if defined(__i386)
# define KEY '_','_','i','3','8','6'
#elif defined(__x86_64)
# define KEY '_','_','x','8','6','_','6','4'
#elif defined(__ppc__)
# define KEY '_','_','p','p','c','_','_'
#elif defined(__ppc64__)
# define KEY '_','_','p','p','c','6','4','_','_'
#elif defined(__aarch64__)
# define KEY '_','_','a','a','r','c','h','6','4','_','_'
#elif defined(__ARM_ARCH_7A__)
# define KEY '_','_','A','R','M','_','A','R','C','H','_','7','A','_','_'
#elif defined(__ARM_ARCH_7S__)
# define KEY '_','_','A','R','M','_','A','R','C','H','_','7','S','_','_'
#endif

#define SIZE (sizeof(in_addr_t))
char info_size[] =  {'I', 'N', 'F', 'O', ':', 's','i','z','e','[',
  ('0' + ((SIZE / 10000)%10)),
  ('0' + ((SIZE / 1000)%10)),
  ('0' + ((SIZE / 100)%10)),
  ('0' + ((SIZE / 10)%10)),
  ('0' +  (SIZE    % 10)),
  ']',
#ifdef KEY
  ' ','k','e','y','[', KEY, ']',
#endif
  '\0'};

#ifdef __CLASSIC_C__
int main(argc, argv) int argc; char *argv[];
#else
int main(int argc, char *argv[])
#endif
{
  int require = 0;
  require += info_size[argc];
  (void)argv;
  return require;
}


Determining size of in_port_t failed with the following output:
Change Dir: C:/msys64/home/vagrant/slave/monero-static-win64/build/build/release/CMakeFiles/CMakeTmp

Run Build Command:"C:/msys64/usr/bin/make.exe" "cmTC_d64d2/fast"
make[1]: Entering directory '/home/vagrant/slave/monero-static-win64/build/build/release/CMakeFiles/CMakeTmp'
/usr/bin/make -f CMakeFiles/cmTC_d64d2.dir/build.make CMakeFiles/cmTC_d64d2.dir/build
make[2]: Entering directory '/home/vagrant/slave/monero-static-win64/build/build/release/CMakeFiles/CMakeTmp'
Building C object CMakeFiles/cmTC_d64d2.dir/in_port_t.c.obj

/C/msys64/mingw64/bin/x86_64-w64-mingw32-gcc.exe    -o CMakeFiles/cmTC_d64d2.dir/in_port_t.c.obj   -c /C/msys64/home/vagrant/slave/monero-static-win64/build/build/release/CMakeFiles/CheckTypeSize/in_port_t.c
C:/msys64/home/vagrant/slave/monero-static-win64/build/build/release/CMakeFiles/CheckTypeSize/in_port_t.c:4:10: fatal error: netinet/in.h: No such file or directory
 #include "netinet/in.h"
          ^~~~~~~~~~~~~~
compilation terminated.

make[2]: *** [CMakeFiles/cmTC_d64d2.dir/build.make:66: CMakeFiles/cmTC_d64d2.dir/in_port_t.c.obj] Error 1
make[2]: Leaving directory '/home/vagrant/slave/monero-static-win64/build/build/release/CMakeFiles/CMakeTmp'
make[1]: *** [Makefile:121: cmTC_d64d2/fast] Error 2
make[1]: Leaving directory '/home/vagrant/slave/monero-static-win64/build/build/release/CMakeFiles/CMakeTmp'

C:/msys64/home/vagrant/slave/monero-static-win64/build/build/release/CMakeFiles/CheckTypeSize/in_port_t.c:
#include <sys/types.h>
#include <stdint.h>
#include <stddef.h>
#include "netinet/in.h"


#undef KEY
#if defined(__i386)
# define KEY '_','_','i','3','8','6'
#elif defined(__x86_64)
# define KEY '_','_','x','8','6','_','6','4'
#elif defined(__ppc__)
# define KEY '_','_','p','p','c','_','_'
#elif defined(__ppc64__)
# define KEY '_','_','p','p','c','6','4','_','_'
#elif defined(__aarch64__)
# define KEY '_','_','a','a','r','c','h','6','4','_','_'
#elif defined(__ARM_ARCH_7A__)
# define KEY '_','_','A','R','M','_','A','R','C','H','_','7','A','_','_'
#elif defined(__ARM_ARCH_7S__)
# define KEY '_','_','A','R','M','_','A','R','C','H','_','7','S','_','_'
#endif

#define SIZE (sizeof(in_port_t))
char info_size[] =  {'I', 'N', 'F', 'O', ':', 's','i','z','e','[',
  ('0' + ((SIZE / 10000)%10)),
  ('0' + ((SIZE / 1000)%10)),
  ('0' + ((SIZE / 100)%10)),
  ('0' + ((SIZE / 10)%10)),
  ('0' +  (SIZE    % 10)),
  ']',
#ifdef KEY
  ' ','k','e','y','[', KEY, ']',
#endif
  '\0'};

#ifdef __CLASSIC_C__
int main(argc, argv) int argc; char *argv[];
#else
int main(int argc, char *argv[])
#endif
{
  int require = 0;
  require += info_size[argc];
  (void)argv;
  return require;
}


Determining size of rlim_t failed with the following output:
Change Dir: C:/msys64/home/vagrant/slave/monero-static-win64/build/build/release/CMakeFiles/CMakeTmp

Run Build Command:"C:/msys64/usr/bin/make.exe" "cmTC_feca5/fast"
make[1]: Entering directory '/home/vagrant/slave/monero-static-win64/build/build/release/CMakeFiles/CMakeTmp'
/usr/bin/make -f CMakeFiles/cmTC_feca5.dir/build.make CMakeFiles/cmTC_feca5.dir/build
make[2]: Entering directory '/home/vagrant/slave/monero-static-win64/build/build/release/CMakeFiles/CMakeTmp'
Building C object CMakeFiles/cmTC_feca5.dir/rlim_t.c.obj

/C/msys64/mingw64/bin/x86_64-w64-mingw32-gcc.exe    -o CMakeFiles/cmTC_feca5.dir/rlim_t.c.obj   -c /C/msys64/home/vagrant/slave/monero-static-win64/build/build/release/CMakeFiles/CheckTypeSize/rlim_t.c
C:/msys64/home/vagrant/slave/monero-static-win64/build/build/release/CMakeFiles/CheckTypeSize/rlim_t.c:4:10: fatal error: sys/resource.h: No such file or directory
 #include "sys/resource.h"
          ^~~~~~~~~~~~~~~~
compilation terminated.

make[2]: *** [CMakeFiles/cmTC_feca5.dir/build.make:66: CMakeFiles/cmTC_feca5.dir/rlim_t.c.obj] Error 1
make[2]: Leaving directory '/home/vagrant/slave/monero-static-win64/build/build/release/CMakeFiles/CMakeTmp'
make[1]: *** [Makefile:121: cmTC_feca5/fast] Error 2
make[1]: Leaving directory '/home/vagrant/slave/monero-static-win64/build/build/release/CMakeFiles/CMakeTmp'

C:/msys64/home/vagrant/slave/monero-static-win64/build/build/release/CMakeFiles/CheckTypeSize/rlim_t.c:
#include <sys/types.h>
#include <stdint.h>
#include <stddef.h>
#include "sys/resource.h"


#undef KEY
#if defined(__i386)
# define KEY '_','_','i','3','8','6'
#elif defined(__x86_64)
# define KEY '_','_','x','8','6','_','6','4'
#elif defined(__ppc__)
# define KEY '_','_','p','p','c','_','_'
#elif defined(__ppc64__)
# define KEY '_','_','p','p','c','6','4','_','_'
#elif defined(__aarch64__)
# define KEY '_','_','a','a','r','c','h','6','4','_','_'
#elif defined(__ARM_ARCH_7A__)
# define KEY '_','_','A','R','M','_','A','R','C','H','_','7','A','_','_'
#elif defined(__ARM_ARCH_7S__)
# define KEY '_','_','A','R','M','_','A','R','C','H','_','7','S','_','_'
#endif

#define SIZE (sizeof(rlim_t))
char info_size[] =  {'I', 'N', 'F', 'O', ':', 's','i','z','e','[',
  ('0' + ((SIZE / 10000)%10)),
  ('0' + ((SIZE / 1000)%10)),
  ('0' + ((SIZE / 100)%10)),
  ('0' + ((SIZE / 10)%10)),
  ('0' +  (SIZE    % 10)),
  ']',
#ifdef KEY
  ' ','k','e','y','[', KEY, ']',
#endif
  '\0'};

#ifdef __CLASSIC_C__
int main(argc, argv) int argc; char *argv[];
#else
int main(int argc, char *argv[])
#endif
{
  int require = 0;
  require += info_size[argc];
  (void)argv;
  return require;
}


Determining size of uid_t failed with the following output:
Change Dir: C:/msys64/home/vagrant/slave/monero-static-win64/build/build/release/CMakeFiles/CMakeTmp

Run Build Command:"C:/msys64/usr/bin/make.exe" "cmTC_adaf9/fast"
make[1]: Entering directory '/home/vagrant/slave/monero-static-win64/build/build/release/CMakeFiles/CMakeTmp'
/usr/bin/make -f CMakeFiles/cmTC_adaf9.dir/build.make CMakeFiles/cmTC_adaf9.dir/build
make[2]: Entering directory '/home/vagrant/slave/monero-static-win64/build/build/release/CMakeFiles/CMakeTmp'
Building C object CMakeFiles/cmTC_adaf9.dir/uid_t.c.obj

/C/msys64/mingw64/bin/x86_64-w64-mingw32-gcc.exe    -o CMakeFiles/cmTC_adaf9.dir/uid_t.c.obj   -c /C/msys64/home/vagrant/slave/monero-static-win64/build/build/release/CMakeFiles/CheckTypeSize/uid_t.c
C:/msys64/home/vagrant/slave/monero-static-win64/build/build/release/CMakeFiles/CheckTypeSize/uid_t.c:24:22: error: 'uid_t' undeclared here (not in a function); did you mean 'pid_t'?
 #define SIZE (sizeof(uid_t))
                      ^~~~~
C:/msys64/home/vagrant/slave/monero-static-win64/build/build/release/CMakeFiles/CheckTypeSize/uid_t.c:26:12: note: in expansion of macro 'SIZE'
   ('0' + ((SIZE / 10000)%10)),
            ^~~~
make[2]: *** [CMakeFiles/cmTC_adaf9.dir/build.make:66: CMakeFiles/cmTC_adaf9.dir/uid_t.c.obj] Error 1
make[2]: Leaving directory '/home/vagrant/slave/monero-static-win64/build/build/release/CMakeFiles/CMakeTmp'
make[1]: *** [Makefile:121: cmTC_adaf9/fast] Error 2
make[1]: Leaving directory '/home/vagrant/slave/monero-static-win64/build/build/release/CMakeFiles/CMakeTmp'

C:/msys64/home/vagrant/slave/monero-static-win64/build/build/release/CMakeFiles/CheckTypeSize/uid_t.c:
#include <sys/types.h>
#include <stdint.h>
#include <stddef.h>
#include "sys/types.h"


#undef KEY
#if defined(__i386)
# define KEY '_','_','i','3','8','6'
#elif defined(__x86_64)
# define KEY '_','_','x','8','6','_','6','4'
#elif defined(__ppc__)
# define KEY '_','_','p','p','c','_','_'
#elif defined(__ppc64__)
# define KEY '_','_','p','p','c','6','4','_','_'
#elif defined(__aarch64__)
# define KEY '_','_','a','a','r','c','h','6','4','_','_'
#elif defined(__ARM_ARCH_7A__)
# define KEY '_','_','A','R','M','_','A','R','C','H','_','7','A','_','_'
#elif defined(__ARM_ARCH_7S__)
# define KEY '_','_','A','R','M','_','A','R','C','H','_','7','S','_','_'
#endif

#define SIZE (sizeof(uid_t))
char info_size[] =  {'I', 'N', 'F', 'O', ':', 's','i','z','e','[',
  ('0' + ((SIZE / 10000)%10)),
  ('0' + ((SIZE / 1000)%10)),
  ('0' + ((SIZE / 100)%10)),
  ('0' + ((SIZE / 10)%10)),
  ('0' +  (SIZE    % 10)),
  ']',
#ifdef KEY
  ' ','k','e','y','[', KEY, ']',
#endif
  '\0'};

#ifdef __CLASSIC_C__
int main(argc, argv) int argc; char *argv[];
#else
int main(int argc, char *argv[])
#endif
{
  int require = 0;
  require += info_size[argc];
  (void)argv;
  return require;
}


Determining if the pthread_rwlock_t exist failed with the following output:
Change Dir: C:/msys64/home/vagrant/slave/monero-static-win64/build/build/release/CMakeFiles/CMakeTmp

Run Build Command:"C:/msys64/usr/bin/make.exe" "cmTC_a94b5/fast"
make[1]: Entering directory '/home/vagrant/slave/monero-static-win64/build/build/release/CMakeFiles/CMakeTmp'
/usr/bin/make -f CMakeFiles/cmTC_a94b5.dir/build.make CMakeFiles/cmTC_a94b5.dir/build
make[2]: Entering directory '/home/vagrant/slave/monero-static-win64/build/build/release/CMakeFiles/CMakeTmp'
Building C object CMakeFiles/cmTC_a94b5.dir/CheckSymbolExists.c.obj

/C/msys64/mingw64/bin/x86_64-w64-mingw32-gcc.exe    -o CMakeFiles/cmTC_a94b5.dir/CheckSymbolExists.c.obj   -c /C/msys64/home/vagrant/slave/monero-static-win64/build/build/release/CMakeFiles/CMakeTmp/CheckSymbolExists.c
C:/msys64/home/vagrant/slave/monero-static-win64/build/build/release/CMakeFiles/CMakeTmp/CheckSymbolExists.c: In function 'main':
C:/msys64/home/vagrant/slave/monero-static-win64/build/build/release/CMakeFiles/CMakeTmp/CheckSymbolExists.c:8:19: error: expected expression before 'pthread_rwlock_t'
   return ((int*)(&pthread_rwlock_t))[argc];
                   ^~~~~~~~~~~~~~~~
make[2]: *** [CMakeFiles/cmTC_a94b5.dir/build.make:66: CMakeFiles/cmTC_a94b5.dir/CheckSymbolExists.c.obj] Error 1
make[2]: Leaving directory '/home/vagrant/slave/monero-static-win64/build/build/release/CMakeFiles/CMakeTmp'
make[1]: *** [Makefile:121: cmTC_a94b5/fast] Error 2
make[1]: Leaving directory '/home/vagrant/slave/monero-static-win64/build/build/release/CMakeFiles/CMakeTmp'

File C:/msys64/home/vagrant/slave/monero-static-win64/build/build/release/CMakeFiles/CMakeTmp/CheckSymbolExists.c:
/* */
#include <pthread.h>

int main(int argc, char** argv)
{
  (void)argv;
#ifndef pthread_rwlock_t
  return ((int*)(&pthread_rwlock_t))[argc];
#else
  (void)argc;
  return 0;
#endif
}

Determining if the pthread_spinlock_t exist failed with the following output:
Change Dir: C:/msys64/home/vagrant/slave/monero-static-win64/build/build/release/CMakeFiles/CMakeTmp

Run Build Command:"C:/msys64/usr/bin/make.exe" "cmTC_c5d5f/fast"
make[1]: Entering directory '/home/vagrant/slave/monero-static-win64/build/build/release/CMakeFiles/CMakeTmp'
/usr/bin/make -f CMakeFiles/cmTC_c5d5f.dir/build.make CMakeFiles/cmTC_c5d5f.dir/build
make[2]: Entering directory '/home/vagrant/slave/monero-static-win64/build/build/release/CMakeFiles/CMakeTmp'
Building C object CMakeFiles/cmTC_c5d5f.dir/CheckSymbolExists.c.obj

/C/msys64/mingw64/bin/x86_64-w64-mingw32-gcc.exe    -o CMakeFiles/cmTC_c5d5f.dir/CheckSymbolExists.c.obj   -c /C/msys64/home/vagrant/slave/monero-static-win64/build/build/release/CMakeFiles/CMakeTmp/CheckSymbolExists.c
C:/msys64/home/vagrant/slave/monero-static-win64/build/build/release/CMakeFiles/CMakeTmp/CheckSymbolExists.c: In function 'main':
C:/msys64/home/vagrant/slave/monero-static-win64/build/build/release/CMakeFiles/CMakeTmp/CheckSymbolExists.c:8:19: error: expected expression before 'pthread_spinlock_t'
   return ((int*)(&pthread_spinlock_t))[argc];
                   ^~~~~~~~~~~~~~~~~~
make[2]: *** [CMakeFiles/cmTC_c5d5f.dir/build.make:66: CMakeFiles/cmTC_c5d5f.dir/CheckSymbolExists.c.obj] Error 1
make[2]: Leaving directory '/home/vagrant/slave/monero-static-win64/build/build/release/CMakeFiles/CMakeTmp'
make[1]: *** [Makefile:121: cmTC_c5d5f/fast] Error 2
make[1]: Leaving directory '/home/vagrant/slave/monero-static-win64/build/build/release/CMakeFiles/CMakeTmp'

File C:/msys64/home/vagrant/slave/monero-static-win64/build/build/release/CMakeFiles/CMakeTmp/CheckSymbolExists.c:
/* */
#include <pthread.h>

int main(int argc, char** argv)
{
  (void)argv;
#ifndef pthread_spinlock_t
  return ((int*)(&pthread_spinlock_t))[argc];
#else
  (void)argc;
  return 0;
#endif
}

Determining if the LIBRESSL_VERSION_TEXT exist failed with the following output:
Change Dir: C:/msys64/home/vagrant/slave/monero-static-win64/build/build/release/CMakeFiles/CMakeTmp

Run Build Command:"C:/msys64/usr/bin/make.exe" "cmTC_ec59f/fast"
make[1]: Entering directory '/home/vagrant/slave/monero-static-win64/build/build/release/CMakeFiles/CMakeTmp'
/usr/bin/make -f CMakeFiles/cmTC_ec59f.dir/build.make CMakeFiles/cmTC_ec59f.dir/build
make[2]: Entering directory '/home/vagrant/slave/monero-static-win64/build/build/release/CMakeFiles/CMakeTmp'
Building C object CMakeFiles/cmTC_ec59f.dir/CheckSymbolExists.c.obj

/C/msys64/mingw64/bin/x86_64-w64-mingw32-gcc.exe    -o CMakeFiles/cmTC_ec59f.dir/CheckSymbolExists.c.obj   -c /C/msys64/home/vagrant/slave/monero-static-win64/build/build/release/CMakeFiles/CMakeTmp/CheckSymbolExists.c
C:/msys64/home/vagrant/slave/monero-static-win64/build/build/release/CMakeFiles/CMakeTmp/CheckSymbolExists.c: In function 'main':
C:/msys64/home/vagrant/slave/monero-static-win64/build/build/release/CMakeFiles/CMakeTmp/CheckSymbolExists.c:8:19: error: 'LIBRESSL_VERSION_TEXT' undeclared (first use in this function); did you mean 'OPENSSL_VERSION_TEXT'?
   return ((int*)(&LIBRESSL_VERSION_TEXT))[argc];
                   ^~~~~~~~~~~~~~~~~~~~~
                   OPENSSL_VERSION_TEXT
C:/msys64/home/vagrant/slave/monero-static-win64/build/build/release/CMakeFiles/CMakeTmp/CheckSymbolExists.c:8:19: note: each undeclared identifier is reported only once for each function it appears in
make[2]: *** [CMakeFiles/cmTC_ec59f.dir/build.make:66: CMakeFiles/cmTC_ec59f.dir/CheckSymbolExists.c.obj] Error 1
make[2]: Leaving directory '/home/vagrant/slave/monero-static-win64/build/build/release/CMakeFiles/CMakeTmp'
make[1]: *** [Makefile:121: cmTC_ec59f/fast] Error 2
make[1]: Leaving directory '/home/vagrant/slave/monero-static-win64/build/build/release/CMakeFiles/CMakeTmp'

File C:/msys64/home/vagrant/slave/monero-static-win64/build/build/release/CMakeFiles/CMakeTmp/CheckSymbolExists.c:
/* */
#include <openssl/opensslv.h>

int main(int argc, char** argv)
{
  (void)argv;
#ifndef LIBRESSL_VERSION_TEXT
  return ((int*)(&LIBRESSL_VERSION_TEXT))[argc];
#else
  (void)argc;
  return 0;
#endif
}

Determining if the -Wl,-z,relro linker flag is supported failed with the following output:
Change Dir: C:/msys64/home/vagrant/slave/monero-static-win64/build/build/release/CMakeFiles/CMakeTmp

Run Build Command:"C:/msys64/usr/bin/make.exe" "cmTC_300c0/fast"
make[1]: Entering directory '/home/vagrant/slave/monero-static-win64/build/build/release/CMakeFiles/CMakeTmp'
/usr/bin/make -f CMakeFiles/cmTC_300c0.dir/build.make CMakeFiles/cmTC_300c0.dir/build
make[2]: Entering directory '/home/vagrant/slave/monero-static-win64/build/build/release/CMakeFiles/CMakeTmp'
Building C object CMakeFiles/cmTC_300c0.dir/CheckLinkerFlag.c.obj

/C/msys64/mingw64/bin/x86_64-w64-mingw32-gcc.exe   -Wl,-z,relro    -Wl,-z,relro -o CMakeFiles/cmTC_300c0.dir/CheckLinkerFlag.c.obj   -c /C/msys64/home/vagrant/slave/monero-static-win64/build/cmake/CheckLinkerFlag.c
Linking C executable cmTC_300c0.exe

/C/msys64/mingw64/bin/cmake.exe -E remove -f CMakeFiles/cmTC_300c0.dir/objects.a
ar cr CMakeFiles/cmTC_300c0.dir/objects.a "CMakeFiles/cmTC_300c0.dir/CheckLinkerFlag.c.obj" 
/C/msys64/mingw64/bin/x86_64-w64-mingw32-gcc.exe -Wl,-z,relro     -Wl,--whole-archive CMakeFiles/cmTC_300c0.dir/objects.a -Wl,--no-whole-archive  -o cmTC_300c0.exe -Wl,--major-image-version,0,--minor-image-version,0 -lkernel32 -luser32 -lgdi32 -lwinspool -lshell32 -lole32 -loleaut32 -luuid -lcomdlg32 -ladvapi32 
C:/msys64/mingw64/bin/../lib/gcc/x86_64-w64-mingw32/8.2.1/../../../../x86_64-w64-mingw32/bin/ld.exe: unrecognized option '-z'

C:/msys64/mingw64/bin/../lib/gcc/x86_64-w64-mingw32/8.2.1/../../../../x86_64-w64-mingw32/bin/ld.exe: use the --help option for usage information

collect2.exe: error: ld returned 1 exit status
make[2]: *** [CMakeFiles/cmTC_300c0.dir/build.make:88: cmTC_300c0.exe] Error 1
make[2]: Leaving directory '/home/vagrant/slave/monero-static-win64/build/build/release/CMakeFiles/CMakeTmp'
make[1]: *** [Makefile:121: cmTC_300c0/fast] Error 2
make[1]: Leaving directory '/home/vagrant/slave/monero-static-win64/build/build/release/CMakeFiles/CMakeTmp'


Determining if the -Wl,-z,now linker flag is supported failed with the following output:
Change Dir: C:/msys64/home/vagrant/slave/monero-static-win64/build/build/release/CMakeFiles/CMakeTmp

Run Build Command:"C:/msys64/usr/bin/make.exe" "cmTC_616e1/fast"
make[1]: Entering directory '/home/vagrant/slave/monero-static-win64/build/build/release/CMakeFiles/CMakeTmp'
/usr/bin/make -f CMakeFiles/cmTC_616e1.dir/build.make CMakeFiles/cmTC_616e1.dir/build
make[2]: Entering directory '/home/vagrant/slave/monero-static-win64/build/build/release/CMakeFiles/CMakeTmp'
Building C object CMakeFiles/cmTC_616e1.dir/CheckLinkerFlag.c.obj

/C/msys64/mingw64/bin/x86_64-w64-mingw32-gcc.exe   -Wl,-z,now    -Wl,-z,now -o CMakeFiles/cmTC_616e1.dir/CheckLinkerFlag.c.obj   -c /C/msys64/home/vagrant/slave/monero-static-win64/build/cmake/CheckLinkerFlag.c
Linking C executable cmTC_616e1.exe

/C/msys64/mingw64/bin/cmake.exe -E remove -f CMakeFiles/cmTC_616e1.dir/objects.a
ar cr CMakeFiles/cmTC_616e1.dir/objects.a "CMakeFiles/cmTC_616e1.dir/CheckLinkerFlag.c.obj" 
/C/msys64/mingw64/bin/x86_64-w64-mingw32-gcc.exe -Wl,-z,now     -Wl,--whole-archive CMakeFiles/cmTC_616e1.dir/objects.a -Wl,--no-whole-archive  -o cmTC_616e1.exe -Wl,--major-image-version,0,--minor-image-version,0 -lkernel32 -luser32 -lgdi32 -lwinspool -lshell32 -lole32 -loleaut32 -luuid -lcomdlg32 -ladvapi32 
C:/msys64/mingw64/bin/../lib/gcc/x86_64-w64-mingw32/8.2.1/../../../../x86_64-w64-mingw32/bin/ld.exe: unrecognized option '-z'

C:/msys64/mingw64/bin/../lib/gcc/x86_64-w64-mingw32/8.2.1/../../../../x86_64-w64-mingw32/bin/ld.exe: use the --help option for usage information

collect2.exe: error: ld returned 1 exit status
make[2]: *** [CMakeFiles/cmTC_616e1.dir/build.make:88: cmTC_616e1.exe] Error 1
make[2]: Leaving directory '/home/vagrant/slave/monero-static-win64/build/build/release/CMakeFiles/CMakeTmp'
make[1]: *** [Makefile:121: cmTC_616e1/fast] Error 2
make[1]: Leaving directory '/home/vagrant/slave/monero-static-win64/build/build/release/CMakeFiles/CMakeTmp'


Determining if the -Wl,-z,noexecstack linker flag is supported failed with the following output:
Change Dir: C:/msys64/home/vagrant/slave/monero-static-win64/build/build/release/CMakeFiles/CMakeTmp

Run Build Command:"C:/msys64/usr/bin/make.exe" "cmTC_6e4ec/fast"
make[1]: Entering directory '/home/vagrant/slave/monero-static-win64/build/build/release/CMakeFiles/CMakeTmp'
/usr/bin/make -f CMakeFiles/cmTC_6e4ec.dir/build.make CMakeFiles/cmTC_6e4ec.dir/build
make[2]: Entering directory '/home/vagrant/slave/monero-static-win64/build/build/release/CMakeFiles/CMakeTmp'
Building C object CMakeFiles/cmTC_6e4ec.dir/CheckLinkerFlag.c.obj

/C/msys64/mingw64/bin/x86_64-w64-mingw32-gcc.exe   -Wl,-z,noexecstack    -Wl,-z,noexecstack -o CMakeFiles/cmTC_6e4ec.dir/CheckLinkerFlag.c.obj   -c /C/msys64/home/vagrant/slave/monero-static-win64/build/cmake/CheckLinkerFlag.c
Linking C executable cmTC_6e4ec.exe

/C/msys64/mingw64/bin/cmake.exe -E remove -f CMakeFiles/cmTC_6e4ec.dir/objects.a
ar cr CMakeFiles/cmTC_6e4ec.dir/objects.a "CMakeFiles/cmTC_6e4ec.dir/CheckLinkerFlag.c.obj" 
/C/msys64/mingw64/bin/x86_64-w64-mingw32-gcc.exe -Wl,-z,noexecstack     -Wl,--whole-archive CMakeFiles/cmTC_6e4ec.dir/objects.a -Wl,--no-whole-archive  -o cmTC_6e4ec.exe -Wl,--major-image-version,0,--minor-image-version,0 -lkernel32 -luser32 -lgdi32 -lwinspool -lshell32 -lole32 -loleaut32 -luuid -lcomdlg32 -ladvapi32 
C:/msys64/mingw64/bin/../lib/gcc/x86_64-w64-mingw32/8.2.1/../../../../x86_64-w64-mingw32/bin/ld.exe: unrecognized option '-z'

C:/msys64/mingw64/bin/../lib/gcc/x86_64-w64-mingw32/8.2.1/../../../../x86_64-w64-mingw32/bin/ld.exe: use the --help option for usage information

collect2.exe: error: ld returned 1 exit status
make[2]: *** [CMakeFiles/cmTC_6e4ec.dir/build.make:88: cmTC_6e4ec.exe] Error 1
make[2]: Leaving directory '/home/vagrant/slave/monero-static-win64/build/build/release/CMakeFiles/CMakeTmp'
make[1]: *** [Makefile:121: cmTC_6e4ec/fast] Error 2
make[1]: Leaving directory '/home/vagrant/slave/monero-static-win64/build/build/release/CMakeFiles/CMakeTmp'


Determining if the -Wl,-z,noexecheap linker flag is supported failed with the following output:
Change Dir: C:/msys64/home/vagrant/slave/monero-static-win64/build/build/release/CMakeFiles/CMakeTmp

Run Build Command:"C:/msys64/usr/bin/make.exe" "cmTC_78c73/fast"
make[1]: Entering directory '/home/vagrant/slave/monero-static-win64/build/build/release/CMakeFiles/CMakeTmp'
/usr/bin/make -f CMakeFiles/cmTC_78c73.dir/build.make CMakeFiles/cmTC_78c73.dir/build
make[2]: Entering directory '/home/vagrant/slave/monero-static-win64/build/build/release/CMakeFiles/CMakeTmp'
Building C object CMakeFiles/cmTC_78c73.dir/CheckLinkerFlag.c.obj

/C/msys64/mingw64/bin/x86_64-w64-mingw32-gcc.exe   -Wl,-z,noexecheap    -Wl,-z,noexecheap -o CMakeFiles/cmTC_78c73.dir/CheckLinkerFlag.c.obj   -c /C/msys64/home/vagrant/slave/monero-static-win64/build/cmake/CheckLinkerFlag.c
Linking C executable cmTC_78c73.exe

/C/msys64/mingw64/bin/cmake.exe -E remove -f CMakeFiles/cmTC_78c73.dir/objects.a
ar cr CMakeFiles/cmTC_78c73.dir/objects.a "CMakeFiles/cmTC_78c73.dir/CheckLinkerFlag.c.obj" 
/C/msys64/mingw64/bin/x86_64-w64-mingw32-gcc.exe -Wl,-z,noexecheap     -Wl,--whole-archive CMakeFiles/cmTC_78c73.dir/objects.a -Wl,--no-whole-archive  -o cmTC_78c73.exe -Wl,--major-image-version,0,--minor-image-version,0 -lkernel32 -luser32 -lgdi32 -lwinspool -lshell32 -lole32 -loleaut32 -luuid -lcomdlg32 -ladvapi32 
C:/msys64/mingw64/bin/../lib/gcc/x86_64-w64-mingw32/8.2.1/../../../../x86_64-w64-mingw32/bin/ld.exe: unrecognized option '-z'

C:/msys64/mingw64/bin/../lib/gcc/x86_64-w64-mingw32/8.2.1/../../../../x86_64-w64-mingw32/bin/ld.exe: use the --help option for usage information

collect2.exe: error: ld returned 1 exit status
make[2]: *** [CMakeFiles/cmTC_78c73.dir/build.make:88: cmTC_78c73.exe] Error 1
make[2]: Leaving directory '/home/vagrant/slave/monero-static-win64/build/build/release/CMakeFiles/CMakeTmp'
make[1]: *** [Makefile:121: cmTC_78c73/fast] Error 2
make[1]: Leaving directory '/home/vagrant/slave/monero-static-win64/build/build/release/CMakeFiles/CMakeTmp'


Determining if the function rl_copy_text exists failed with the following output:
Change Dir: C:/msys64/home/vagrant/slave/monero-static-win64/build/build/release/CMakeFiles/CMakeTmp

Run Build Command:"C:/msys64/usr/bin/make.exe" "cmTC_5af23/fast"
make[1]: Entering directory '/home/vagrant/slave/monero-static-win64/build/build/release/CMakeFiles/CMakeTmp'
/usr/bin/make -f CMakeFiles/cmTC_5af23.dir/build.make CMakeFiles/cmTC_5af23.dir/build
make[2]: Entering directory '/home/vagrant/slave/monero-static-win64/build/build/release/CMakeFiles/CMakeTmp'
Building C object CMakeFiles/cmTC_5af23.dir/CheckFunctionExists.c.obj

/C/msys64/mingw64/bin/x86_64-w64-mingw32-gcc.exe   -maes -march=x86-64 -fno-strict-aliasing -std=c11 -D_GNU_SOURCE -m64 -DWIN32_LEAN_AND_MEAN  -Wall -Wextra -Wpointer-arith -Wundef -Wvla -Wwrite-strings -Wno-error=extra -Wno-error=deprecated-declarations -Wno-unused-parameter -Wno-unused-variable -Wno-error=unused-variable -Wno-error=undef -Wno-error=uninitialized -Wlogical-op -Wno-error=maybe-uninitialized -Wno-error=cpp -Wno-error=unused-value -Wno-error=unused-but-set-variable -Waggregate-return -Wnested-externs -Wold-style-definition -Wstrict-prototypes  -fPIC  -U_FORTIFY_SOURCE -D_FORTIFY_SOURCE=1 -Wformat -Wformat-security -mmitigate-rop -fno-strict-aliasing -DCHECK_FUNCTION_EXISTS=rl_copy_text   -o CMakeFiles/cmTC_5af23.dir/CheckFunctionExists.c.obj   -c /C/msys64/mingw64/share/cmake-3.12/Modules/CheckFunctionExists.c
Linking C executable cmTC_5af23.exe

/C/msys64/mingw64/bin/cmake.exe -E remove -f CMakeFiles/cmTC_5af23.dir/objects.a
ar cr CMakeFiles/cmTC_5af23.dir/objects.a "CMakeFiles/cmTC_5af23.dir/CheckFunctionExists.c.obj" 
/C/msys64/mingw64/bin/x86_64-w64-mingw32-gcc.exe  -maes -march=x86-64 -fno-strict-aliasing -std=c11 -D_GNU_SOURCE -m64 -DWIN32_LEAN_AND_MEAN  -Wall -Wextra -Wpointer-arith -Wundef -Wvla -Wwrite-strings -Wno-error=extra -Wno-error=deprecated-declarations -Wno-unused-parameter -Wno-unused-variable -Wno-error=unused-variable -Wno-error=undef -Wno-error=uninitialized -Wlogical-op -Wno-error=maybe-uninitialized -Wno-error=cpp -Wno-error=unused-value -Wno-error=unused-but-set-variable -Waggregate-return -Wnested-externs -Wold-style-definition -Wstrict-prototypes  -fPIC  -U_FORTIFY_SOURCE -D_FORTIFY_SOURCE=1 -Wformat -Wformat-security -mmitigate-rop -fno-strict-aliasing -DCHECK_FUNCTION_EXISTS=rl_copy_text    -Wl,--whole-archive CMakeFiles/cmTC_5af23.dir/objects.a -Wl,--no-whole-archive  -o cmTC_5af23.exe -Wl,--major-image-version,0,--minor-image-version,0 /C/msys64/mingw64/lib/libreadline.a -lkernel32 -luser32 -lgdi32 -lwinspool -lshell32 -lole32 -loleaut32 -luuid -lcomdlg32 -ladvapi32 
C:/msys64/mingw64/lib/libreadline.a(terminal.o):(.text+0x186): undefined reference to `tgetnum'

C:/msys64/mingw64/lib/libreadline.a(terminal.o):(.text+0x2c9): undefined reference to `tgetnum'

C:/msys64/mingw64/lib/libreadline.a(terminal.o):(.text+0x779): undefined reference to `tgetent'

C:/msys64/mingw64/lib/libreadline.a(terminal.o):(.text+0x7bf): undefined reference to `tgetstr'

C:/msys64/mingw64/lib/libreadline.a(terminal.o):(.text+0x81e): undefined reference to `tgetflag'

C:/msys64/mingw64/lib/libreadline.a(terminal.o):(.text+0x86d): undefined reference to `tgetflag'

C:/msys64/mingw64/lib/libreadline.a(terminal.o):(.text+0x988): undefined reference to `tgetflag'

C:/msys64/mingw64/lib/libreadline.a(terminal.o):(.text+0xb87): undefined reference to `tputs'

C:/msys64/mingw64/lib/libreadline.a(terminal.o):(.text+0xc6d): undefined reference to `tputs'

C:/msys64/mingw64/lib/libreadline.a(terminal.o):(.text+0xcb7): undefined reference to `tputs'

C:/msys64/mingw64/lib/libreadline.a(terminal.o):(.text+0xd0d): undefined reference to `tputs'

C:/msys64/mingw64/lib/libreadline.a(terminal.o):(.text+0xd3d): undefined reference to `tputs'

C:/msys64/mingw64/lib/libreadline.a(terminal.o):(.text+0xd80): more undefined references to `tputs' follow

collect2.exe: error: ld returned 1 exit status
make[2]: *** [CMakeFiles/cmTC_5af23.dir/build.make:89: cmTC_5af23.exe] Error 1
make[2]: Leaving directory '/home/vagrant/slave/monero-static-win64/build/build/release/CMakeFiles/CMakeTmp'
make[1]: *** [Makefile:121: cmTC_5af23/fast] Error 2
make[1]: Leaving directory '/home/vagrant/slave/monero-static-win64/build/build/release/CMakeFiles/CMakeTmp'


Determining if the function rl_filename_completion_function exists failed with the following output:
Change Dir: C:/msys64/home/vagrant/slave/monero-static-win64/build/build/release/CMakeFiles/CMakeTmp

Run Build Command:"C:/msys64/usr/bin/make.exe" "cmTC_73b6b/fast"
make[1]: Entering directory '/home/vagrant/slave/monero-static-win64/build/build/release/CMakeFiles/CMakeTmp'
/usr/bin/make -f CMakeFiles/cmTC_73b6b.dir/build.make CMakeFiles/cmTC_73b6b.dir/build
make[2]: Entering directory '/home/vagrant/slave/monero-static-win64/build/build/release/CMakeFiles/CMakeTmp'
Building C object CMakeFiles/cmTC_73b6b.dir/CheckFunctionExists.c.obj

/C/msys64/mingw64/bin/x86_64-w64-mingw32-gcc.exe   -maes -march=x86-64 -fno-strict-aliasing -std=c11 -D_GNU_SOURCE -m64 -DWIN32_LEAN_AND_MEAN  -Wall -Wextra -Wpointer-arith -Wundef -Wvla -Wwrite-strings -Wno-error=extra -Wno-error=deprecated-declarations -Wno-unused-parameter -Wno-unused-variable -Wno-error=unused-variable -Wno-error=undef -Wno-error=uninitialized -Wlogical-op -Wno-error=maybe-uninitialized -Wno-error=cpp -Wno-error=unused-value -Wno-error=unused-but-set-variable -Waggregate-return -Wnested-externs -Wold-style-definition -Wstrict-prototypes  -fPIC  -U_FORTIFY_SOURCE -D_FORTIFY_SOURCE=1 -Wformat -Wformat-security -mmitigate-rop -fno-strict-aliasing -DCHECK_FUNCTION_EXISTS=rl_filename_completion_function   -o CMakeFiles/cmTC_73b6b.dir/CheckFunctionExists.c.obj   -c /C/msys64/mingw64/share/cmake-3.12/Modules/CheckFunctionExists.c
Linking C executable cmTC_73b6b.exe

/C/msys64/mingw64/bin/cmake.exe -E remove -f CMakeFiles/cmTC_73b6b.dir/objects.a
ar cr CMakeFiles/cmTC_73b6b.dir/objects.a "CMakeFiles/cmTC_73b6b.dir/CheckFunctionExists.c.obj" 
/C/msys64/mingw64/bin/x86_64-w64-mingw32-gcc.exe  -maes -march=x86-64 -fno-strict-aliasing -std=c11 -D_GNU_SOURCE -m64 -DWIN32_LEAN_AND_MEAN  -Wall -Wextra -Wpointer-arith -Wundef -Wvla -Wwrite-strings -Wno-error=extra -Wno-error=deprecated-declarations -Wno-unused-parameter -Wno-unused-variable -Wno-error=unused-variable -Wno-error=undef -Wno-error=uninitialized -Wlogical-op -Wno-error=maybe-uninitialized -Wno-error=cpp -Wno-error=unused-value -Wno-error=unused-but-set-variable -Waggregate-return -Wnested-externs -Wold-style-definition -Wstrict-prototypes  -fPIC  -U_FORTIFY_SOURCE -D_FORTIFY_SOURCE=1 -Wformat -Wformat-security -mmitigate-rop -fno-strict-aliasing -DCHECK_FUNCTION_EXISTS=rl_filename_completion_function    -Wl,--whole-archive CMakeFiles/cmTC_73b6b.dir/objects.a -Wl,--no-whole-archive  -o cmTC_73b6b.exe -Wl,--major-image-version,0,--minor-image-version,0 /C/msys64/mingw64/lib/libreadline.a -lkernel32 -luser32 -lgdi32 -lwinspool -lshell32 -lole32 -loleaut32 -luuid -lcomdlg32 -ladvapi32 
C:/msys64/mingw64/lib/libreadline.a(display.o):(.text+0xa6c): undefined reference to `tputs'

C:/msys64/mingw64/lib/libreadline.a(display.o):(.text+0xb8e): undefined reference to `tputs'

C:/msys64/mingw64/lib/libreadline.a(display.o):(.text+0xbe2): undefined reference to `tputs'

C:/msys64/mingw64/lib/libreadline.a(display.o):(.text+0x19a5): undefined reference to `tputs'

C:/msys64/mingw64/lib/libreadline.a(display.o):(.text+0x2b47): undefined reference to `tputs'

C:/msys64/mingw64/lib/libreadline.a(display.o):(.text+0x2c4e): more undefined references to `tputs' follow

C:/msys64/mingw64/lib/libreadline.a(terminal.o):(.text+0x186): undefined reference to `tgetnum'

C:/msys64/mingw64/lib/libreadline.a(terminal.o):(.text+0x2c9): undefined reference to `tgetnum'

C:/msys64/mingw64/lib/libreadline.a(terminal.o):(.text+0x779): undefined reference to `tgetent'

C:/msys64/mingw64/lib/libreadline.a(terminal.o):(.text+0x7bf): undefined reference to `tgetstr'

C:/msys64/mingw64/lib/libreadline.a(terminal.o):(.text+0x81e): undefined reference to `tgetflag'

C:/msys64/mingw64/lib/libreadline.a(terminal.o):(.text+0x86d): undefined reference to `tgetflag'

C:/msys64/mingw64/lib/libreadline.a(terminal.o):(.text+0x988): undefined reference to `tgetflag'

C:/msys64/mingw64/lib/libreadline.a(terminal.o):(.text+0xb87): undefined reference to `tputs'

C:/msys64/mingw64/lib/libreadline.a(terminal.o):(.text+0xc6d): undefined reference to `tputs'

C:/msys64/mingw64/lib/libreadline.a(terminal.o):(.text+0xcb7): undefined reference to `tputs'

C:/msys64/mingw64/lib/libreadline.a(terminal.o):(.text+0xd0d): undefined reference to `tputs'

C:/msys64/mingw64/lib/libreadline.a(terminal.o):(.text+0xd3d): undefined reference to `tputs'

C:/msys64/mingw64/lib/libreadline.a(terminal.o):(.text+0xd80): more undefined references to `tputs' follow

collect2.exe: error: ld returned 1 exit status
make[2]: *** [CMakeFiles/cmTC_73b6b.dir/build.make:89: cmTC_73b6b.exe] Error 1
make[2]: Leaving directory '/home/vagrant/slave/monero-static-win64/build/build/release/CMakeFiles/CMakeTmp'
make[1]: *** [Makefile:121: cmTC_73b6b/fast] Error 2
make[1]: Leaving directory '/home/vagrant/slave/monero-static-win64/build/build/release/CMakeFiles/CMakeTmp'