(view as text)
Determining if the function memset_s exists in the c failed with the following output:
Change Dir: C:/msys64/home/vagrant/slave/monero-static-win64/build/build/release/CMakeFiles/CMakeTmp

Run Build Command:"C:/msys64/usr/bin/make.exe" "cmTC_75549/fast"
make[1]: Entering directory '/home/vagrant/slave/monero-static-win64/build/build/release/CMakeFiles/CMakeTmp'
/usr/bin/make -f CMakeFiles/cmTC_75549.dir/build.make CMakeFiles/cmTC_75549.dir/build
make[2]: Entering directory '/home/vagrant/slave/monero-static-win64/build/build/release/CMakeFiles/CMakeTmp'
Building C object CMakeFiles/cmTC_75549.dir/CheckFunctionExists.c.obj

/C/msys64/mingw64/bin/x86_64-w64-mingw32-gcc.exe   -DCHECK_FUNCTION_EXISTS=memset_s   -o CMakeFiles/cmTC_75549.dir/CheckFunctionExists.c.obj   -c /C/msys64/mingw64/share/cmake-3.12/Modules/CheckFunctionExists.c
Linking C executable cmTC_75549.exe

/C/msys64/mingw64/bin/cmake.exe -E remove -f CMakeFiles/cmTC_75549.dir/objects.a
ar cr CMakeFiles/cmTC_75549.dir/objects.a "CMakeFiles/cmTC_75549.dir/CheckFunctionExists.c.obj" 
/C/msys64/mingw64/bin/x86_64-w64-mingw32-gcc.exe  -DCHECK_FUNCTION_EXISTS=memset_s    -Wl,--whole-archive CMakeFiles/cmTC_75549.dir/objects.a -Wl,--no-whole-archive  -o cmTC_75549.exe -Wl,--major-image-version,0,--minor-image-version,0  -L/C/msys64/home/vagrant/slave/monero-static-win64/build/build/release/CMakeFiles/CMakeTmp/string.h -lc -lkernel32 -luser32 -lgdi32 -lwinspool -lshell32 -lole32 -loleaut32 -luuid -lcomdlg32 -ladvapi32 
C:/msys64/mingw64/bin/../lib/gcc/x86_64-w64-mingw32/8.2.1/../../../../x86_64-w64-mingw32/bin/ld.exe: cannot find -lc

collect2.exe: error: ld returned 1 exit status
make[2]: *** [CMakeFiles/cmTC_75549.dir/build.make:88: cmTC_75549.exe] Error 1
make[2]: Leaving directory '/home/vagrant/slave/monero-static-win64/build/build/release/CMakeFiles/CMakeTmp'
make[1]: *** [Makefile:121: cmTC_75549/fast] Error 2
make[1]: Leaving directory '/home/vagrant/slave/monero-static-win64/build/build/release/CMakeFiles/CMakeTmp'


Determining if the function explicit_bzero exists in the c failed with the following output:
Change Dir: C:/msys64/home/vagrant/slave/monero-static-win64/build/build/release/CMakeFiles/CMakeTmp

Run Build Command:"C:/msys64/usr/bin/make.exe" "cmTC_01061/fast"
make[1]: Entering directory '/home/vagrant/slave/monero-static-win64/build/build/release/CMakeFiles/CMakeTmp'
/usr/bin/make -f CMakeFiles/cmTC_01061.dir/build.make CMakeFiles/cmTC_01061.dir/build
make[2]: Entering directory '/home/vagrant/slave/monero-static-win64/build/build/release/CMakeFiles/CMakeTmp'
Building C object CMakeFiles/cmTC_01061.dir/CheckFunctionExists.c.obj

/C/msys64/mingw64/bin/x86_64-w64-mingw32-gcc.exe   -DCHECK_FUNCTION_EXISTS=explicit_bzero   -o CMakeFiles/cmTC_01061.dir/CheckFunctionExists.c.obj   -c /C/msys64/mingw64/share/cmake-3.12/Modules/CheckFunctionExists.c
Linking C executable cmTC_01061.exe

/C/msys64/mingw64/bin/cmake.exe -E remove -f CMakeFiles/cmTC_01061.dir/objects.a
ar cr CMakeFiles/cmTC_01061.dir/objects.a "CMakeFiles/cmTC_01061.dir/CheckFunctionExists.c.obj" 
/C/msys64/mingw64/bin/x86_64-w64-mingw32-gcc.exe  -DCHECK_FUNCTION_EXISTS=explicit_bzero    -Wl,--whole-archive CMakeFiles/cmTC_01061.dir/objects.a -Wl,--no-whole-archive  -o cmTC_01061.exe -Wl,--major-image-version,0,--minor-image-version,0  -L/C/msys64/home/vagrant/slave/monero-static-win64/build/build/release/CMakeFiles/CMakeTmp/strings.h -lc -lkernel32 -luser32 -lgdi32 -lwinspool -lshell32 -lole32 -loleaut32 -luuid -lcomdlg32 -ladvapi32 
C:/msys64/mingw64/bin/../lib/gcc/x86_64-w64-mingw32/8.2.1/../../../../x86_64-w64-mingw32/bin/ld.exe: cannot find -lc

collect2.exe: error: ld returned 1 exit status
make[2]: *** [CMakeFiles/cmTC_01061.dir/build.make:88: cmTC_01061.exe] Error 1
make[2]: Leaving directory '/home/vagrant/slave/monero-static-win64/build/build/release/CMakeFiles/CMakeTmp'
make[1]: *** [Makefile:121: cmTC_01061/fast] Error 2
make[1]: Leaving directory '/home/vagrant/slave/monero-static-win64/build/build/release/CMakeFiles/CMakeTmp'


Determining if the function strptime exists failed with the following output:
Change Dir: C:/msys64/home/vagrant/slave/monero-static-win64/build/build/release/CMakeFiles/CMakeTmp

Run Build Command:"C:/msys64/usr/bin/make.exe" "cmTC_bc208/fast"
make[1]: Entering directory '/home/vagrant/slave/monero-static-win64/build/build/release/CMakeFiles/CMakeTmp'
/usr/bin/make -f CMakeFiles/cmTC_bc208.dir/build.make CMakeFiles/cmTC_bc208.dir/build
make[2]: Entering directory '/home/vagrant/slave/monero-static-win64/build/build/release/CMakeFiles/CMakeTmp'
Building C object CMakeFiles/cmTC_bc208.dir/CheckFunctionExists.c.obj

/C/msys64/mingw64/bin/x86_64-w64-mingw32-gcc.exe   -DCHECK_FUNCTION_EXISTS=strptime   -o CMakeFiles/cmTC_bc208.dir/CheckFunctionExists.c.obj   -c /C/msys64/mingw64/share/cmake-3.12/Modules/CheckFunctionExists.c
Linking C executable cmTC_bc208.exe

/C/msys64/mingw64/bin/cmake.exe -E remove -f CMakeFiles/cmTC_bc208.dir/objects.a
ar cr CMakeFiles/cmTC_bc208.dir/objects.a "CMakeFiles/cmTC_bc208.dir/CheckFunctionExists.c.obj" 
/C/msys64/mingw64/bin/x86_64-w64-mingw32-gcc.exe  -DCHECK_FUNCTION_EXISTS=strptime    -Wl,--whole-archive CMakeFiles/cmTC_bc208.dir/objects.a -Wl,--no-whole-archive  -o cmTC_bc208.exe -Wl,--major-image-version,0,--minor-image-version,0 -lkernel32 -luser32 -lgdi32 -lwinspool -lshell32 -lole32 -loleaut32 -luuid -lcomdlg32 -ladvapi32 
CMakeFiles/cmTC_bc208.dir/objects.a(CheckFunctionExists.c.obj):CheckFunctionExists.c:(.text+0x15): undefined reference to `strptime'

collect2.exe: error: ld returned 1 exit status
make[2]: *** [CMakeFiles/cmTC_bc208.dir/build.make:88: cmTC_bc208.exe] Error 1
make[2]: Leaving directory '/home/vagrant/slave/monero-static-win64/build/build/release/CMakeFiles/CMakeTmp'
make[1]: *** [Makefile:121: cmTC_bc208/fast] Error 2
make[1]: Leaving directory '/home/vagrant/slave/monero-static-win64/build/build/release/CMakeFiles/CMakeTmp'


Determining if the include file arpa/inet.h exists failed with the following output:
Change Dir: C:/msys64/home/vagrant/slave/monero-static-win64/build/build/release/CMakeFiles/CMakeTmp

Run Build Command:"C:/msys64/usr/bin/make.exe" "cmTC_29337/fast"
make[1]: Entering directory '/home/vagrant/slave/monero-static-win64/build/build/release/CMakeFiles/CMakeTmp'
/usr/bin/make -f CMakeFiles/cmTC_29337.dir/build.make CMakeFiles/cmTC_29337.dir/build
make[2]: Entering directory '/home/vagrant/slave/monero-static-win64/build/build/release/CMakeFiles/CMakeTmp'
Building C object CMakeFiles/cmTC_29337.dir/CheckIncludeFile.c.obj

/C/msys64/mingw64/bin/x86_64-w64-mingw32-gcc.exe    -o CMakeFiles/cmTC_29337.dir/CheckIncludeFile.c.obj   -c /C/msys64/home/vagrant/slave/monero-static-win64/build/build/release/CMakeFiles/CMakeTmp/CheckIncludeFile.c
C:/msys64/home/vagrant/slave/monero-static-win64/build/build/release/CMakeFiles/CMakeTmp/CheckIncludeFile.c:1:10: fatal error: arpa/inet.h: No such file or directory
 #include <arpa/inet.h>
          ^~~~~~~~~~~~~
compilation terminated.

make[2]: *** [CMakeFiles/cmTC_29337.dir/build.make:66: CMakeFiles/cmTC_29337.dir/CheckIncludeFile.c.obj] Error 1
make[2]: Leaving directory '/home/vagrant/slave/monero-static-win64/build/build/release/CMakeFiles/CMakeTmp'
make[1]: *** [Makefile:121: cmTC_29337/fast] Error 2
make[1]: Leaving directory '/home/vagrant/slave/monero-static-win64/build/build/release/CMakeFiles/CMakeTmp'


Determining if the include file endian.h exists failed with the following output:
Change Dir: C:/msys64/home/vagrant/slave/monero-static-win64/build/build/release/CMakeFiles/CMakeTmp

Run Build Command:"C:/msys64/usr/bin/make.exe" "cmTC_3849c/fast"
make[1]: Entering directory '/home/vagrant/slave/monero-static-win64/build/build/release/CMakeFiles/CMakeTmp'
/usr/bin/make -f CMakeFiles/cmTC_3849c.dir/build.make CMakeFiles/cmTC_3849c.dir/build
make[2]: Entering directory '/home/vagrant/slave/monero-static-win64/build/build/release/CMakeFiles/CMakeTmp'
Building C object CMakeFiles/cmTC_3849c.dir/CheckIncludeFile.c.obj

/C/msys64/mingw64/bin/x86_64-w64-mingw32-gcc.exe    -o CMakeFiles/cmTC_3849c.dir/CheckIncludeFile.c.obj   -c /C/msys64/home/vagrant/slave/monero-static-win64/build/build/release/CMakeFiles/CMakeTmp/CheckIncludeFile.c
C:/msys64/home/vagrant/slave/monero-static-win64/build/build/release/CMakeFiles/CMakeTmp/CheckIncludeFile.c:1:10: fatal error: endian.h: No such file or directory
 #include <endian.h>
          ^~~~~~~~~~
compilation terminated.

make[2]: *** [CMakeFiles/cmTC_3849c.dir/build.make:66: CMakeFiles/cmTC_3849c.dir/CheckIncludeFile.c.obj] Error 1
make[2]: Leaving directory '/home/vagrant/slave/monero-static-win64/build/build/release/CMakeFiles/CMakeTmp'
make[1]: *** [Makefile:121: cmTC_3849c/fast] Error 2
make[1]: Leaving directory '/home/vagrant/slave/monero-static-win64/build/build/release/CMakeFiles/CMakeTmp'


Determining if the include file dlfcn.h exists failed with the following output:
Change Dir: C:/msys64/home/vagrant/slave/monero-static-win64/build/build/release/CMakeFiles/CMakeTmp

Run Build Command:"C:/msys64/usr/bin/make.exe" "cmTC_a6a66/fast"
make[1]: Entering directory '/home/vagrant/slave/monero-static-win64/build/build/release/CMakeFiles/CMakeTmp'
/usr/bin/make -f CMakeFiles/cmTC_a6a66.dir/build.make CMakeFiles/cmTC_a6a66.dir/build
make[2]: Entering directory '/home/vagrant/slave/monero-static-win64/build/build/release/CMakeFiles/CMakeTmp'
Building C object CMakeFiles/cmTC_a6a66.dir/CheckIncludeFile.c.obj

/C/msys64/mingw64/bin/x86_64-w64-mingw32-gcc.exe    -o CMakeFiles/cmTC_a6a66.dir/CheckIncludeFile.c.obj   -c /C/msys64/home/vagrant/slave/monero-static-win64/build/build/release/CMakeFiles/CMakeTmp/CheckIncludeFile.c
C:/msys64/home/vagrant/slave/monero-static-win64/build/build/release/CMakeFiles/CMakeTmp/CheckIncludeFile.c:1:10: fatal error: dlfcn.h: No such file or directory
 #include <dlfcn.h>
          ^~~~~~~~~
compilation terminated.

make[2]: *** [CMakeFiles/cmTC_a6a66.dir/build.make:66: CMakeFiles/cmTC_a6a66.dir/CheckIncludeFile.c.obj] Error 1
make[2]: Leaving directory '/home/vagrant/slave/monero-static-win64/build/build/release/CMakeFiles/CMakeTmp'
make[1]: *** [Makefile:121: cmTC_a6a66/fast] Error 2
make[1]: Leaving directory '/home/vagrant/slave/monero-static-win64/build/build/release/CMakeFiles/CMakeTmp'


Determining if the include file event.h exists failed with the following output:
Change Dir: C:/msys64/home/vagrant/slave/monero-static-win64/build/build/release/CMakeFiles/CMakeTmp

Run Build Command:"C:/msys64/usr/bin/make.exe" "cmTC_29108/fast"
make[1]: Entering directory '/home/vagrant/slave/monero-static-win64/build/build/release/CMakeFiles/CMakeTmp'
/usr/bin/make -f CMakeFiles/cmTC_29108.dir/build.make CMakeFiles/cmTC_29108.dir/build
make[2]: Entering directory '/home/vagrant/slave/monero-static-win64/build/build/release/CMakeFiles/CMakeTmp'
Building C object CMakeFiles/cmTC_29108.dir/CheckIncludeFile.c.obj

/C/msys64/mingw64/bin/x86_64-w64-mingw32-gcc.exe    -o CMakeFiles/cmTC_29108.dir/CheckIncludeFile.c.obj   -c /C/msys64/home/vagrant/slave/monero-static-win64/build/build/release/CMakeFiles/CMakeTmp/CheckIncludeFile.c
C:/msys64/home/vagrant/slave/monero-static-win64/build/build/release/CMakeFiles/CMakeTmp/CheckIncludeFile.c:1:10: fatal error: event.h: No such file or directory
 #include <event.h>
          ^~~~~~~~~
compilation terminated.

make[2]: *** [CMakeFiles/cmTC_29108.dir/build.make:66: CMakeFiles/cmTC_29108.dir/CheckIncludeFile.c.obj] Error 1
make[2]: Leaving directory '/home/vagrant/slave/monero-static-win64/build/build/release/CMakeFiles/CMakeTmp'
make[1]: *** [Makefile:121: cmTC_29108/fast] Error 2
make[1]: Leaving directory '/home/vagrant/slave/monero-static-win64/build/build/release/CMakeFiles/CMakeTmp'


Determining if the include file glob.h exists failed with the following output:
Change Dir: C:/msys64/home/vagrant/slave/monero-static-win64/build/build/release/CMakeFiles/CMakeTmp

Run Build Command:"C:/msys64/usr/bin/make.exe" "cmTC_6cc40/fast"
make[1]: Entering directory '/home/vagrant/slave/monero-static-win64/build/build/release/CMakeFiles/CMakeTmp'
/usr/bin/make -f CMakeFiles/cmTC_6cc40.dir/build.make CMakeFiles/cmTC_6cc40.dir/build
make[2]: Entering directory '/home/vagrant/slave/monero-static-win64/build/build/release/CMakeFiles/CMakeTmp'
Building C object CMakeFiles/cmTC_6cc40.dir/CheckIncludeFile.c.obj

/C/msys64/mingw64/bin/x86_64-w64-mingw32-gcc.exe    -o CMakeFiles/cmTC_6cc40.dir/CheckIncludeFile.c.obj   -c /C/msys64/home/vagrant/slave/monero-static-win64/build/build/release/CMakeFiles/CMakeTmp/CheckIncludeFile.c
C:/msys64/home/vagrant/slave/monero-static-win64/build/build/release/CMakeFiles/CMakeTmp/CheckIncludeFile.c:1:10: fatal error: glob.h: No such file or directory
 #include <glob.h>
          ^~~~~~~~
compilation terminated.

make[2]: *** [CMakeFiles/cmTC_6cc40.dir/build.make:66: CMakeFiles/cmTC_6cc40.dir/CheckIncludeFile.c.obj] Error 1
make[2]: Leaving directory '/home/vagrant/slave/monero-static-win64/build/build/release/CMakeFiles/CMakeTmp'
make[1]: *** [Makefile:121: cmTC_6cc40/fast] Error 2
make[1]: Leaving directory '/home/vagrant/slave/monero-static-win64/build/build/release/CMakeFiles/CMakeTmp'


Determining if the include file grp.h exists failed with the following output:
Change Dir: C:/msys64/home/vagrant/slave/monero-static-win64/build/build/release/CMakeFiles/CMakeTmp

Run Build Command:"C:/msys64/usr/bin/make.exe" "cmTC_0b82f/fast"
make[1]: Entering directory '/home/vagrant/slave/monero-static-win64/build/build/release/CMakeFiles/CMakeTmp'
/usr/bin/make -f CMakeFiles/cmTC_0b82f.dir/build.make CMakeFiles/cmTC_0b82f.dir/build
make[2]: Entering directory '/home/vagrant/slave/monero-static-win64/build/build/release/CMakeFiles/CMakeTmp'
Building C object CMakeFiles/cmTC_0b82f.dir/CheckIncludeFile.c.obj

/C/msys64/mingw64/bin/x86_64-w64-mingw32-gcc.exe    -o CMakeFiles/cmTC_0b82f.dir/CheckIncludeFile.c.obj   -c /C/msys64/home/vagrant/slave/monero-static-win64/build/build/release/CMakeFiles/CMakeTmp/CheckIncludeFile.c
C:/msys64/home/vagrant/slave/monero-static-win64/build/build/release/CMakeFiles/CMakeTmp/CheckIncludeFile.c:1:10: fatal error: grp.h: No such file or directory
 #include <grp.h>
          ^~~~~~~
compilation terminated.

make[2]: *** [CMakeFiles/cmTC_0b82f.dir/build.make:66: CMakeFiles/cmTC_0b82f.dir/CheckIncludeFile.c.obj] Error 1
make[2]: Leaving directory '/home/vagrant/slave/monero-static-win64/build/build/release/CMakeFiles/CMakeTmp'
make[1]: *** [Makefile:121: cmTC_0b82f/fast] Error 2
make[1]: Leaving directory '/home/vagrant/slave/monero-static-win64/build/build/release/CMakeFiles/CMakeTmp'


Determining if the include file login_cap.h exists failed with the following output:
Change Dir: C:/msys64/home/vagrant/slave/monero-static-win64/build/build/release/CMakeFiles/CMakeTmp

Run Build Command:"C:/msys64/usr/bin/make.exe" "cmTC_33f65/fast"
make[1]: Entering directory '/home/vagrant/slave/monero-static-win64/build/build/release/CMakeFiles/CMakeTmp'
/usr/bin/make -f CMakeFiles/cmTC_33f65.dir/build.make CMakeFiles/cmTC_33f65.dir/build
make[2]: Entering directory '/home/vagrant/slave/monero-static-win64/build/build/release/CMakeFiles/CMakeTmp'
Building C object CMakeFiles/cmTC_33f65.dir/CheckIncludeFile.c.obj

/C/msys64/mingw64/bin/x86_64-w64-mingw32-gcc.exe    -o CMakeFiles/cmTC_33f65.dir/CheckIncludeFile.c.obj   -c /C/msys64/home/vagrant/slave/monero-static-win64/build/build/release/CMakeFiles/CMakeTmp/CheckIncludeFile.c
C:/msys64/home/vagrant/slave/monero-static-win64/build/build/release/CMakeFiles/CMakeTmp/CheckIncludeFile.c:1:10: fatal error: login_cap.h: No such file or directory
 #include <login_cap.h>
          ^~~~~~~~~~~~~
compilation terminated.

make[2]: *** [CMakeFiles/cmTC_33f65.dir/build.make:66: CMakeFiles/cmTC_33f65.dir/CheckIncludeFile.c.obj] Error 1
make[2]: Leaving directory '/home/vagrant/slave/monero-static-win64/build/build/release/CMakeFiles/CMakeTmp'
make[1]: *** [Makefile:121: cmTC_33f65/fast] Error 2
make[1]: Leaving directory '/home/vagrant/slave/monero-static-win64/build/build/release/CMakeFiles/CMakeTmp'


Determining if the include file netdb.h exists failed with the following output:
Change Dir: C:/msys64/home/vagrant/slave/monero-static-win64/build/build/release/CMakeFiles/CMakeTmp

Run Build Command:"C:/msys64/usr/bin/make.exe" "cmTC_5c453/fast"
make[1]: Entering directory '/home/vagrant/slave/monero-static-win64/build/build/release/CMakeFiles/CMakeTmp'
/usr/bin/make -f CMakeFiles/cmTC_5c453.dir/build.make CMakeFiles/cmTC_5c453.dir/build
make[2]: Entering directory '/home/vagrant/slave/monero-static-win64/build/build/release/CMakeFiles/CMakeTmp'
Building C object CMakeFiles/cmTC_5c453.dir/CheckIncludeFile.c.obj

/C/msys64/mingw64/bin/x86_64-w64-mingw32-gcc.exe    -o CMakeFiles/cmTC_5c453.dir/CheckIncludeFile.c.obj   -c /C/msys64/home/vagrant/slave/monero-static-win64/build/build/release/CMakeFiles/CMakeTmp/CheckIncludeFile.c
C:/msys64/home/vagrant/slave/monero-static-win64/build/build/release/CMakeFiles/CMakeTmp/CheckIncludeFile.c:1:10: fatal error: netdb.h: No such file or directory
 #include <netdb.h>
          ^~~~~~~~~
compilation terminated.

make[2]: *** [CMakeFiles/cmTC_5c453.dir/build.make:66: CMakeFiles/cmTC_5c453.dir/CheckIncludeFile.c.obj] Error 1
make[2]: Leaving directory '/home/vagrant/slave/monero-static-win64/build/build/release/CMakeFiles/CMakeTmp'
make[1]: *** [Makefile:121: cmTC_5c453/fast] Error 2
make[1]: Leaving directory '/home/vagrant/slave/monero-static-win64/build/build/release/CMakeFiles/CMakeTmp'


Determining if the include file netinet/in.h exists failed with the following output:
Change Dir: C:/msys64/home/vagrant/slave/monero-static-win64/build/build/release/CMakeFiles/CMakeTmp

Run Build Command:"C:/msys64/usr/bin/make.exe" "cmTC_3e722/fast"
make[1]: Entering directory '/home/vagrant/slave/monero-static-win64/build/build/release/CMakeFiles/CMakeTmp'
/usr/bin/make -f CMakeFiles/cmTC_3e722.dir/build.make CMakeFiles/cmTC_3e722.dir/build
make[2]: Entering directory '/home/vagrant/slave/monero-static-win64/build/build/release/CMakeFiles/CMakeTmp'
Building C object CMakeFiles/cmTC_3e722.dir/CheckIncludeFile.c.obj

/C/msys64/mingw64/bin/x86_64-w64-mingw32-gcc.exe    -o CMakeFiles/cmTC_3e722.dir/CheckIncludeFile.c.obj   -c /C/msys64/home/vagrant/slave/monero-static-win64/build/build/release/CMakeFiles/CMakeTmp/CheckIncludeFile.c
C:/msys64/home/vagrant/slave/monero-static-win64/build/build/release/CMakeFiles/CMakeTmp/CheckIncludeFile.c:1:10: fatal error: netinet/in.h: No such file or directory
 #include <netinet/in.h>
          ^~~~~~~~~~~~~~
compilation terminated.

make[2]: *** [CMakeFiles/cmTC_3e722.dir/build.make:66: CMakeFiles/cmTC_3e722.dir/CheckIncludeFile.c.obj] Error 1
make[2]: Leaving directory '/home/vagrant/slave/monero-static-win64/build/build/release/CMakeFiles/CMakeTmp'
make[1]: *** [Makefile:121: cmTC_3e722/fast] Error 2
make[1]: Leaving directory '/home/vagrant/slave/monero-static-win64/build/build/release/CMakeFiles/CMakeTmp'


Determining if the include file pwd.h exists failed with the following output:
Change Dir: C:/msys64/home/vagrant/slave/monero-static-win64/build/build/release/CMakeFiles/CMakeTmp

Run Build Command:"C:/msys64/usr/bin/make.exe" "cmTC_c2db2/fast"
make[1]: Entering directory '/home/vagrant/slave/monero-static-win64/build/build/release/CMakeFiles/CMakeTmp'
/usr/bin/make -f CMakeFiles/cmTC_c2db2.dir/build.make CMakeFiles/cmTC_c2db2.dir/build
make[2]: Entering directory '/home/vagrant/slave/monero-static-win64/build/build/release/CMakeFiles/CMakeTmp'
Building C object CMakeFiles/cmTC_c2db2.dir/CheckIncludeFile.c.obj

/C/msys64/mingw64/bin/x86_64-w64-mingw32-gcc.exe    -o CMakeFiles/cmTC_c2db2.dir/CheckIncludeFile.c.obj   -c /C/msys64/home/vagrant/slave/monero-static-win64/build/build/release/CMakeFiles/CMakeTmp/CheckIncludeFile.c
C:/msys64/home/vagrant/slave/monero-static-win64/build/build/release/CMakeFiles/CMakeTmp/CheckIncludeFile.c:1:10: fatal error: pwd.h: No such file or directory
 #include <pwd.h>
          ^~~~~~~
compilation terminated.

make[2]: *** [CMakeFiles/cmTC_c2db2.dir/build.make:66: CMakeFiles/cmTC_c2db2.dir/CheckIncludeFile.c.obj] Error 1
make[2]: Leaving directory '/home/vagrant/slave/monero-static-win64/build/build/release/CMakeFiles/CMakeTmp'
make[1]: *** [Makefile:121: cmTC_c2db2/fast] Error 2
make[1]: Leaving directory '/home/vagrant/slave/monero-static-win64/build/build/release/CMakeFiles/CMakeTmp'


Determining if the include file sys/resource.h exists failed with the following output:
Change Dir: C:/msys64/home/vagrant/slave/monero-static-win64/build/build/release/CMakeFiles/CMakeTmp

Run Build Command:"C:/msys64/usr/bin/make.exe" "cmTC_e5aa1/fast"
make[1]: Entering directory '/home/vagrant/slave/monero-static-win64/build/build/release/CMakeFiles/CMakeTmp'
/usr/bin/make -f CMakeFiles/cmTC_e5aa1.dir/build.make CMakeFiles/cmTC_e5aa1.dir/build
make[2]: Entering directory '/home/vagrant/slave/monero-static-win64/build/build/release/CMakeFiles/CMakeTmp'
Building C object CMakeFiles/cmTC_e5aa1.dir/CheckIncludeFile.c.obj

/C/msys64/mingw64/bin/x86_64-w64-mingw32-gcc.exe    -o CMakeFiles/cmTC_e5aa1.dir/CheckIncludeFile.c.obj   -c /C/msys64/home/vagrant/slave/monero-static-win64/build/build/release/CMakeFiles/CMakeTmp/CheckIncludeFile.c
C:/msys64/home/vagrant/slave/monero-static-win64/build/build/release/CMakeFiles/CMakeTmp/CheckIncludeFile.c:1:10: fatal error: sys/resource.h: No such file or directory
 #include <sys/resource.h>
          ^~~~~~~~~~~~~~~~
compilation terminated.

make[2]: *** [CMakeFiles/cmTC_e5aa1.dir/build.make:66: CMakeFiles/cmTC_e5aa1.dir/CheckIncludeFile.c.obj] Error 1
make[2]: Leaving directory '/home/vagrant/slave/monero-static-win64/build/build/release/CMakeFiles/CMakeTmp'
make[1]: *** [Makefile:121: cmTC_e5aa1/fast] Error 2
make[1]: Leaving directory '/home/vagrant/slave/monero-static-win64/build/build/release/CMakeFiles/CMakeTmp'


Determining if the include file sys/sha2.h exists failed with the following output:
Change Dir: C:/msys64/home/vagrant/slave/monero-static-win64/build/build/release/CMakeFiles/CMakeTmp

Run Build Command:"C:/msys64/usr/bin/make.exe" "cmTC_cfcf1/fast"
make[1]: Entering directory '/home/vagrant/slave/monero-static-win64/build/build/release/CMakeFiles/CMakeTmp'
/usr/bin/make -f CMakeFiles/cmTC_cfcf1.dir/build.make CMakeFiles/cmTC_cfcf1.dir/build
make[2]: Entering directory '/home/vagrant/slave/monero-static-win64/build/build/release/CMakeFiles/CMakeTmp'
Building C object CMakeFiles/cmTC_cfcf1.dir/CheckIncludeFile.c.obj

/C/msys64/mingw64/bin/x86_64-w64-mingw32-gcc.exe    -o CMakeFiles/cmTC_cfcf1.dir/CheckIncludeFile.c.obj   -c /C/msys64/home/vagrant/slave/monero-static-win64/build/build/release/CMakeFiles/CMakeTmp/CheckIncludeFile.c
C:/msys64/home/vagrant/slave/monero-static-win64/build/build/release/CMakeFiles/CMakeTmp/CheckIncludeFile.c:1:10: fatal error: sys/sha2.h: No such file or directory
 #include <sys/sha2.h>
          ^~~~~~~~~~~~
compilation terminated.

make[2]: *** [CMakeFiles/cmTC_cfcf1.dir/build.make:66: CMakeFiles/cmTC_cfcf1.dir/CheckIncludeFile.c.obj] Error 1
make[2]: Leaving directory '/home/vagrant/slave/monero-static-win64/build/build/release/CMakeFiles/CMakeTmp'
make[1]: *** [Makefile:121: cmTC_cfcf1/fast] Error 2
make[1]: Leaving directory '/home/vagrant/slave/monero-static-win64/build/build/release/CMakeFiles/CMakeTmp'


Determining if the include file sys/socket.h exists failed with the following output:
Change Dir: C:/msys64/home/vagrant/slave/monero-static-win64/build/build/release/CMakeFiles/CMakeTmp

Run Build Command:"C:/msys64/usr/bin/make.exe" "cmTC_a560d/fast"
make[1]: Entering directory '/home/vagrant/slave/monero-static-win64/build/build/release/CMakeFiles/CMakeTmp'
/usr/bin/make -f CMakeFiles/cmTC_a560d.dir/build.make CMakeFiles/cmTC_a560d.dir/build
make[2]: Entering directory '/home/vagrant/slave/monero-static-win64/build/build/release/CMakeFiles/CMakeTmp'
Building C object CMakeFiles/cmTC_a560d.dir/CheckIncludeFile.c.obj

/C/msys64/mingw64/bin/x86_64-w64-mingw32-gcc.exe    -o CMakeFiles/cmTC_a560d.dir/CheckIncludeFile.c.obj   -c /C/msys64/home/vagrant/slave/monero-static-win64/build/build/release/CMakeFiles/CMakeTmp/CheckIncludeFile.c
C:/msys64/home/vagrant/slave/monero-static-win64/build/build/release/CMakeFiles/CMakeTmp/CheckIncludeFile.c:1:10: fatal error: sys/socket.h: No such file or directory
 #include <sys/socket.h>
          ^~~~~~~~~~~~~~
compilation terminated.

make[2]: *** [CMakeFiles/cmTC_a560d.dir/build.make:66: CMakeFiles/cmTC_a560d.dir/CheckIncludeFile.c.obj] Error 1
make[2]: Leaving directory '/home/vagrant/slave/monero-static-win64/build/build/release/CMakeFiles/CMakeTmp'
make[1]: *** [Makefile:121: cmTC_a560d/fast] Error 2
make[1]: Leaving directory '/home/vagrant/slave/monero-static-win64/build/build/release/CMakeFiles/CMakeTmp'


Determining if the include file sys/sysctl.h exists failed with the following output:
Change Dir: C:/msys64/home/vagrant/slave/monero-static-win64/build/build/release/CMakeFiles/CMakeTmp

Run Build Command:"C:/msys64/usr/bin/make.exe" "cmTC_6ea28/fast"
make[1]: Entering directory '/home/vagrant/slave/monero-static-win64/build/build/release/CMakeFiles/CMakeTmp'
/usr/bin/make -f CMakeFiles/cmTC_6ea28.dir/build.make CMakeFiles/cmTC_6ea28.dir/build
make[2]: Entering directory '/home/vagrant/slave/monero-static-win64/build/build/release/CMakeFiles/CMakeTmp'
Building C object CMakeFiles/cmTC_6ea28.dir/CheckIncludeFile.c.obj

/C/msys64/mingw64/bin/x86_64-w64-mingw32-gcc.exe    -o CMakeFiles/cmTC_6ea28.dir/CheckIncludeFile.c.obj   -c /C/msys64/home/vagrant/slave/monero-static-win64/build/build/release/CMakeFiles/CMakeTmp/CheckIncludeFile.c
C:/msys64/home/vagrant/slave/monero-static-win64/build/build/release/CMakeFiles/CMakeTmp/CheckIncludeFile.c:1:10: fatal error: sys/sysctl.h: No such file or directory
 #include <sys/sysctl.h>
          ^~~~~~~~~~~~~~
compilation terminated.

make[2]: *** [CMakeFiles/cmTC_6ea28.dir/build.make:66: CMakeFiles/cmTC_6ea28.dir/CheckIncludeFile.c.obj] Error 1
make[2]: Leaving directory '/home/vagrant/slave/monero-static-win64/build/build/release/CMakeFiles/CMakeTmp'
make[1]: *** [Makefile:121: cmTC_6ea28/fast] Error 2
make[1]: Leaving directory '/home/vagrant/slave/monero-static-win64/build/build/release/CMakeFiles/CMakeTmp'


Determining if the include file sys/uio.h exists failed with the following output:
Change Dir: C:/msys64/home/vagrant/slave/monero-static-win64/build/build/release/CMakeFiles/CMakeTmp

Run Build Command:"C:/msys64/usr/bin/make.exe" "cmTC_34bfb/fast"
make[1]: Entering directory '/home/vagrant/slave/monero-static-win64/build/build/release/CMakeFiles/CMakeTmp'
/usr/bin/make -f CMakeFiles/cmTC_34bfb.dir/build.make CMakeFiles/cmTC_34bfb.dir/build
make[2]: Entering directory '/home/vagrant/slave/monero-static-win64/build/build/release/CMakeFiles/CMakeTmp'
Building C object CMakeFiles/cmTC_34bfb.dir/CheckIncludeFile.c.obj

/C/msys64/mingw64/bin/x86_64-w64-mingw32-gcc.exe    -o CMakeFiles/cmTC_34bfb.dir/CheckIncludeFile.c.obj   -c /C/msys64/home/vagrant/slave/monero-static-win64/build/build/release/CMakeFiles/CMakeTmp/CheckIncludeFile.c
C:/msys64/home/vagrant/slave/monero-static-win64/build/build/release/CMakeFiles/CMakeTmp/CheckIncludeFile.c:1:10: fatal error: sys/uio.h: No such file or directory
 #include <sys/uio.h>
          ^~~~~~~~~~~
compilation terminated.

make[2]: *** [CMakeFiles/cmTC_34bfb.dir/build.make:66: CMakeFiles/cmTC_34bfb.dir/CheckIncludeFile.c.obj] Error 1
make[2]: Leaving directory '/home/vagrant/slave/monero-static-win64/build/build/release/CMakeFiles/CMakeTmp'
make[1]: *** [Makefile:121: cmTC_34bfb/fast] Error 2
make[1]: Leaving directory '/home/vagrant/slave/monero-static-win64/build/build/release/CMakeFiles/CMakeTmp'


Determining if the include file sys/un.h exists failed with the following output:
Change Dir: C:/msys64/home/vagrant/slave/monero-static-win64/build/build/release/CMakeFiles/CMakeTmp

Run Build Command:"C:/msys64/usr/bin/make.exe" "cmTC_4bf45/fast"
make[1]: Entering directory '/home/vagrant/slave/monero-static-win64/build/build/release/CMakeFiles/CMakeTmp'
/usr/bin/make -f CMakeFiles/cmTC_4bf45.dir/build.make CMakeFiles/cmTC_4bf45.dir/build
make[2]: Entering directory '/home/vagrant/slave/monero-static-win64/build/build/release/CMakeFiles/CMakeTmp'
Building C object CMakeFiles/cmTC_4bf45.dir/CheckIncludeFile.c.obj

/C/msys64/mingw64/bin/x86_64-w64-mingw32-gcc.exe    -o CMakeFiles/cmTC_4bf45.dir/CheckIncludeFile.c.obj   -c /C/msys64/home/vagrant/slave/monero-static-win64/build/build/release/CMakeFiles/CMakeTmp/CheckIncludeFile.c
C:/msys64/home/vagrant/slave/monero-static-win64/build/build/release/CMakeFiles/CMakeTmp/CheckIncludeFile.c:1:10: fatal error: sys/un.h: No such file or directory
 #include <sys/un.h>
          ^~~~~~~~~~
compilation terminated.

make[2]: *** [CMakeFiles/cmTC_4bf45.dir/build.make:66: CMakeFiles/cmTC_4bf45.dir/CheckIncludeFile.c.obj] Error 1
make[2]: Leaving directory '/home/vagrant/slave/monero-static-win64/build/build/release/CMakeFiles/CMakeTmp'
make[1]: *** [Makefile:121: cmTC_4bf45/fast] Error 2
make[1]: Leaving directory '/home/vagrant/slave/monero-static-win64/build/build/release/CMakeFiles/CMakeTmp'


Determining if the include file sys/wait.h exists failed with the following output:
Change Dir: C:/msys64/home/vagrant/slave/monero-static-win64/build/build/release/CMakeFiles/CMakeTmp

Run Build Command:"C:/msys64/usr/bin/make.exe" "cmTC_b1570/fast"
make[1]: Entering directory '/home/vagrant/slave/monero-static-win64/build/build/release/CMakeFiles/CMakeTmp'
/usr/bin/make -f CMakeFiles/cmTC_b1570.dir/build.make CMakeFiles/cmTC_b1570.dir/build
make[2]: Entering directory '/home/vagrant/slave/monero-static-win64/build/build/release/CMakeFiles/CMakeTmp'
Building C object CMakeFiles/cmTC_b1570.dir/CheckIncludeFile.c.obj

/C/msys64/mingw64/bin/x86_64-w64-mingw32-gcc.exe    -o CMakeFiles/cmTC_b1570.dir/CheckIncludeFile.c.obj   -c /C/msys64/home/vagrant/slave/monero-static-win64/build/build/release/CMakeFiles/CMakeTmp/CheckIncludeFile.c
C:/msys64/home/vagrant/slave/monero-static-win64/build/build/release/CMakeFiles/CMakeTmp/CheckIncludeFile.c:1:10: fatal error: sys/wait.h: No such file or directory
 #include <sys/wait.h>
          ^~~~~~~~~~~~
compilation terminated.

make[2]: *** [CMakeFiles/cmTC_b1570.dir/build.make:66: CMakeFiles/cmTC_b1570.dir/CheckIncludeFile.c.obj] Error 1
make[2]: Leaving directory '/home/vagrant/slave/monero-static-win64/build/build/release/CMakeFiles/CMakeTmp'
make[1]: *** [Makefile:121: cmTC_b1570/fast] Error 2
make[1]: Leaving directory '/home/vagrant/slave/monero-static-win64/build/build/release/CMakeFiles/CMakeTmp'


Determining if the include file syslog.h exists failed with the following output:
Change Dir: C:/msys64/home/vagrant/slave/monero-static-win64/build/build/release/CMakeFiles/CMakeTmp

Run Build Command:"C:/msys64/usr/bin/make.exe" "cmTC_2228d/fast"
make[1]: Entering directory '/home/vagrant/slave/monero-static-win64/build/build/release/CMakeFiles/CMakeTmp'
/usr/bin/make -f CMakeFiles/cmTC_2228d.dir/build.make CMakeFiles/cmTC_2228d.dir/build
make[2]: Entering directory '/home/vagrant/slave/monero-static-win64/build/build/release/CMakeFiles/CMakeTmp'
Building C object CMakeFiles/cmTC_2228d.dir/CheckIncludeFile.c.obj

/C/msys64/mingw64/bin/x86_64-w64-mingw32-gcc.exe    -o CMakeFiles/cmTC_2228d.dir/CheckIncludeFile.c.obj   -c /C/msys64/home/vagrant/slave/monero-static-win64/build/build/release/CMakeFiles/CMakeTmp/CheckIncludeFile.c
C:/msys64/home/vagrant/slave/monero-static-win64/build/build/release/CMakeFiles/CMakeTmp/CheckIncludeFile.c:1:10: fatal error: syslog.h: No such file or directory
 #include <syslog.h>
          ^~~~~~~~~~
compilation terminated.

make[2]: *** [CMakeFiles/cmTC_2228d.dir/build.make:66: CMakeFiles/cmTC_2228d.dir/CheckIncludeFile.c.obj] Error 1
make[2]: Leaving directory '/home/vagrant/slave/monero-static-win64/build/build/release/CMakeFiles/CMakeTmp'
make[1]: *** [Makefile:121: cmTC_2228d/fast] Error 2
make[1]: Leaving directory '/home/vagrant/slave/monero-static-win64/build/build/release/CMakeFiles/CMakeTmp'


Determining if the include file vfork.h exists failed with the following output:
Change Dir: C:/msys64/home/vagrant/slave/monero-static-win64/build/build/release/CMakeFiles/CMakeTmp

Run Build Command:"C:/msys64/usr/bin/make.exe" "cmTC_35912/fast"
make[1]: Entering directory '/home/vagrant/slave/monero-static-win64/build/build/release/CMakeFiles/CMakeTmp'
/usr/bin/make -f CMakeFiles/cmTC_35912.dir/build.make CMakeFiles/cmTC_35912.dir/build
make[2]: Entering directory '/home/vagrant/slave/monero-static-win64/build/build/release/CMakeFiles/CMakeTmp'
Building C object CMakeFiles/cmTC_35912.dir/CheckIncludeFile.c.obj

/C/msys64/mingw64/bin/x86_64-w64-mingw32-gcc.exe    -o CMakeFiles/cmTC_35912.dir/CheckIncludeFile.c.obj   -c /C/msys64/home/vagrant/slave/monero-static-win64/build/build/release/CMakeFiles/CMakeTmp/CheckIncludeFile.c
C:/msys64/home/vagrant/slave/monero-static-win64/build/build/release/CMakeFiles/CMakeTmp/CheckIncludeFile.c:1:10: fatal error: vfork.h: No such file or directory
 #include <vfork.h>
          ^~~~~~~~~
compilation terminated.

make[2]: *** [CMakeFiles/cmTC_35912.dir/build.make:66: CMakeFiles/cmTC_35912.dir/CheckIncludeFile.c.obj] Error 1
make[2]: Leaving directory '/home/vagrant/slave/monero-static-win64/build/build/release/CMakeFiles/CMakeTmp'
make[1]: *** [Makefile:121: cmTC_35912/fast] Error 2
make[1]: Leaving directory '/home/vagrant/slave/monero-static-win64/build/build/release/CMakeFiles/CMakeTmp'


Determining if the function arc4random exists failed with the following output:
Change Dir: C:/msys64/home/vagrant/slave/monero-static-win64/build/build/release/CMakeFiles/CMakeTmp

Run Build Command:"C:/msys64/usr/bin/make.exe" "cmTC_6dd57/fast"
make[1]: Entering directory '/home/vagrant/slave/monero-static-win64/build/build/release/CMakeFiles/CMakeTmp'
/usr/bin/make -f CMakeFiles/cmTC_6dd57.dir/build.make CMakeFiles/cmTC_6dd57.dir/build
make[2]: Entering directory '/home/vagrant/slave/monero-static-win64/build/build/release/CMakeFiles/CMakeTmp'
Building C object CMakeFiles/cmTC_6dd57.dir/CheckFunctionExists.c.obj

/C/msys64/mingw64/bin/x86_64-w64-mingw32-gcc.exe   -DCHECK_FUNCTION_EXISTS=arc4random   -o CMakeFiles/cmTC_6dd57.dir/CheckFunctionExists.c.obj   -c /C/msys64/mingw64/share/cmake-3.12/Modules/CheckFunctionExists.c
Linking C executable cmTC_6dd57.exe

/C/msys64/mingw64/bin/cmake.exe -E remove -f CMakeFiles/cmTC_6dd57.dir/objects.a
ar cr CMakeFiles/cmTC_6dd57.dir/objects.a "CMakeFiles/cmTC_6dd57.dir/CheckFunctionExists.c.obj" 
/C/msys64/mingw64/bin/x86_64-w64-mingw32-gcc.exe  -DCHECK_FUNCTION_EXISTS=arc4random    -Wl,--whole-archive CMakeFiles/cmTC_6dd57.dir/objects.a -Wl,--no-whole-archive  -o cmTC_6dd57.exe -Wl,--major-image-version,0,--minor-image-version,0 -liphlpapi -lws2_32 -lkernel32 -luser32 -lgdi32 -lwinspool -lshell32 -lole32 -loleaut32 -luuid -lcomdlg32 -ladvapi32 
CMakeFiles/cmTC_6dd57.dir/objects.a(CheckFunctionExists.c.obj):CheckFunctionExists.c:(.text+0x15): undefined reference to `arc4random'

collect2.exe: error: ld returned 1 exit status
make[2]: *** [CMakeFiles/cmTC_6dd57.dir/build.make:88: cmTC_6dd57.exe] Error 1
make[2]: Leaving directory '/home/vagrant/slave/monero-static-win64/build/build/release/CMakeFiles/CMakeTmp'
make[1]: *** [Makefile:121: cmTC_6dd57/fast] Error 2
make[1]: Leaving directory '/home/vagrant/slave/monero-static-win64/build/build/release/CMakeFiles/CMakeTmp'


Determining if the function arc4random_uniform exists failed with the following output:
Change Dir: C:/msys64/home/vagrant/slave/monero-static-win64/build/build/release/CMakeFiles/CMakeTmp

Run Build Command:"C:/msys64/usr/bin/make.exe" "cmTC_21458/fast"
make[1]: Entering directory '/home/vagrant/slave/monero-static-win64/build/build/release/CMakeFiles/CMakeTmp'
/usr/bin/make -f CMakeFiles/cmTC_21458.dir/build.make CMakeFiles/cmTC_21458.dir/build
make[2]: Entering directory '/home/vagrant/slave/monero-static-win64/build/build/release/CMakeFiles/CMakeTmp'
Building C object CMakeFiles/cmTC_21458.dir/CheckFunctionExists.c.obj

/C/msys64/mingw64/bin/x86_64-w64-mingw32-gcc.exe   -DCHECK_FUNCTION_EXISTS=arc4random_uniform   -o CMakeFiles/cmTC_21458.dir/CheckFunctionExists.c.obj   -c /C/msys64/mingw64/share/cmake-3.12/Modules/CheckFunctionExists.c
Linking C executable cmTC_21458.exe

/C/msys64/mingw64/bin/cmake.exe -E remove -f CMakeFiles/cmTC_21458.dir/objects.a
ar cr CMakeFiles/cmTC_21458.dir/objects.a "CMakeFiles/cmTC_21458.dir/CheckFunctionExists.c.obj" 
/C/msys64/mingw64/bin/x86_64-w64-mingw32-gcc.exe  -DCHECK_FUNCTION_EXISTS=arc4random_uniform    -Wl,--whole-archive CMakeFiles/cmTC_21458.dir/objects.a -Wl,--no-whole-archive  -o cmTC_21458.exe -Wl,--major-image-version,0,--minor-image-version,0 -liphlpapi -lws2_32 -lkernel32 -luser32 -lgdi32 -lwinspool -lshell32 -lole32 -loleaut32 -luuid -lcomdlg32 -ladvapi32 
CMakeFiles/cmTC_21458.dir/objects.a(CheckFunctionExists.c.obj):CheckFunctionExists.c:(.text+0x15): undefined reference to `arc4random_uniform'

collect2.exe: error: ld returned 1 exit status
make[2]: *** [CMakeFiles/cmTC_21458.dir/build.make:88: cmTC_21458.exe] Error 1
make[2]: Leaving directory '/home/vagrant/slave/monero-static-win64/build/build/release/CMakeFiles/CMakeTmp'
make[1]: *** [Makefile:121: cmTC_21458/fast] Error 2
make[1]: Leaving directory '/home/vagrant/slave/monero-static-win64/build/build/release/CMakeFiles/CMakeTmp'


Determining if the function chown exists failed with the following output:
Change Dir: C:/msys64/home/vagrant/slave/monero-static-win64/build/build/release/CMakeFiles/CMakeTmp

Run Build Command:"C:/msys64/usr/bin/make.exe" "cmTC_27bee/fast"
make[1]: Entering directory '/home/vagrant/slave/monero-static-win64/build/build/release/CMakeFiles/CMakeTmp'
/usr/bin/make -f CMakeFiles/cmTC_27bee.dir/build.make CMakeFiles/cmTC_27bee.dir/build
make[2]: Entering directory '/home/vagrant/slave/monero-static-win64/build/build/release/CMakeFiles/CMakeTmp'
Building C object CMakeFiles/cmTC_27bee.dir/CheckFunctionExists.c.obj

/C/msys64/mingw64/bin/x86_64-w64-mingw32-gcc.exe   -DCHECK_FUNCTION_EXISTS=chown   -o CMakeFiles/cmTC_27bee.dir/CheckFunctionExists.c.obj   -c /C/msys64/mingw64/share/cmake-3.12/Modules/CheckFunctionExists.c
Linking C executable cmTC_27bee.exe

/C/msys64/mingw64/bin/cmake.exe -E remove -f CMakeFiles/cmTC_27bee.dir/objects.a
ar cr CMakeFiles/cmTC_27bee.dir/objects.a "CMakeFiles/cmTC_27bee.dir/CheckFunctionExists.c.obj" 
/C/msys64/mingw64/bin/x86_64-w64-mingw32-gcc.exe  -DCHECK_FUNCTION_EXISTS=chown    -Wl,--whole-archive CMakeFiles/cmTC_27bee.dir/objects.a -Wl,--no-whole-archive  -o cmTC_27bee.exe -Wl,--major-image-version,0,--minor-image-version,0 -liphlpapi -lws2_32 -lkernel32 -luser32 -lgdi32 -lwinspool -lshell32 -lole32 -loleaut32 -luuid -lcomdlg32 -ladvapi32 
CMakeFiles/cmTC_27bee.dir/objects.a(CheckFunctionExists.c.obj):CheckFunctionExists.c:(.text+0x15): undefined reference to `chown'

collect2.exe: error: ld returned 1 exit status
make[2]: *** [CMakeFiles/cmTC_27bee.dir/build.make:88: cmTC_27bee.exe] Error 1
make[2]: Leaving directory '/home/vagrant/slave/monero-static-win64/build/build/release/CMakeFiles/CMakeTmp'
make[1]: *** [Makefile:121: cmTC_27bee/fast] Error 2
make[1]: Leaving directory '/home/vagrant/slave/monero-static-win64/build/build/release/CMakeFiles/CMakeTmp'


Determining if the function chroot exists failed with the following output:
Change Dir: C:/msys64/home/vagrant/slave/monero-static-win64/build/build/release/CMakeFiles/CMakeTmp

Run Build Command:"C:/msys64/usr/bin/make.exe" "cmTC_84c76/fast"
make[1]: Entering directory '/home/vagrant/slave/monero-static-win64/build/build/release/CMakeFiles/CMakeTmp'
/usr/bin/make -f CMakeFiles/cmTC_84c76.dir/build.make CMakeFiles/cmTC_84c76.dir/build
make[2]: Entering directory '/home/vagrant/slave/monero-static-win64/build/build/release/CMakeFiles/CMakeTmp'
Building C object CMakeFiles/cmTC_84c76.dir/CheckFunctionExists.c.obj

/C/msys64/mingw64/bin/x86_64-w64-mingw32-gcc.exe   -DCHECK_FUNCTION_EXISTS=chroot   -o CMakeFiles/cmTC_84c76.dir/CheckFunctionExists.c.obj   -c /C/msys64/mingw64/share/cmake-3.12/Modules/CheckFunctionExists.c
Linking C executable cmTC_84c76.exe

/C/msys64/mingw64/bin/cmake.exe -E remove -f CMakeFiles/cmTC_84c76.dir/objects.a
ar cr CMakeFiles/cmTC_84c76.dir/objects.a "CMakeFiles/cmTC_84c76.dir/CheckFunctionExists.c.obj" 
/C/msys64/mingw64/bin/x86_64-w64-mingw32-gcc.exe  -DCHECK_FUNCTION_EXISTS=chroot    -Wl,--whole-archive CMakeFiles/cmTC_84c76.dir/objects.a -Wl,--no-whole-archive  -o cmTC_84c76.exe -Wl,--major-image-version,0,--minor-image-version,0 -liphlpapi -lws2_32 -lkernel32 -luser32 -lgdi32 -lwinspool -lshell32 -lole32 -loleaut32 -luuid -lcomdlg32 -ladvapi32 
CMakeFiles/cmTC_84c76.dir/objects.a(CheckFunctionExists.c.obj):CheckFunctionExists.c:(.text+0x15): undefined reference to `chroot'

collect2.exe: error: ld returned 1 exit status
make[2]: *** [CMakeFiles/cmTC_84c76.dir/build.make:88: cmTC_84c76.exe] Error 1
make[2]: Leaving directory '/home/vagrant/slave/monero-static-win64/build/build/release/CMakeFiles/CMakeTmp'
make[1]: *** [Makefile:121: cmTC_84c76/fast] Error 2
make[1]: Leaving directory '/home/vagrant/slave/monero-static-win64/build/build/release/CMakeFiles/CMakeTmp'


Determining if the function ctime_r exists failed with the following output:
Change Dir: C:/msys64/home/vagrant/slave/monero-static-win64/build/build/release/CMakeFiles/CMakeTmp

Run Build Command:"C:/msys64/usr/bin/make.exe" "cmTC_be17e/fast"
make[1]: Entering directory '/home/vagrant/slave/monero-static-win64/build/build/release/CMakeFiles/CMakeTmp'
/usr/bin/make -f CMakeFiles/cmTC_be17e.dir/build.make CMakeFiles/cmTC_be17e.dir/build
make[2]: Entering directory '/home/vagrant/slave/monero-static-win64/build/build/release/CMakeFiles/CMakeTmp'
Building C object CMakeFiles/cmTC_be17e.dir/CheckFunctionExists.c.obj

/C/msys64/mingw64/bin/x86_64-w64-mingw32-gcc.exe   -DCHECK_FUNCTION_EXISTS=ctime_r   -o CMakeFiles/cmTC_be17e.dir/CheckFunctionExists.c.obj   -c /C/msys64/mingw64/share/cmake-3.12/Modules/CheckFunctionExists.c
Linking C executable cmTC_be17e.exe

/C/msys64/mingw64/bin/cmake.exe -E remove -f CMakeFiles/cmTC_be17e.dir/objects.a
ar cr CMakeFiles/cmTC_be17e.dir/objects.a "CMakeFiles/cmTC_be17e.dir/CheckFunctionExists.c.obj" 
/C/msys64/mingw64/bin/x86_64-w64-mingw32-gcc.exe  -DCHECK_FUNCTION_EXISTS=ctime_r    -Wl,--whole-archive CMakeFiles/cmTC_be17e.dir/objects.a -Wl,--no-whole-archive  -o cmTC_be17e.exe -Wl,--major-image-version,0,--minor-image-version,0 -liphlpapi -lws2_32 -lkernel32 -luser32 -lgdi32 -lwinspool -lshell32 -lole32 -loleaut32 -luuid -lcomdlg32 -ladvapi32 
CMakeFiles/cmTC_be17e.dir/objects.a(CheckFunctionExists.c.obj):CheckFunctionExists.c:(.text+0x15): undefined reference to `ctime_r'

collect2.exe: error: ld returned 1 exit status
make[2]: *** [CMakeFiles/cmTC_be17e.dir/build.make:88: cmTC_be17e.exe] Error 1
make[2]: Leaving directory '/home/vagrant/slave/monero-static-win64/build/build/release/CMakeFiles/CMakeTmp'
make[1]: *** [Makefile:121: cmTC_be17e/fast] Error 2
make[1]: Leaving directory '/home/vagrant/slave/monero-static-win64/build/build/release/CMakeFiles/CMakeTmp'


Determining if the function daemon exists failed with the following output:
Change Dir: C:/msys64/home/vagrant/slave/monero-static-win64/build/build/release/CMakeFiles/CMakeTmp

Run Build Command:"C:/msys64/usr/bin/make.exe" "cmTC_fde8c/fast"
make[1]: Entering directory '/home/vagrant/slave/monero-static-win64/build/build/release/CMakeFiles/CMakeTmp'
/usr/bin/make -f CMakeFiles/cmTC_fde8c.dir/build.make CMakeFiles/cmTC_fde8c.dir/build
make[2]: Entering directory '/home/vagrant/slave/monero-static-win64/build/build/release/CMakeFiles/CMakeTmp'
Building C object CMakeFiles/cmTC_fde8c.dir/CheckFunctionExists.c.obj

/C/msys64/mingw64/bin/x86_64-w64-mingw32-gcc.exe   -DCHECK_FUNCTION_EXISTS=daemon   -o CMakeFiles/cmTC_fde8c.dir/CheckFunctionExists.c.obj   -c /C/msys64/mingw64/share/cmake-3.12/Modules/CheckFunctionExists.c
Linking C executable cmTC_fde8c.exe

/C/msys64/mingw64/bin/cmake.exe -E remove -f CMakeFiles/cmTC_fde8c.dir/objects.a
ar cr CMakeFiles/cmTC_fde8c.dir/objects.a "CMakeFiles/cmTC_fde8c.dir/CheckFunctionExists.c.obj" 
/C/msys64/mingw64/bin/x86_64-w64-mingw32-gcc.exe  -DCHECK_FUNCTION_EXISTS=daemon    -Wl,--whole-archive CMakeFiles/cmTC_fde8c.dir/objects.a -Wl,--no-whole-archive  -o cmTC_fde8c.exe -Wl,--major-image-version,0,--minor-image-version,0 -liphlpapi -lws2_32 -lkernel32 -luser32 -lgdi32 -lwinspool -lshell32 -lole32 -loleaut32 -luuid -lcomdlg32 -ladvapi32 
CMakeFiles/cmTC_fde8c.dir/objects.a(CheckFunctionExists.c.obj):CheckFunctionExists.c:(.text+0x15): undefined reference to `daemon'

collect2.exe: error: ld returned 1 exit status
make[2]: *** [CMakeFiles/cmTC_fde8c.dir/build.make:88: cmTC_fde8c.exe] Error 1
make[2]: Leaving directory '/home/vagrant/slave/monero-static-win64/build/build/release/CMakeFiles/CMakeTmp'
make[1]: *** [Makefile:121: cmTC_fde8c/fast] Error 2
make[1]: Leaving directory '/home/vagrant/slave/monero-static-win64/build/build/release/CMakeFiles/CMakeTmp'


Determining if the function endprotoent exists failed with the following output:
Change Dir: C:/msys64/home/vagrant/slave/monero-static-win64/build/build/release/CMakeFiles/CMakeTmp

Run Build Command:"C:/msys64/usr/bin/make.exe" "cmTC_c2c3c/fast"
make[1]: Entering directory '/home/vagrant/slave/monero-static-win64/build/build/release/CMakeFiles/CMakeTmp'
/usr/bin/make -f CMakeFiles/cmTC_c2c3c.dir/build.make CMakeFiles/cmTC_c2c3c.dir/build
make[2]: Entering directory '/home/vagrant/slave/monero-static-win64/build/build/release/CMakeFiles/CMakeTmp'
Building C object CMakeFiles/cmTC_c2c3c.dir/CheckFunctionExists.c.obj

/C/msys64/mingw64/bin/x86_64-w64-mingw32-gcc.exe   -DCHECK_FUNCTION_EXISTS=endprotoent   -o CMakeFiles/cmTC_c2c3c.dir/CheckFunctionExists.c.obj   -c /C/msys64/mingw64/share/cmake-3.12/Modules/CheckFunctionExists.c
Linking C executable cmTC_c2c3c.exe

/C/msys64/mingw64/bin/cmake.exe -E remove -f CMakeFiles/cmTC_c2c3c.dir/objects.a
ar cr CMakeFiles/cmTC_c2c3c.dir/objects.a "CMakeFiles/cmTC_c2c3c.dir/CheckFunctionExists.c.obj" 
/C/msys64/mingw64/bin/x86_64-w64-mingw32-gcc.exe  -DCHECK_FUNCTION_EXISTS=endprotoent    -Wl,--whole-archive CMakeFiles/cmTC_c2c3c.dir/objects.a -Wl,--no-whole-archive  -o cmTC_c2c3c.exe -Wl,--major-image-version,0,--minor-image-version,0 -liphlpapi -lws2_32 -lkernel32 -luser32 -lgdi32 -lwinspool -lshell32 -lole32 -loleaut32 -luuid -lcomdlg32 -ladvapi32 
CMakeFiles/cmTC_c2c3c.dir/objects.a(CheckFunctionExists.c.obj):CheckFunctionExists.c:(.text+0x15): undefined reference to `endprotoent'

collect2.exe: error: ld returned 1 exit status
make[2]: *** [CMakeFiles/cmTC_c2c3c.dir/build.make:88: cmTC_c2c3c.exe] Error 1
make[2]: Leaving directory '/home/vagrant/slave/monero-static-win64/build/build/release/CMakeFiles/CMakeTmp'
make[1]: *** [Makefile:121: cmTC_c2c3c/fast] Error 2
make[1]: Leaving directory '/home/vagrant/slave/monero-static-win64/build/build/release/CMakeFiles/CMakeTmp'


Determining if the function endservent exists failed with the following output:
Change Dir: C:/msys64/home/vagrant/slave/monero-static-win64/build/build/release/CMakeFiles/CMakeTmp

Run Build Command:"C:/msys64/usr/bin/make.exe" "cmTC_216f9/fast"
make[1]: Entering directory '/home/vagrant/slave/monero-static-win64/build/build/release/CMakeFiles/CMakeTmp'
/usr/bin/make -f CMakeFiles/cmTC_216f9.dir/build.make CMakeFiles/cmTC_216f9.dir/build
make[2]: Entering directory '/home/vagrant/slave/monero-static-win64/build/build/release/CMakeFiles/CMakeTmp'
Building C object CMakeFiles/cmTC_216f9.dir/CheckFunctionExists.c.obj

/C/msys64/mingw64/bin/x86_64-w64-mingw32-gcc.exe   -DCHECK_FUNCTION_EXISTS=endservent   -o CMakeFiles/cmTC_216f9.dir/CheckFunctionExists.c.obj   -c /C/msys64/mingw64/share/cmake-3.12/Modules/CheckFunctionExists.c
Linking C executable cmTC_216f9.exe

/C/msys64/mingw64/bin/cmake.exe -E remove -f CMakeFiles/cmTC_216f9.dir/objects.a
ar cr CMakeFiles/cmTC_216f9.dir/objects.a "CMakeFiles/cmTC_216f9.dir/CheckFunctionExists.c.obj" 
/C/msys64/mingw64/bin/x86_64-w64-mingw32-gcc.exe  -DCHECK_FUNCTION_EXISTS=endservent    -Wl,--whole-archive CMakeFiles/cmTC_216f9.dir/objects.a -Wl,--no-whole-archive  -o cmTC_216f9.exe -Wl,--major-image-version,0,--minor-image-version,0 -liphlpapi -lws2_32 -lkernel32 -luser32 -lgdi32 -lwinspool -lshell32 -lole32 -loleaut32 -luuid -lcomdlg32 -ladvapi32 
CMakeFiles/cmTC_216f9.dir/objects.a(CheckFunctionExists.c.obj):CheckFunctionExists.c:(.text+0x15): undefined reference to `endservent'

collect2.exe: error: ld returned 1 exit status
make[2]: *** [CMakeFiles/cmTC_216f9.dir/build.make:88: cmTC_216f9.exe] Error 1
make[2]: Leaving directory '/home/vagrant/slave/monero-static-win64/build/build/release/CMakeFiles/CMakeTmp'
make[1]: *** [Makefile:121: cmTC_216f9/fast] Error 2
make[1]: Leaving directory '/home/vagrant/slave/monero-static-win64/build/build/release/CMakeFiles/CMakeTmp'


Determining if the function fork exists failed with the following output:
Change Dir: C:/msys64/home/vagrant/slave/monero-static-win64/build/build/release/CMakeFiles/CMakeTmp

Run Build Command:"C:/msys64/usr/bin/make.exe" "cmTC_7166a/fast"
make[1]: Entering directory '/home/vagrant/slave/monero-static-win64/build/build/release/CMakeFiles/CMakeTmp'
/usr/bin/make -f CMakeFiles/cmTC_7166a.dir/build.make CMakeFiles/cmTC_7166a.dir/build
make[2]: Entering directory '/home/vagrant/slave/monero-static-win64/build/build/release/CMakeFiles/CMakeTmp'
Building C object CMakeFiles/cmTC_7166a.dir/CheckFunctionExists.c.obj

/C/msys64/mingw64/bin/x86_64-w64-mingw32-gcc.exe   -DCHECK_FUNCTION_EXISTS=fork   -o CMakeFiles/cmTC_7166a.dir/CheckFunctionExists.c.obj   -c /C/msys64/mingw64/share/cmake-3.12/Modules/CheckFunctionExists.c
<command-line>: warning: conflicting types for built-in function 'fork' [-Wbuiltin-declaration-mismatch]
C:/msys64/mingw64/share/cmake-3.12/Modules/CheckFunctionExists.c:7:3: note: in expansion of macro 'CHECK_FUNCTION_EXISTS'
   CHECK_FUNCTION_EXISTS(void);
   ^~~~~~~~~~~~~~~~~~~~~
Linking C executable cmTC_7166a.exe

/C/msys64/mingw64/bin/cmake.exe -E remove -f CMakeFiles/cmTC_7166a.dir/objects.a
ar cr CMakeFiles/cmTC_7166a.dir/objects.a "CMakeFiles/cmTC_7166a.dir/CheckFunctionExists.c.obj" 
/C/msys64/mingw64/bin/x86_64-w64-mingw32-gcc.exe  -DCHECK_FUNCTION_EXISTS=fork    -Wl,--whole-archive CMakeFiles/cmTC_7166a.dir/objects.a -Wl,--no-whole-archive  -o cmTC_7166a.exe -Wl,--major-image-version,0,--minor-image-version,0 -liphlpapi -lws2_32 -lkernel32 -luser32 -lgdi32 -lwinspool -lshell32 -lole32 -loleaut32 -luuid -lcomdlg32 -ladvapi32 
CMakeFiles/cmTC_7166a.dir/objects.a(CheckFunctionExists.c.obj):CheckFunctionExists.c:(.text+0x15): undefined reference to `fork'

collect2.exe: error: ld returned 1 exit status
make[2]: *** [CMakeFiles/cmTC_7166a.dir/build.make:88: cmTC_7166a.exe] Error 1
make[2]: Leaving directory '/home/vagrant/slave/monero-static-win64/build/build/release/CMakeFiles/CMakeTmp'
make[1]: *** [Makefile:121: cmTC_7166a/fast] Error 2
make[1]: Leaving directory '/home/vagrant/slave/monero-static-win64/build/build/release/CMakeFiles/CMakeTmp'


Determining if the function fsync exists failed with the following output:
Change Dir: C:/msys64/home/vagrant/slave/monero-static-win64/build/build/release/CMakeFiles/CMakeTmp

Run Build Command:"C:/msys64/usr/bin/make.exe" "cmTC_753fd/fast"
make[1]: Entering directory '/home/vagrant/slave/monero-static-win64/build/build/release/CMakeFiles/CMakeTmp'
/usr/bin/make -f CMakeFiles/cmTC_753fd.dir/build.make CMakeFiles/cmTC_753fd.dir/build
make[2]: Entering directory '/home/vagrant/slave/monero-static-win64/build/build/release/CMakeFiles/CMakeTmp'
Building C object CMakeFiles/cmTC_753fd.dir/CheckFunctionExists.c.obj

/C/msys64/mingw64/bin/x86_64-w64-mingw32-gcc.exe   -DCHECK_FUNCTION_EXISTS=fsync   -o CMakeFiles/cmTC_753fd.dir/CheckFunctionExists.c.obj   -c /C/msys64/mingw64/share/cmake-3.12/Modules/CheckFunctionExists.c
Linking C executable cmTC_753fd.exe

/C/msys64/mingw64/bin/cmake.exe -E remove -f CMakeFiles/cmTC_753fd.dir/objects.a
ar cr CMakeFiles/cmTC_753fd.dir/objects.a "CMakeFiles/cmTC_753fd.dir/CheckFunctionExists.c.obj" 
/C/msys64/mingw64/bin/x86_64-w64-mingw32-gcc.exe  -DCHECK_FUNCTION_EXISTS=fsync    -Wl,--whole-archive CMakeFiles/cmTC_753fd.dir/objects.a -Wl,--no-whole-archive  -o cmTC_753fd.exe -Wl,--major-image-version,0,--minor-image-version,0 -liphlpapi -lws2_32 -lkernel32 -luser32 -lgdi32 -lwinspool -lshell32 -lole32 -loleaut32 -luuid -lcomdlg32 -ladvapi32 
CMakeFiles/cmTC_753fd.dir/objects.a(CheckFunctionExists.c.obj):CheckFunctionExists.c:(.text+0x15): undefined reference to `fsync'

collect2.exe: error: ld returned 1 exit status
make[2]: *** [CMakeFiles/cmTC_753fd.dir/build.make:88: cmTC_753fd.exe] Error 1
make[2]: Leaving directory '/home/vagrant/slave/monero-static-win64/build/build/release/CMakeFiles/CMakeTmp'
make[1]: *** [Makefile:121: cmTC_753fd/fast] Error 2
make[1]: Leaving directory '/home/vagrant/slave/monero-static-win64/build/build/release/CMakeFiles/CMakeTmp'


Determining if the function getauxval exists failed with the following output:
Change Dir: C:/msys64/home/vagrant/slave/monero-static-win64/build/build/release/CMakeFiles/CMakeTmp

Run Build Command:"C:/msys64/usr/bin/make.exe" "cmTC_04a72/fast"
make[1]: Entering directory '/home/vagrant/slave/monero-static-win64/build/build/release/CMakeFiles/CMakeTmp'
/usr/bin/make -f CMakeFiles/cmTC_04a72.dir/build.make CMakeFiles/cmTC_04a72.dir/build
make[2]: Entering directory '/home/vagrant/slave/monero-static-win64/build/build/release/CMakeFiles/CMakeTmp'
Building C object CMakeFiles/cmTC_04a72.dir/CheckFunctionExists.c.obj

/C/msys64/mingw64/bin/x86_64-w64-mingw32-gcc.exe   -DCHECK_FUNCTION_EXISTS=getauxval   -o CMakeFiles/cmTC_04a72.dir/CheckFunctionExists.c.obj   -c /C/msys64/mingw64/share/cmake-3.12/Modules/CheckFunctionExists.c
Linking C executable cmTC_04a72.exe

/C/msys64/mingw64/bin/cmake.exe -E remove -f CMakeFiles/cmTC_04a72.dir/objects.a
ar cr CMakeFiles/cmTC_04a72.dir/objects.a "CMakeFiles/cmTC_04a72.dir/CheckFunctionExists.c.obj" 
/C/msys64/mingw64/bin/x86_64-w64-mingw32-gcc.exe  -DCHECK_FUNCTION_EXISTS=getauxval    -Wl,--whole-archive CMakeFiles/cmTC_04a72.dir/objects.a -Wl,--no-whole-archive  -o cmTC_04a72.exe -Wl,--major-image-version,0,--minor-image-version,0 -liphlpapi -lws2_32 -lkernel32 -luser32 -lgdi32 -lwinspool -lshell32 -lole32 -loleaut32 -luuid -lcomdlg32 -ladvapi32 
CMakeFiles/cmTC_04a72.dir/objects.a(CheckFunctionExists.c.obj):CheckFunctionExists.c:(.text+0x15): undefined reference to `getauxval'

collect2.exe: error: ld returned 1 exit status
make[2]: *** [CMakeFiles/cmTC_04a72.dir/build.make:88: cmTC_04a72.exe] Error 1
make[2]: Leaving directory '/home/vagrant/slave/monero-static-win64/build/build/release/CMakeFiles/CMakeTmp'
make[1]: *** [Makefile:121: cmTC_04a72/fast] Error 2
make[1]: Leaving directory '/home/vagrant/slave/monero-static-win64/build/build/release/CMakeFiles/CMakeTmp'


Determining if the function getentropy exists failed with the following output:
Change Dir: C:/msys64/home/vagrant/slave/monero-static-win64/build/build/release/CMakeFiles/CMakeTmp

Run Build Command:"C:/msys64/usr/bin/make.exe" "cmTC_ff75b/fast"
make[1]: Entering directory '/home/vagrant/slave/monero-static-win64/build/build/release/CMakeFiles/CMakeTmp'
/usr/bin/make -f CMakeFiles/cmTC_ff75b.dir/build.make CMakeFiles/cmTC_ff75b.dir/build
make[2]: Entering directory '/home/vagrant/slave/monero-static-win64/build/build/release/CMakeFiles/CMakeTmp'
Building C object CMakeFiles/cmTC_ff75b.dir/CheckFunctionExists.c.obj

/C/msys64/mingw64/bin/x86_64-w64-mingw32-gcc.exe   -DCHECK_FUNCTION_EXISTS=getentropy   -o CMakeFiles/cmTC_ff75b.dir/CheckFunctionExists.c.obj   -c /C/msys64/mingw64/share/cmake-3.12/Modules/CheckFunctionExists.c
Linking C executable cmTC_ff75b.exe

/C/msys64/mingw64/bin/cmake.exe -E remove -f CMakeFiles/cmTC_ff75b.dir/objects.a
ar cr CMakeFiles/cmTC_ff75b.dir/objects.a "CMakeFiles/cmTC_ff75b.dir/CheckFunctionExists.c.obj" 
/C/msys64/mingw64/bin/x86_64-w64-mingw32-gcc.exe  -DCHECK_FUNCTION_EXISTS=getentropy    -Wl,--whole-archive CMakeFiles/cmTC_ff75b.dir/objects.a -Wl,--no-whole-archive  -o cmTC_ff75b.exe -Wl,--major-image-version,0,--minor-image-version,0 -liphlpapi -lws2_32 -lkernel32 -luser32 -lgdi32 -lwinspool -lshell32 -lole32 -loleaut32 -luuid -lcomdlg32 -ladvapi32 
CMakeFiles/cmTC_ff75b.dir/objects.a(CheckFunctionExists.c.obj):CheckFunctionExists.c:(.text+0x15): undefined reference to `getentropy'

collect2.exe: error: ld returned 1 exit status
make[2]: *** [CMakeFiles/cmTC_ff75b.dir/build.make:88: cmTC_ff75b.exe] Error 1
make[2]: Leaving directory '/home/vagrant/slave/monero-static-win64/build/build/release/CMakeFiles/CMakeTmp'
make[1]: *** [Makefile:121: cmTC_ff75b/fast] Error 2
make[1]: Leaving directory '/home/vagrant/slave/monero-static-win64/build/build/release/CMakeFiles/CMakeTmp'


Determining if the function getpwnam exists failed with the following output:
Change Dir: C:/msys64/home/vagrant/slave/monero-static-win64/build/build/release/CMakeFiles/CMakeTmp

Run Build Command:"C:/msys64/usr/bin/make.exe" "cmTC_113a8/fast"
make[1]: Entering directory '/home/vagrant/slave/monero-static-win64/build/build/release/CMakeFiles/CMakeTmp'
/usr/bin/make -f CMakeFiles/cmTC_113a8.dir/build.make CMakeFiles/cmTC_113a8.dir/build
make[2]: Entering directory '/home/vagrant/slave/monero-static-win64/build/build/release/CMakeFiles/CMakeTmp'
Building C object CMakeFiles/cmTC_113a8.dir/CheckFunctionExists.c.obj

/C/msys64/mingw64/bin/x86_64-w64-mingw32-gcc.exe   -DCHECK_FUNCTION_EXISTS=getpwnam   -o CMakeFiles/cmTC_113a8.dir/CheckFunctionExists.c.obj   -c /C/msys64/mingw64/share/cmake-3.12/Modules/CheckFunctionExists.c
Linking C executable cmTC_113a8.exe

/C/msys64/mingw64/bin/cmake.exe -E remove -f CMakeFiles/cmTC_113a8.dir/objects.a
ar cr CMakeFiles/cmTC_113a8.dir/objects.a "CMakeFiles/cmTC_113a8.dir/CheckFunctionExists.c.obj" 
/C/msys64/mingw64/bin/x86_64-w64-mingw32-gcc.exe  -DCHECK_FUNCTION_EXISTS=getpwnam    -Wl,--whole-archive CMakeFiles/cmTC_113a8.dir/objects.a -Wl,--no-whole-archive  -o cmTC_113a8.exe -Wl,--major-image-version,0,--minor-image-version,0 -liphlpapi -lws2_32 -lkernel32 -luser32 -lgdi32 -lwinspool -lshell32 -lole32 -loleaut32 -luuid -lcomdlg32 -ladvapi32 
CMakeFiles/cmTC_113a8.dir/objects.a(CheckFunctionExists.c.obj):CheckFunctionExists.c:(.text+0x15): undefined reference to `getpwnam'

collect2.exe: error: ld returned 1 exit status
make[2]: *** [CMakeFiles/cmTC_113a8.dir/build.make:88: cmTC_113a8.exe] Error 1
make[2]: Leaving directory '/home/vagrant/slave/monero-static-win64/build/build/release/CMakeFiles/CMakeTmp'
make[1]: *** [Makefile:121: cmTC_113a8/fast] Error 2
make[1]: Leaving directory '/home/vagrant/slave/monero-static-win64/build/build/release/CMakeFiles/CMakeTmp'


Determining if the function getrlimit exists failed with the following output:
Change Dir: C:/msys64/home/vagrant/slave/monero-static-win64/build/build/release/CMakeFiles/CMakeTmp

Run Build Command:"C:/msys64/usr/bin/make.exe" "cmTC_3ec58/fast"
make[1]: Entering directory '/home/vagrant/slave/monero-static-win64/build/build/release/CMakeFiles/CMakeTmp'
/usr/bin/make -f CMakeFiles/cmTC_3ec58.dir/build.make CMakeFiles/cmTC_3ec58.dir/build
make[2]: Entering directory '/home/vagrant/slave/monero-static-win64/build/build/release/CMakeFiles/CMakeTmp'
Building C object CMakeFiles/cmTC_3ec58.dir/CheckFunctionExists.c.obj

/C/msys64/mingw64/bin/x86_64-w64-mingw32-gcc.exe   -DCHECK_FUNCTION_EXISTS=getrlimit   -o CMakeFiles/cmTC_3ec58.dir/CheckFunctionExists.c.obj   -c /C/msys64/mingw64/share/cmake-3.12/Modules/CheckFunctionExists.c
Linking C executable cmTC_3ec58.exe

/C/msys64/mingw64/bin/cmake.exe -E remove -f CMakeFiles/cmTC_3ec58.dir/objects.a
ar cr CMakeFiles/cmTC_3ec58.dir/objects.a "CMakeFiles/cmTC_3ec58.dir/CheckFunctionExists.c.obj" 
/C/msys64/mingw64/bin/x86_64-w64-mingw32-gcc.exe  -DCHECK_FUNCTION_EXISTS=getrlimit    -Wl,--whole-archive CMakeFiles/cmTC_3ec58.dir/objects.a -Wl,--no-whole-archive  -o cmTC_3ec58.exe -Wl,--major-image-version,0,--minor-image-version,0 -liphlpapi -lws2_32 -lkernel32 -luser32 -lgdi32 -lwinspool -lshell32 -lole32 -loleaut32 -luuid -lcomdlg32 -ladvapi32 
CMakeFiles/cmTC_3ec58.dir/objects.a(CheckFunctionExists.c.obj):CheckFunctionExists.c:(.text+0x15): undefined reference to `getrlimit'

collect2.exe: error: ld returned 1 exit status
make[2]: *** [CMakeFiles/cmTC_3ec58.dir/build.make:88: cmTC_3ec58.exe] Error 1
make[2]: Leaving directory '/home/vagrant/slave/monero-static-win64/build/build/release/CMakeFiles/CMakeTmp'
make[1]: *** [Makefile:121: cmTC_3ec58/fast] Error 2
make[1]: Leaving directory '/home/vagrant/slave/monero-static-win64/build/build/release/CMakeFiles/CMakeTmp'


Determining if the function glob exists failed with the following output:
Change Dir: C:/msys64/home/vagrant/slave/monero-static-win64/build/build/release/CMakeFiles/CMakeTmp

Run Build Command:"C:/msys64/usr/bin/make.exe" "cmTC_7e65d/fast"
make[1]: Entering directory '/home/vagrant/slave/monero-static-win64/build/build/release/CMakeFiles/CMakeTmp'
/usr/bin/make -f CMakeFiles/cmTC_7e65d.dir/build.make CMakeFiles/cmTC_7e65d.dir/build
make[2]: Entering directory '/home/vagrant/slave/monero-static-win64/build/build/release/CMakeFiles/CMakeTmp'
Building C object CMakeFiles/cmTC_7e65d.dir/CheckFunctionExists.c.obj

/C/msys64/mingw64/bin/x86_64-w64-mingw32-gcc.exe   -DCHECK_FUNCTION_EXISTS=glob   -o CMakeFiles/cmTC_7e65d.dir/CheckFunctionExists.c.obj   -c /C/msys64/mingw64/share/cmake-3.12/Modules/CheckFunctionExists.c
Linking C executable cmTC_7e65d.exe

/C/msys64/mingw64/bin/cmake.exe -E remove -f CMakeFiles/cmTC_7e65d.dir/objects.a
ar cr CMakeFiles/cmTC_7e65d.dir/objects.a "CMakeFiles/cmTC_7e65d.dir/CheckFunctionExists.c.obj" 
/C/msys64/mingw64/bin/x86_64-w64-mingw32-gcc.exe  -DCHECK_FUNCTION_EXISTS=glob    -Wl,--whole-archive CMakeFiles/cmTC_7e65d.dir/objects.a -Wl,--no-whole-archive  -o cmTC_7e65d.exe -Wl,--major-image-version,0,--minor-image-version,0 -liphlpapi -lws2_32 -lkernel32 -luser32 -lgdi32 -lwinspool -lshell32 -lole32 -loleaut32 -luuid -lcomdlg32 -ladvapi32 
CMakeFiles/cmTC_7e65d.dir/objects.a(CheckFunctionExists.c.obj):CheckFunctionExists.c:(.text+0x15): undefined reference to `glob'

collect2.exe: error: ld returned 1 exit status
make[2]: *** [CMakeFiles/cmTC_7e65d.dir/build.make:88: cmTC_7e65d.exe] Error 1
make[2]: Leaving directory '/home/vagrant/slave/monero-static-win64/build/build/release/CMakeFiles/CMakeTmp'
make[1]: *** [Makefile:121: cmTC_7e65d/fast] Error 2
make[1]: Leaving directory '/home/vagrant/slave/monero-static-win64/build/build/release/CMakeFiles/CMakeTmp'


Determining if the function gmtime_r exists failed with the following output:
Change Dir: C:/msys64/home/vagrant/slave/monero-static-win64/build/build/release/CMakeFiles/CMakeTmp

Run Build Command:"C:/msys64/usr/bin/make.exe" "cmTC_1c8e6/fast"
make[1]: Entering directory '/home/vagrant/slave/monero-static-win64/build/build/release/CMakeFiles/CMakeTmp'
/usr/bin/make -f CMakeFiles/cmTC_1c8e6.dir/build.make CMakeFiles/cmTC_1c8e6.dir/build
make[2]: Entering directory '/home/vagrant/slave/monero-static-win64/build/build/release/CMakeFiles/CMakeTmp'
Building C object CMakeFiles/cmTC_1c8e6.dir/CheckFunctionExists.c.obj

/C/msys64/mingw64/bin/x86_64-w64-mingw32-gcc.exe   -DCHECK_FUNCTION_EXISTS=gmtime_r   -o CMakeFiles/cmTC_1c8e6.dir/CheckFunctionExists.c.obj   -c /C/msys64/mingw64/share/cmake-3.12/Modules/CheckFunctionExists.c
Linking C executable cmTC_1c8e6.exe

/C/msys64/mingw64/bin/cmake.exe -E remove -f CMakeFiles/cmTC_1c8e6.dir/objects.a
ar cr CMakeFiles/cmTC_1c8e6.dir/objects.a "CMakeFiles/cmTC_1c8e6.dir/CheckFunctionExists.c.obj" 
/C/msys64/mingw64/bin/x86_64-w64-mingw32-gcc.exe  -DCHECK_FUNCTION_EXISTS=gmtime_r    -Wl,--whole-archive CMakeFiles/cmTC_1c8e6.dir/objects.a -Wl,--no-whole-archive  -o cmTC_1c8e6.exe -Wl,--major-image-version,0,--minor-image-version,0 -liphlpapi -lws2_32 -lkernel32 -luser32 -lgdi32 -lwinspool -lshell32 -lole32 -loleaut32 -luuid -lcomdlg32 -ladvapi32 
CMakeFiles/cmTC_1c8e6.dir/objects.a(CheckFunctionExists.c.obj):CheckFunctionExists.c:(.text+0x15): undefined reference to `gmtime_r'

collect2.exe: error: ld returned 1 exit status
make[2]: *** [CMakeFiles/cmTC_1c8e6.dir/build.make:88: cmTC_1c8e6.exe] Error 1
make[2]: Leaving directory '/home/vagrant/slave/monero-static-win64/build/build/release/CMakeFiles/CMakeTmp'
make[1]: *** [Makefile:121: cmTC_1c8e6/fast] Error 2
make[1]: Leaving directory '/home/vagrant/slave/monero-static-win64/build/build/release/CMakeFiles/CMakeTmp'


Determining if the function fcntl exists failed with the following output:
Change Dir: C:/msys64/home/vagrant/slave/monero-static-win64/build/build/release/CMakeFiles/CMakeTmp

Run Build Command:"C:/msys64/usr/bin/make.exe" "cmTC_22b0c/fast"
make[1]: Entering directory '/home/vagrant/slave/monero-static-win64/build/build/release/CMakeFiles/CMakeTmp'
/usr/bin/make -f CMakeFiles/cmTC_22b0c.dir/build.make CMakeFiles/cmTC_22b0c.dir/build
make[2]: Entering directory '/home/vagrant/slave/monero-static-win64/build/build/release/CMakeFiles/CMakeTmp'
Building C object CMakeFiles/cmTC_22b0c.dir/CheckFunctionExists.c.obj

/C/msys64/mingw64/bin/x86_64-w64-mingw32-gcc.exe   -DCHECK_FUNCTION_EXISTS=fcntl   -o CMakeFiles/cmTC_22b0c.dir/CheckFunctionExists.c.obj   -c /C/msys64/mingw64/share/cmake-3.12/Modules/CheckFunctionExists.c
Linking C executable cmTC_22b0c.exe

/C/msys64/mingw64/bin/cmake.exe -E remove -f CMakeFiles/cmTC_22b0c.dir/objects.a
ar cr CMakeFiles/cmTC_22b0c.dir/objects.a "CMakeFiles/cmTC_22b0c.dir/CheckFunctionExists.c.obj" 
/C/msys64/mingw64/bin/x86_64-w64-mingw32-gcc.exe  -DCHECK_FUNCTION_EXISTS=fcntl    -Wl,--whole-archive CMakeFiles/cmTC_22b0c.dir/objects.a -Wl,--no-whole-archive  -o cmTC_22b0c.exe -Wl,--major-image-version,0,--minor-image-version,0 -liphlpapi -lws2_32 -lkernel32 -luser32 -lgdi32 -lwinspool -lshell32 -lole32 -loleaut32 -luuid -lcomdlg32 -ladvapi32 
CMakeFiles/cmTC_22b0c.dir/objects.a(CheckFunctionExists.c.obj):CheckFunctionExists.c:(.text+0x15): undefined reference to `fcntl'

collect2.exe: error: ld returned 1 exit status
make[2]: *** [CMakeFiles/cmTC_22b0c.dir/build.make:88: cmTC_22b0c.exe] Error 1
make[2]: Leaving directory '/home/vagrant/slave/monero-static-win64/build/build/release/CMakeFiles/CMakeTmp'
make[1]: *** [Makefile:121: cmTC_22b0c/fast] Error 2
make[1]: Leaving directory '/home/vagrant/slave/monero-static-win64/build/build/release/CMakeFiles/CMakeTmp'


Determining if the function inet_aton exists failed with the following output:
Change Dir: C:/msys64/home/vagrant/slave/monero-static-win64/build/build/release/CMakeFiles/CMakeTmp

Run Build Command:"C:/msys64/usr/bin/make.exe" "cmTC_9a1fe/fast"
make[1]: Entering directory '/home/vagrant/slave/monero-static-win64/build/build/release/CMakeFiles/CMakeTmp'
/usr/bin/make -f CMakeFiles/cmTC_9a1fe.dir/build.make CMakeFiles/cmTC_9a1fe.dir/build
make[2]: Entering directory '/home/vagrant/slave/monero-static-win64/build/build/release/CMakeFiles/CMakeTmp'
Building C object CMakeFiles/cmTC_9a1fe.dir/CheckFunctionExists.c.obj

/C/msys64/mingw64/bin/x86_64-w64-mingw32-gcc.exe   -DCHECK_FUNCTION_EXISTS=inet_aton   -o CMakeFiles/cmTC_9a1fe.dir/CheckFunctionExists.c.obj   -c /C/msys64/mingw64/share/cmake-3.12/Modules/CheckFunctionExists.c
Linking C executable cmTC_9a1fe.exe

/C/msys64/mingw64/bin/cmake.exe -E remove -f CMakeFiles/cmTC_9a1fe.dir/objects.a
ar cr CMakeFiles/cmTC_9a1fe.dir/objects.a "CMakeFiles/cmTC_9a1fe.dir/CheckFunctionExists.c.obj" 
/C/msys64/mingw64/bin/x86_64-w64-mingw32-gcc.exe  -DCHECK_FUNCTION_EXISTS=inet_aton    -Wl,--whole-archive CMakeFiles/cmTC_9a1fe.dir/objects.a -Wl,--no-whole-archive  -o cmTC_9a1fe.exe -Wl,--major-image-version,0,--minor-image-version,0 -liphlpapi -lws2_32 -lkernel32 -luser32 -lgdi32 -lwinspool -lshell32 -lole32 -loleaut32 -luuid -lcomdlg32 -ladvapi32 
CMakeFiles/cmTC_9a1fe.dir/objects.a(CheckFunctionExists.c.obj):CheckFunctionExists.c:(.text+0x15): undefined reference to `inet_aton'

collect2.exe: error: ld returned 1 exit status
make[2]: *** [CMakeFiles/cmTC_9a1fe.dir/build.make:88: cmTC_9a1fe.exe] Error 1
make[2]: Leaving directory '/home/vagrant/slave/monero-static-win64/build/build/release/CMakeFiles/CMakeTmp'
make[1]: *** [Makefile:121: cmTC_9a1fe/fast] Error 2
make[1]: Leaving directory '/home/vagrant/slave/monero-static-win64/build/build/release/CMakeFiles/CMakeTmp'


Determining if the function initgroups exists failed with the following output:
Change Dir: C:/msys64/home/vagrant/slave/monero-static-win64/build/build/release/CMakeFiles/CMakeTmp

Run Build Command:"C:/msys64/usr/bin/make.exe" "cmTC_88d45/fast"
make[1]: Entering directory '/home/vagrant/slave/monero-static-win64/build/build/release/CMakeFiles/CMakeTmp'
/usr/bin/make -f CMakeFiles/cmTC_88d45.dir/build.make CMakeFiles/cmTC_88d45.dir/build
make[2]: Entering directory '/home/vagrant/slave/monero-static-win64/build/build/release/CMakeFiles/CMakeTmp'
Building C object CMakeFiles/cmTC_88d45.dir/CheckFunctionExists.c.obj

/C/msys64/mingw64/bin/x86_64-w64-mingw32-gcc.exe   -DCHECK_FUNCTION_EXISTS=initgroups   -o CMakeFiles/cmTC_88d45.dir/CheckFunctionExists.c.obj   -c /C/msys64/mingw64/share/cmake-3.12/Modules/CheckFunctionExists.c
Linking C executable cmTC_88d45.exe

/C/msys64/mingw64/bin/cmake.exe -E remove -f CMakeFiles/cmTC_88d45.dir/objects.a
ar cr CMakeFiles/cmTC_88d45.dir/objects.a "CMakeFiles/cmTC_88d45.dir/CheckFunctionExists.c.obj" 
/C/msys64/mingw64/bin/x86_64-w64-mingw32-gcc.exe  -DCHECK_FUNCTION_EXISTS=initgroups    -Wl,--whole-archive CMakeFiles/cmTC_88d45.dir/objects.a -Wl,--no-whole-archive  -o cmTC_88d45.exe -Wl,--major-image-version,0,--minor-image-version,0 -liphlpapi -lws2_32 -lkernel32 -luser32 -lgdi32 -lwinspool -lshell32 -lole32 -loleaut32 -luuid -lcomdlg32 -ladvapi32 
CMakeFiles/cmTC_88d45.dir/objects.a(CheckFunctionExists.c.obj):CheckFunctionExists.c:(.text+0x15): undefined reference to `initgroups'

collect2.exe: error: ld returned 1 exit status
make[2]: *** [CMakeFiles/cmTC_88d45.dir/build.make:88: cmTC_88d45.exe] Error 1
make[2]: Leaving directory '/home/vagrant/slave/monero-static-win64/build/build/release/CMakeFiles/CMakeTmp'
make[1]: *** [Makefile:121: cmTC_88d45/fast] Error 2
make[1]: Leaving directory '/home/vagrant/slave/monero-static-win64/build/build/release/CMakeFiles/CMakeTmp'


Determining if the function kill exists failed with the following output:
Change Dir: C:/msys64/home/vagrant/slave/monero-static-win64/build/build/release/CMakeFiles/CMakeTmp

Run Build Command:"C:/msys64/usr/bin/make.exe" "cmTC_cac83/fast"
make[1]: Entering directory '/home/vagrant/slave/monero-static-win64/build/build/release/CMakeFiles/CMakeTmp'
/usr/bin/make -f CMakeFiles/cmTC_cac83.dir/build.make CMakeFiles/cmTC_cac83.dir/build
make[2]: Entering directory '/home/vagrant/slave/monero-static-win64/build/build/release/CMakeFiles/CMakeTmp'
Building C object CMakeFiles/cmTC_cac83.dir/CheckFunctionExists.c.obj

/C/msys64/mingw64/bin/x86_64-w64-mingw32-gcc.exe   -DCHECK_FUNCTION_EXISTS=kill   -o CMakeFiles/cmTC_cac83.dir/CheckFunctionExists.c.obj   -c /C/msys64/mingw64/share/cmake-3.12/Modules/CheckFunctionExists.c
Linking C executable cmTC_cac83.exe

/C/msys64/mingw64/bin/cmake.exe -E remove -f CMakeFiles/cmTC_cac83.dir/objects.a
ar cr CMakeFiles/cmTC_cac83.dir/objects.a "CMakeFiles/cmTC_cac83.dir/CheckFunctionExists.c.obj" 
/C/msys64/mingw64/bin/x86_64-w64-mingw32-gcc.exe  -DCHECK_FUNCTION_EXISTS=kill    -Wl,--whole-archive CMakeFiles/cmTC_cac83.dir/objects.a -Wl,--no-whole-archive  -o cmTC_cac83.exe -Wl,--major-image-version,0,--minor-image-version,0 -liphlpapi -lws2_32 -lkernel32 -luser32 -lgdi32 -lwinspool -lshell32 -lole32 -loleaut32 -luuid -lcomdlg32 -ladvapi32 
CMakeFiles/cmTC_cac83.dir/objects.a(CheckFunctionExists.c.obj):CheckFunctionExists.c:(.text+0x15): undefined reference to `kill'

collect2.exe: error: ld returned 1 exit status
make[2]: *** [CMakeFiles/cmTC_cac83.dir/build.make:88: cmTC_cac83.exe] Error 1
make[2]: Leaving directory '/home/vagrant/slave/monero-static-win64/build/build/release/CMakeFiles/CMakeTmp'
make[1]: *** [Makefile:121: cmTC_cac83/fast] Error 2
make[1]: Leaving directory '/home/vagrant/slave/monero-static-win64/build/build/release/CMakeFiles/CMakeTmp'


Determining if the function localtime_r exists failed with the following output:
Change Dir: C:/msys64/home/vagrant/slave/monero-static-win64/build/build/release/CMakeFiles/CMakeTmp

Run Build Command:"C:/msys64/usr/bin/make.exe" "cmTC_df2a3/fast"
make[1]: Entering directory '/home/vagrant/slave/monero-static-win64/build/build/release/CMakeFiles/CMakeTmp'
/usr/bin/make -f CMakeFiles/cmTC_df2a3.dir/build.make CMakeFiles/cmTC_df2a3.dir/build
make[2]: Entering directory '/home/vagrant/slave/monero-static-win64/build/build/release/CMakeFiles/CMakeTmp'
Building C object CMakeFiles/cmTC_df2a3.dir/CheckFunctionExists.c.obj

/C/msys64/mingw64/bin/x86_64-w64-mingw32-gcc.exe   -DCHECK_FUNCTION_EXISTS=localtime_r   -o CMakeFiles/cmTC_df2a3.dir/CheckFunctionExists.c.obj   -c /C/msys64/mingw64/share/cmake-3.12/Modules/CheckFunctionExists.c
Linking C executable cmTC_df2a3.exe

/C/msys64/mingw64/bin/cmake.exe -E remove -f CMakeFiles/cmTC_df2a3.dir/objects.a
ar cr CMakeFiles/cmTC_df2a3.dir/objects.a "CMakeFiles/cmTC_df2a3.dir/CheckFunctionExists.c.obj" 
/C/msys64/mingw64/bin/x86_64-w64-mingw32-gcc.exe  -DCHECK_FUNCTION_EXISTS=localtime_r    -Wl,--whole-archive CMakeFiles/cmTC_df2a3.dir/objects.a -Wl,--no-whole-archive  -o cmTC_df2a3.exe -Wl,--major-image-version,0,--minor-image-version,0 -liphlpapi -lws2_32 -lkernel32 -luser32 -lgdi32 -lwinspool -lshell32 -lole32 -loleaut32 -luuid -lcomdlg32 -ladvapi32 
CMakeFiles/cmTC_df2a3.dir/objects.a(CheckFunctionExists.c.obj):CheckFunctionExists.c:(.text+0x15): undefined reference to `localtime_r'

collect2.exe: error: ld returned 1 exit status
make[2]: *** [CMakeFiles/cmTC_df2a3.dir/build.make:88: cmTC_df2a3.exe] Error 1
make[2]: Leaving directory '/home/vagrant/slave/monero-static-win64/build/build/release/CMakeFiles/CMakeTmp'
make[1]: *** [Makefile:121: cmTC_df2a3/fast] Error 2
make[1]: Leaving directory '/home/vagrant/slave/monero-static-win64/build/build/release/CMakeFiles/CMakeTmp'


Determining if the function random exists failed with the following output:
Change Dir: C:/msys64/home/vagrant/slave/monero-static-win64/build/build/release/CMakeFiles/CMakeTmp

Run Build Command:"C:/msys64/usr/bin/make.exe" "cmTC_4b25f/fast"
make[1]: Entering directory '/home/vagrant/slave/monero-static-win64/build/build/release/CMakeFiles/CMakeTmp'
/usr/bin/make -f CMakeFiles/cmTC_4b25f.dir/build.make CMakeFiles/cmTC_4b25f.dir/build
make[2]: Entering directory '/home/vagrant/slave/monero-static-win64/build/build/release/CMakeFiles/CMakeTmp'
Building C object CMakeFiles/cmTC_4b25f.dir/CheckFunctionExists.c.obj

/C/msys64/mingw64/bin/x86_64-w64-mingw32-gcc.exe   -DCHECK_FUNCTION_EXISTS=random   -o CMakeFiles/cmTC_4b25f.dir/CheckFunctionExists.c.obj   -c /C/msys64/mingw64/share/cmake-3.12/Modules/CheckFunctionExists.c
Linking C executable cmTC_4b25f.exe

/C/msys64/mingw64/bin/cmake.exe -E remove -f CMakeFiles/cmTC_4b25f.dir/objects.a
ar cr CMakeFiles/cmTC_4b25f.dir/objects.a "CMakeFiles/cmTC_4b25f.dir/CheckFunctionExists.c.obj" 
/C/msys64/mingw64/bin/x86_64-w64-mingw32-gcc.exe  -DCHECK_FUNCTION_EXISTS=random    -Wl,--whole-archive CMakeFiles/cmTC_4b25f.dir/objects.a -Wl,--no-whole-archive  -o cmTC_4b25f.exe -Wl,--major-image-version,0,--minor-image-version,0 -liphlpapi -lws2_32 -lkernel32 -luser32 -lgdi32 -lwinspool -lshell32 -lole32 -loleaut32 -luuid -lcomdlg32 -ladvapi32 
CMakeFiles/cmTC_4b25f.dir/objects.a(CheckFunctionExists.c.obj):CheckFunctionExists.c:(.text+0x15): undefined reference to `random'

collect2.exe: error: ld returned 1 exit status
make[2]: *** [CMakeFiles/cmTC_4b25f.dir/build.make:88: cmTC_4b25f.exe] Error 1
make[2]: Leaving directory '/home/vagrant/slave/monero-static-win64/build/build/release/CMakeFiles/CMakeTmp'
make[1]: *** [Makefile:121: cmTC_4b25f/fast] Error 2
make[1]: Leaving directory '/home/vagrant/slave/monero-static-win64/build/build/release/CMakeFiles/CMakeTmp'


Determining if the function reallocarray exists failed with the following output:
Change Dir: C:/msys64/home/vagrant/slave/monero-static-win64/build/build/release/CMakeFiles/CMakeTmp

Run Build Command:"C:/msys64/usr/bin/make.exe" "cmTC_c072f/fast"
make[1]: Entering directory '/home/vagrant/slave/monero-static-win64/build/build/release/CMakeFiles/CMakeTmp'
/usr/bin/make -f CMakeFiles/cmTC_c072f.dir/build.make CMakeFiles/cmTC_c072f.dir/build
make[2]: Entering directory '/home/vagrant/slave/monero-static-win64/build/build/release/CMakeFiles/CMakeTmp'
Building C object CMakeFiles/cmTC_c072f.dir/CheckFunctionExists.c.obj

/C/msys64/mingw64/bin/x86_64-w64-mingw32-gcc.exe   -DCHECK_FUNCTION_EXISTS=reallocarray   -o CMakeFiles/cmTC_c072f.dir/CheckFunctionExists.c.obj   -c /C/msys64/mingw64/share/cmake-3.12/Modules/CheckFunctionExists.c
Linking C executable cmTC_c072f.exe

/C/msys64/mingw64/bin/cmake.exe -E remove -f CMakeFiles/cmTC_c072f.dir/objects.a
ar cr CMakeFiles/cmTC_c072f.dir/objects.a "CMakeFiles/cmTC_c072f.dir/CheckFunctionExists.c.obj" 
/C/msys64/mingw64/bin/x86_64-w64-mingw32-gcc.exe  -DCHECK_FUNCTION_EXISTS=reallocarray    -Wl,--whole-archive CMakeFiles/cmTC_c072f.dir/objects.a -Wl,--no-whole-archive  -o cmTC_c072f.exe -Wl,--major-image-version,0,--minor-image-version,0 -liphlpapi -lws2_32 -lkernel32 -luser32 -lgdi32 -lwinspool -lshell32 -lole32 -loleaut32 -luuid -lcomdlg32 -ladvapi32 
CMakeFiles/cmTC_c072f.dir/objects.a(CheckFunctionExists.c.obj):CheckFunctionExists.c:(.text+0x15): undefined reference to `reallocarray'

collect2.exe: error: ld returned 1 exit status
make[2]: *** [CMakeFiles/cmTC_c072f.dir/build.make:88: cmTC_c072f.exe] Error 1
make[2]: Leaving directory '/home/vagrant/slave/monero-static-win64/build/build/release/CMakeFiles/CMakeTmp'
make[1]: *** [Makefile:121: cmTC_c072f/fast] Error 2
make[1]: Leaving directory '/home/vagrant/slave/monero-static-win64/build/build/release/CMakeFiles/CMakeTmp'


Determining if the function recvmsg exists failed with the following output:
Change Dir: C:/msys64/home/vagrant/slave/monero-static-win64/build/build/release/CMakeFiles/CMakeTmp

Run Build Command:"C:/msys64/usr/bin/make.exe" "cmTC_48579/fast"
make[1]: Entering directory '/home/vagrant/slave/monero-static-win64/build/build/release/CMakeFiles/CMakeTmp'
/usr/bin/make -f CMakeFiles/cmTC_48579.dir/build.make CMakeFiles/cmTC_48579.dir/build
make[2]: Entering directory '/home/vagrant/slave/monero-static-win64/build/build/release/CMakeFiles/CMakeTmp'
Building C object CMakeFiles/cmTC_48579.dir/CheckFunctionExists.c.obj

/C/msys64/mingw64/bin/x86_64-w64-mingw32-gcc.exe   -DCHECK_FUNCTION_EXISTS=recvmsg   -o CMakeFiles/cmTC_48579.dir/CheckFunctionExists.c.obj   -c /C/msys64/mingw64/share/cmake-3.12/Modules/CheckFunctionExists.c
Linking C executable cmTC_48579.exe

/C/msys64/mingw64/bin/cmake.exe -E remove -f CMakeFiles/cmTC_48579.dir/objects.a
ar cr CMakeFiles/cmTC_48579.dir/objects.a "CMakeFiles/cmTC_48579.dir/CheckFunctionExists.c.obj" 
/C/msys64/mingw64/bin/x86_64-w64-mingw32-gcc.exe  -DCHECK_FUNCTION_EXISTS=recvmsg    -Wl,--whole-archive CMakeFiles/cmTC_48579.dir/objects.a -Wl,--no-whole-archive  -o cmTC_48579.exe -Wl,--major-image-version,0,--minor-image-version,0 -liphlpapi -lws2_32 -lkernel32 -luser32 -lgdi32 -lwinspool -lshell32 -lole32 -loleaut32 -luuid -lcomdlg32 -ladvapi32 
CMakeFiles/cmTC_48579.dir/objects.a(CheckFunctionExists.c.obj):CheckFunctionExists.c:(.text+0x15): undefined reference to `recvmsg'

collect2.exe: error: ld returned 1 exit status
make[2]: *** [CMakeFiles/cmTC_48579.dir/build.make:88: cmTC_48579.exe] Error 1
make[2]: Leaving directory '/home/vagrant/slave/monero-static-win64/build/build/release/CMakeFiles/CMakeTmp'
make[1]: *** [Makefile:121: cmTC_48579/fast] Error 2
make[1]: Leaving directory '/home/vagrant/slave/monero-static-win64/build/build/release/CMakeFiles/CMakeTmp'


Determining if the function sbrk exists failed with the following output:
Change Dir: C:/msys64/home/vagrant/slave/monero-static-win64/build/build/release/CMakeFiles/CMakeTmp

Run Build Command:"C:/msys64/usr/bin/make.exe" "cmTC_36799/fast"
make[1]: Entering directory '/home/vagrant/slave/monero-static-win64/build/build/release/CMakeFiles/CMakeTmp'
/usr/bin/make -f CMakeFiles/cmTC_36799.dir/build.make CMakeFiles/cmTC_36799.dir/build
make[2]: Entering directory '/home/vagrant/slave/monero-static-win64/build/build/release/CMakeFiles/CMakeTmp'
Building C object CMakeFiles/cmTC_36799.dir/CheckFunctionExists.c.obj

/C/msys64/mingw64/bin/x86_64-w64-mingw32-gcc.exe   -DCHECK_FUNCTION_EXISTS=sbrk   -o CMakeFiles/cmTC_36799.dir/CheckFunctionExists.c.obj   -c /C/msys64/mingw64/share/cmake-3.12/Modules/CheckFunctionExists.c
Linking C executable cmTC_36799.exe

/C/msys64/mingw64/bin/cmake.exe -E remove -f CMakeFiles/cmTC_36799.dir/objects.a
ar cr CMakeFiles/cmTC_36799.dir/objects.a "CMakeFiles/cmTC_36799.dir/CheckFunctionExists.c.obj" 
/C/msys64/mingw64/bin/x86_64-w64-mingw32-gcc.exe  -DCHECK_FUNCTION_EXISTS=sbrk    -Wl,--whole-archive CMakeFiles/cmTC_36799.dir/objects.a -Wl,--no-whole-archive  -o cmTC_36799.exe -Wl,--major-image-version,0,--minor-image-version,0 -liphlpapi -lws2_32 -lkernel32 -luser32 -lgdi32 -lwinspool -lshell32 -lole32 -loleaut32 -luuid -lcomdlg32 -ladvapi32 
CMakeFiles/cmTC_36799.dir/objects.a(CheckFunctionExists.c.obj):CheckFunctionExists.c:(.text+0x15): undefined reference to `sbrk'

collect2.exe: error: ld returned 1 exit status
make[2]: *** [CMakeFiles/cmTC_36799.dir/build.make:88: cmTC_36799.exe] Error 1
make[2]: Leaving directory '/home/vagrant/slave/monero-static-win64/build/build/release/CMakeFiles/CMakeTmp'
make[1]: *** [Makefile:121: cmTC_36799/fast] Error 2
make[1]: Leaving directory '/home/vagrant/slave/monero-static-win64/build/build/release/CMakeFiles/CMakeTmp'


Determining if the function sendmsg exists failed with the following output:
Change Dir: C:/msys64/home/vagrant/slave/monero-static-win64/build/build/release/CMakeFiles/CMakeTmp

Run Build Command:"C:/msys64/usr/bin/make.exe" "cmTC_79381/fast"
make[1]: Entering directory '/home/vagrant/slave/monero-static-win64/build/build/release/CMakeFiles/CMakeTmp'
/usr/bin/make -f CMakeFiles/cmTC_79381.dir/build.make CMakeFiles/cmTC_79381.dir/build
make[2]: Entering directory '/home/vagrant/slave/monero-static-win64/build/build/release/CMakeFiles/CMakeTmp'
Building C object CMakeFiles/cmTC_79381.dir/CheckFunctionExists.c.obj

/C/msys64/mingw64/bin/x86_64-w64-mingw32-gcc.exe   -DCHECK_FUNCTION_EXISTS=sendmsg   -o CMakeFiles/cmTC_79381.dir/CheckFunctionExists.c.obj   -c /C/msys64/mingw64/share/cmake-3.12/Modules/CheckFunctionExists.c
Linking C executable cmTC_79381.exe

/C/msys64/mingw64/bin/cmake.exe -E remove -f CMakeFiles/cmTC_79381.dir/objects.a
ar cr CMakeFiles/cmTC_79381.dir/objects.a "CMakeFiles/cmTC_79381.dir/CheckFunctionExists.c.obj" 
/C/msys64/mingw64/bin/x86_64-w64-mingw32-gcc.exe  -DCHECK_FUNCTION_EXISTS=sendmsg    -Wl,--whole-archive CMakeFiles/cmTC_79381.dir/objects.a -Wl,--no-whole-archive  -o cmTC_79381.exe -Wl,--major-image-version,0,--minor-image-version,0 -liphlpapi -lws2_32 -lkernel32 -luser32 -lgdi32 -lwinspool -lshell32 -lole32 -loleaut32 -luuid -lcomdlg32 -ladvapi32 
CMakeFiles/cmTC_79381.dir/objects.a(CheckFunctionExists.c.obj):CheckFunctionExists.c:(.text+0x15): undefined reference to `sendmsg'

collect2.exe: error: ld returned 1 exit status
make[2]: *** [CMakeFiles/cmTC_79381.dir/build.make:88: cmTC_79381.exe] Error 1
make[2]: Leaving directory '/home/vagrant/slave/monero-static-win64/build/build/release/CMakeFiles/CMakeTmp'
make[1]: *** [Makefile:121: cmTC_79381/fast] Error 2
make[1]: Leaving directory '/home/vagrant/slave/monero-static-win64/build/build/release/CMakeFiles/CMakeTmp'


Determining if the function setregid exists failed with the following output:
Change Dir: C:/msys64/home/vagrant/slave/monero-static-win64/build/build/release/CMakeFiles/CMakeTmp

Run Build Command:"C:/msys64/usr/bin/make.exe" "cmTC_ff4f5/fast"
make[1]: Entering directory '/home/vagrant/slave/monero-static-win64/build/build/release/CMakeFiles/CMakeTmp'
/usr/bin/make -f CMakeFiles/cmTC_ff4f5.dir/build.make CMakeFiles/cmTC_ff4f5.dir/build
make[2]: Entering directory '/home/vagrant/slave/monero-static-win64/build/build/release/CMakeFiles/CMakeTmp'
Building C object CMakeFiles/cmTC_ff4f5.dir/CheckFunctionExists.c.obj

/C/msys64/mingw64/bin/x86_64-w64-mingw32-gcc.exe   -DCHECK_FUNCTION_EXISTS=setregid   -o CMakeFiles/cmTC_ff4f5.dir/CheckFunctionExists.c.obj   -c /C/msys64/mingw64/share/cmake-3.12/Modules/CheckFunctionExists.c
Linking C executable cmTC_ff4f5.exe

/C/msys64/mingw64/bin/cmake.exe -E remove -f CMakeFiles/cmTC_ff4f5.dir/objects.a
ar cr CMakeFiles/cmTC_ff4f5.dir/objects.a "CMakeFiles/cmTC_ff4f5.dir/CheckFunctionExists.c.obj" 
/C/msys64/mingw64/bin/x86_64-w64-mingw32-gcc.exe  -DCHECK_FUNCTION_EXISTS=setregid    -Wl,--whole-archive CMakeFiles/cmTC_ff4f5.dir/objects.a -Wl,--no-whole-archive  -o cmTC_ff4f5.exe -Wl,--major-image-version,0,--minor-image-version,0 -liphlpapi -lws2_32 -lkernel32 -luser32 -lgdi32 -lwinspool -lshell32 -lole32 -loleaut32 -luuid -lcomdlg32 -ladvapi32 
CMakeFiles/cmTC_ff4f5.dir/objects.a(CheckFunctionExists.c.obj):CheckFunctionExists.c:(.text+0x15): undefined reference to `setregid'

collect2.exe: error: ld returned 1 exit status
make[2]: *** [CMakeFiles/cmTC_ff4f5.dir/build.make:88: cmTC_ff4f5.exe] Error 1
make[2]: Leaving directory '/home/vagrant/slave/monero-static-win64/build/build/release/CMakeFiles/CMakeTmp'
make[1]: *** [Makefile:121: cmTC_ff4f5/fast] Error 2
make[1]: Leaving directory '/home/vagrant/slave/monero-static-win64/build/build/release/CMakeFiles/CMakeTmp'


Determining if the function setresgid exists failed with the following output:
Change Dir: C:/msys64/home/vagrant/slave/monero-static-win64/build/build/release/CMakeFiles/CMakeTmp

Run Build Command:"C:/msys64/usr/bin/make.exe" "cmTC_c8436/fast"
make[1]: Entering directory '/home/vagrant/slave/monero-static-win64/build/build/release/CMakeFiles/CMakeTmp'
/usr/bin/make -f CMakeFiles/cmTC_c8436.dir/build.make CMakeFiles/cmTC_c8436.dir/build
make[2]: Entering directory '/home/vagrant/slave/monero-static-win64/build/build/release/CMakeFiles/CMakeTmp'
Building C object CMakeFiles/cmTC_c8436.dir/CheckFunctionExists.c.obj

/C/msys64/mingw64/bin/x86_64-w64-mingw32-gcc.exe   -DCHECK_FUNCTION_EXISTS=setresgid   -o CMakeFiles/cmTC_c8436.dir/CheckFunctionExists.c.obj   -c /C/msys64/mingw64/share/cmake-3.12/Modules/CheckFunctionExists.c
Linking C executable cmTC_c8436.exe

/C/msys64/mingw64/bin/cmake.exe -E remove -f CMakeFiles/cmTC_c8436.dir/objects.a
ar cr CMakeFiles/cmTC_c8436.dir/objects.a "CMakeFiles/cmTC_c8436.dir/CheckFunctionExists.c.obj" 
/C/msys64/mingw64/bin/x86_64-w64-mingw32-gcc.exe  -DCHECK_FUNCTION_EXISTS=setresgid    -Wl,--whole-archive CMakeFiles/cmTC_c8436.dir/objects.a -Wl,--no-whole-archive  -o cmTC_c8436.exe -Wl,--major-image-version,0,--minor-image-version,0 -liphlpapi -lws2_32 -lkernel32 -luser32 -lgdi32 -lwinspool -lshell32 -lole32 -loleaut32 -luuid -lcomdlg32 -ladvapi32 
CMakeFiles/cmTC_c8436.dir/objects.a(CheckFunctionExists.c.obj):CheckFunctionExists.c:(.text+0x15): undefined reference to `setresgid'

collect2.exe: error: ld returned 1 exit status
make[2]: *** [CMakeFiles/cmTC_c8436.dir/build.make:88: cmTC_c8436.exe] Error 1
make[2]: Leaving directory '/home/vagrant/slave/monero-static-win64/build/build/release/CMakeFiles/CMakeTmp'
make[1]: *** [Makefile:121: cmTC_c8436/fast] Error 2
make[1]: Leaving directory '/home/vagrant/slave/monero-static-win64/build/build/release/CMakeFiles/CMakeTmp'


Determining if the function setresuid exists failed with the following output:
Change Dir: C:/msys64/home/vagrant/slave/monero-static-win64/build/build/release/CMakeFiles/CMakeTmp

Run Build Command:"C:/msys64/usr/bin/make.exe" "cmTC_45d59/fast"
make[1]: Entering directory '/home/vagrant/slave/monero-static-win64/build/build/release/CMakeFiles/CMakeTmp'
/usr/bin/make -f CMakeFiles/cmTC_45d59.dir/build.make CMakeFiles/cmTC_45d59.dir/build
make[2]: Entering directory '/home/vagrant/slave/monero-static-win64/build/build/release/CMakeFiles/CMakeTmp'
Building C object CMakeFiles/cmTC_45d59.dir/CheckFunctionExists.c.obj

/C/msys64/mingw64/bin/x86_64-w64-mingw32-gcc.exe   -DCHECK_FUNCTION_EXISTS=setresuid   -o CMakeFiles/cmTC_45d59.dir/CheckFunctionExists.c.obj   -c /C/msys64/mingw64/share/cmake-3.12/Modules/CheckFunctionExists.c
Linking C executable cmTC_45d59.exe

/C/msys64/mingw64/bin/cmake.exe -E remove -f CMakeFiles/cmTC_45d59.dir/objects.a
ar cr CMakeFiles/cmTC_45d59.dir/objects.a "CMakeFiles/cmTC_45d59.dir/CheckFunctionExists.c.obj" 
/C/msys64/mingw64/bin/x86_64-w64-mingw32-gcc.exe  -DCHECK_FUNCTION_EXISTS=setresuid    -Wl,--whole-archive CMakeFiles/cmTC_45d59.dir/objects.a -Wl,--no-whole-archive  -o cmTC_45d59.exe -Wl,--major-image-version,0,--minor-image-version,0 -liphlpapi -lws2_32 -lkernel32 -luser32 -lgdi32 -lwinspool -lshell32 -lole32 -loleaut32 -luuid -lcomdlg32 -ladvapi32 
CMakeFiles/cmTC_45d59.dir/objects.a(CheckFunctionExists.c.obj):CheckFunctionExists.c:(.text+0x15): undefined reference to `setresuid'

collect2.exe: error: ld returned 1 exit status
make[2]: *** [CMakeFiles/cmTC_45d59.dir/build.make:88: cmTC_45d59.exe] Error 1
make[2]: Leaving directory '/home/vagrant/slave/monero-static-win64/build/build/release/CMakeFiles/CMakeTmp'
make[1]: *** [Makefile:121: cmTC_45d59/fast] Error 2
make[1]: Leaving directory '/home/vagrant/slave/monero-static-win64/build/build/release/CMakeFiles/CMakeTmp'


Determining if the function setreuid exists failed with the following output:
Change Dir: C:/msys64/home/vagrant/slave/monero-static-win64/build/build/release/CMakeFiles/CMakeTmp

Run Build Command:"C:/msys64/usr/bin/make.exe" "cmTC_49cdc/fast"
make[1]: Entering directory '/home/vagrant/slave/monero-static-win64/build/build/release/CMakeFiles/CMakeTmp'
/usr/bin/make -f CMakeFiles/cmTC_49cdc.dir/build.make CMakeFiles/cmTC_49cdc.dir/build
make[2]: Entering directory '/home/vagrant/slave/monero-static-win64/build/build/release/CMakeFiles/CMakeTmp'
Building C object CMakeFiles/cmTC_49cdc.dir/CheckFunctionExists.c.obj

/C/msys64/mingw64/bin/x86_64-w64-mingw32-gcc.exe   -DCHECK_FUNCTION_EXISTS=setreuid   -o CMakeFiles/cmTC_49cdc.dir/CheckFunctionExists.c.obj   -c /C/msys64/mingw64/share/cmake-3.12/Modules/CheckFunctionExists.c
Linking C executable cmTC_49cdc.exe

/C/msys64/mingw64/bin/cmake.exe -E remove -f CMakeFiles/cmTC_49cdc.dir/objects.a
ar cr CMakeFiles/cmTC_49cdc.dir/objects.a "CMakeFiles/cmTC_49cdc.dir/CheckFunctionExists.c.obj" 
/C/msys64/mingw64/bin/x86_64-w64-mingw32-gcc.exe  -DCHECK_FUNCTION_EXISTS=setreuid    -Wl,--whole-archive CMakeFiles/cmTC_49cdc.dir/objects.a -Wl,--no-whole-archive  -o cmTC_49cdc.exe -Wl,--major-image-version,0,--minor-image-version,0 -liphlpapi -lws2_32 -lkernel32 -luser32 -lgdi32 -lwinspool -lshell32 -lole32 -loleaut32 -luuid -lcomdlg32 -ladvapi32 
CMakeFiles/cmTC_49cdc.dir/objects.a(CheckFunctionExists.c.obj):CheckFunctionExists.c:(.text+0x15): undefined reference to `setreuid'

collect2.exe: error: ld returned 1 exit status
make[2]: *** [CMakeFiles/cmTC_49cdc.dir/build.make:88: cmTC_49cdc.exe] Error 1
make[2]: Leaving directory '/home/vagrant/slave/monero-static-win64/build/build/release/CMakeFiles/CMakeTmp'
make[1]: *** [Makefile:121: cmTC_49cdc/fast] Error 2
make[1]: Leaving directory '/home/vagrant/slave/monero-static-win64/build/build/release/CMakeFiles/CMakeTmp'


Determining if the function setrlimit exists failed with the following output:
Change Dir: C:/msys64/home/vagrant/slave/monero-static-win64/build/build/release/CMakeFiles/CMakeTmp

Run Build Command:"C:/msys64/usr/bin/make.exe" "cmTC_c1e6b/fast"
make[1]: Entering directory '/home/vagrant/slave/monero-static-win64/build/build/release/CMakeFiles/CMakeTmp'
/usr/bin/make -f CMakeFiles/cmTC_c1e6b.dir/build.make CMakeFiles/cmTC_c1e6b.dir/build
make[2]: Entering directory '/home/vagrant/slave/monero-static-win64/build/build/release/CMakeFiles/CMakeTmp'
Building C object CMakeFiles/cmTC_c1e6b.dir/CheckFunctionExists.c.obj

/C/msys64/mingw64/bin/x86_64-w64-mingw32-gcc.exe   -DCHECK_FUNCTION_EXISTS=setrlimit   -o CMakeFiles/cmTC_c1e6b.dir/CheckFunctionExists.c.obj   -c /C/msys64/mingw64/share/cmake-3.12/Modules/CheckFunctionExists.c
Linking C executable cmTC_c1e6b.exe

/C/msys64/mingw64/bin/cmake.exe -E remove -f CMakeFiles/cmTC_c1e6b.dir/objects.a
ar cr CMakeFiles/cmTC_c1e6b.dir/objects.a "CMakeFiles/cmTC_c1e6b.dir/CheckFunctionExists.c.obj" 
/C/msys64/mingw64/bin/x86_64-w64-mingw32-gcc.exe  -DCHECK_FUNCTION_EXISTS=setrlimit    -Wl,--whole-archive CMakeFiles/cmTC_c1e6b.dir/objects.a -Wl,--no-whole-archive  -o cmTC_c1e6b.exe -Wl,--major-image-version,0,--minor-image-version,0 -liphlpapi -lws2_32 -lkernel32 -luser32 -lgdi32 -lwinspool -lshell32 -lole32 -loleaut32 -luuid -lcomdlg32 -ladvapi32 
CMakeFiles/cmTC_c1e6b.dir/objects.a(CheckFunctionExists.c.obj):CheckFunctionExists.c:(.text+0x15): undefined reference to `setrlimit'

collect2.exe: error: ld returned 1 exit status
make[2]: *** [CMakeFiles/cmTC_c1e6b.dir/build.make:88: cmTC_c1e6b.exe] Error 1
make[2]: Leaving directory '/home/vagrant/slave/monero-static-win64/build/build/release/CMakeFiles/CMakeTmp'
make[1]: *** [Makefile:121: cmTC_c1e6b/fast] Error 2
make[1]: Leaving directory '/home/vagrant/slave/monero-static-win64/build/build/release/CMakeFiles/CMakeTmp'


Determining if the function setsid exists failed with the following output:
Change Dir: C:/msys64/home/vagrant/slave/monero-static-win64/build/build/release/CMakeFiles/CMakeTmp

Run Build Command:"C:/msys64/usr/bin/make.exe" "cmTC_2623f/fast"
make[1]: Entering directory '/home/vagrant/slave/monero-static-win64/build/build/release/CMakeFiles/CMakeTmp'
/usr/bin/make -f CMakeFiles/cmTC_2623f.dir/build.make CMakeFiles/cmTC_2623f.dir/build
make[2]: Entering directory '/home/vagrant/slave/monero-static-win64/build/build/release/CMakeFiles/CMakeTmp'
Building C object CMakeFiles/cmTC_2623f.dir/CheckFunctionExists.c.obj

/C/msys64/mingw64/bin/x86_64-w64-mingw32-gcc.exe   -DCHECK_FUNCTION_EXISTS=setsid   -o CMakeFiles/cmTC_2623f.dir/CheckFunctionExists.c.obj   -c /C/msys64/mingw64/share/cmake-3.12/Modules/CheckFunctionExists.c
Linking C executable cmTC_2623f.exe

/C/msys64/mingw64/bin/cmake.exe -E remove -f CMakeFiles/cmTC_2623f.dir/objects.a
ar cr CMakeFiles/cmTC_2623f.dir/objects.a "CMakeFiles/cmTC_2623f.dir/CheckFunctionExists.c.obj" 
/C/msys64/mingw64/bin/x86_64-w64-mingw32-gcc.exe  -DCHECK_FUNCTION_EXISTS=setsid    -Wl,--whole-archive CMakeFiles/cmTC_2623f.dir/objects.a -Wl,--no-whole-archive  -o cmTC_2623f.exe -Wl,--major-image-version,0,--minor-image-version,0 -liphlpapi -lws2_32 -lkernel32 -luser32 -lgdi32 -lwinspool -lshell32 -lole32 -loleaut32 -luuid -lcomdlg32 -ladvapi32 
CMakeFiles/cmTC_2623f.dir/objects.a(CheckFunctionExists.c.obj):CheckFunctionExists.c:(.text+0x15): undefined reference to `setsid'

collect2.exe: error: ld returned 1 exit status
make[2]: *** [CMakeFiles/cmTC_2623f.dir/build.make:88: cmTC_2623f.exe] Error 1
make[2]: Leaving directory '/home/vagrant/slave/monero-static-win64/build/build/release/CMakeFiles/CMakeTmp'
make[1]: *** [Makefile:121: cmTC_2623f/fast] Error 2
make[1]: Leaving directory '/home/vagrant/slave/monero-static-win64/build/build/release/CMakeFiles/CMakeTmp'


Determining if the function setusercontent exists failed with the following output:
Change Dir: C:/msys64/home/vagrant/slave/monero-static-win64/build/build/release/CMakeFiles/CMakeTmp

Run Build Command:"C:/msys64/usr/bin/make.exe" "cmTC_0bd5a/fast"
make[1]: Entering directory '/home/vagrant/slave/monero-static-win64/build/build/release/CMakeFiles/CMakeTmp'
/usr/bin/make -f CMakeFiles/cmTC_0bd5a.dir/build.make CMakeFiles/cmTC_0bd5a.dir/build
make[2]: Entering directory '/home/vagrant/slave/monero-static-win64/build/build/release/CMakeFiles/CMakeTmp'
Building C object CMakeFiles/cmTC_0bd5a.dir/CheckFunctionExists.c.obj

/C/msys64/mingw64/bin/x86_64-w64-mingw32-gcc.exe   -DCHECK_FUNCTION_EXISTS=setusercontent   -o CMakeFiles/cmTC_0bd5a.dir/CheckFunctionExists.c.obj   -c /C/msys64/mingw64/share/cmake-3.12/Modules/CheckFunctionExists.c
Linking C executable cmTC_0bd5a.exe

/C/msys64/mingw64/bin/cmake.exe -E remove -f CMakeFiles/cmTC_0bd5a.dir/objects.a
ar cr CMakeFiles/cmTC_0bd5a.dir/objects.a "CMakeFiles/cmTC_0bd5a.dir/CheckFunctionExists.c.obj" 
/C/msys64/mingw64/bin/x86_64-w64-mingw32-gcc.exe  -DCHECK_FUNCTION_EXISTS=setusercontent    -Wl,--whole-archive CMakeFiles/cmTC_0bd5a.dir/objects.a -Wl,--no-whole-archive  -o cmTC_0bd5a.exe -Wl,--major-image-version,0,--minor-image-version,0 -liphlpapi -lws2_32 -lkernel32 -luser32 -lgdi32 -lwinspool -lshell32 -lole32 -loleaut32 -luuid -lcomdlg32 -ladvapi32 
CMakeFiles/cmTC_0bd5a.dir/objects.a(CheckFunctionExists.c.obj):CheckFunctionExists.c:(.text+0x15): undefined reference to `setusercontent'

collect2.exe: error: ld returned 1 exit status
make[2]: *** [CMakeFiles/cmTC_0bd5a.dir/build.make:88: cmTC_0bd5a.exe] Error 1
make[2]: Leaving directory '/home/vagrant/slave/monero-static-win64/build/build/release/CMakeFiles/CMakeTmp'
make[1]: *** [Makefile:121: cmTC_0bd5a/fast] Error 2
make[1]: Leaving directory '/home/vagrant/slave/monero-static-win64/build/build/release/CMakeFiles/CMakeTmp'


Determining if the function sigprocmask exists failed with the following output:
Change Dir: C:/msys64/home/vagrant/slave/monero-static-win64/build/build/release/CMakeFiles/CMakeTmp

Run Build Command:"C:/msys64/usr/bin/make.exe" "cmTC_57feb/fast"
make[1]: Entering directory '/home/vagrant/slave/monero-static-win64/build/build/release/CMakeFiles/CMakeTmp'
/usr/bin/make -f CMakeFiles/cmTC_57feb.dir/build.make CMakeFiles/cmTC_57feb.dir/build
make[2]: Entering directory '/home/vagrant/slave/monero-static-win64/build/build/release/CMakeFiles/CMakeTmp'
Building C object CMakeFiles/cmTC_57feb.dir/CheckFunctionExists.c.obj

/C/msys64/mingw64/bin/x86_64-w64-mingw32-gcc.exe   -DCHECK_FUNCTION_EXISTS=sigprocmask   -o CMakeFiles/cmTC_57feb.dir/CheckFunctionExists.c.obj   -c /C/msys64/mingw64/share/cmake-3.12/Modules/CheckFunctionExists.c
Linking C executable cmTC_57feb.exe

/C/msys64/mingw64/bin/cmake.exe -E remove -f CMakeFiles/cmTC_57feb.dir/objects.a
ar cr CMakeFiles/cmTC_57feb.dir/objects.a "CMakeFiles/cmTC_57feb.dir/CheckFunctionExists.c.obj" 
/C/msys64/mingw64/bin/x86_64-w64-mingw32-gcc.exe  -DCHECK_FUNCTION_EXISTS=sigprocmask    -Wl,--whole-archive CMakeFiles/cmTC_57feb.dir/objects.a -Wl,--no-whole-archive  -o cmTC_57feb.exe -Wl,--major-image-version,0,--minor-image-version,0 -liphlpapi -lws2_32 -lkernel32 -luser32 -lgdi32 -lwinspool -lshell32 -lole32 -loleaut32 -luuid -lcomdlg32 -ladvapi32 
CMakeFiles/cmTC_57feb.dir/objects.a(CheckFunctionExists.c.obj):CheckFunctionExists.c:(.text+0x15): undefined reference to `sigprocmask'

collect2.exe: error: ld returned 1 exit status
make[2]: *** [CMakeFiles/cmTC_57feb.dir/build.make:88: cmTC_57feb.exe] Error 1
make[2]: Leaving directory '/home/vagrant/slave/monero-static-win64/build/build/release/CMakeFiles/CMakeTmp'
make[1]: *** [Makefile:121: cmTC_57feb/fast] Error 2
make[1]: Leaving directory '/home/vagrant/slave/monero-static-win64/build/build/release/CMakeFiles/CMakeTmp'


Determining if the function socketpair exists failed with the following output:
Change Dir: C:/msys64/home/vagrant/slave/monero-static-win64/build/build/release/CMakeFiles/CMakeTmp

Run Build Command:"C:/msys64/usr/bin/make.exe" "cmTC_2808b/fast"
make[1]: Entering directory '/home/vagrant/slave/monero-static-win64/build/build/release/CMakeFiles/CMakeTmp'
/usr/bin/make -f CMakeFiles/cmTC_2808b.dir/build.make CMakeFiles/cmTC_2808b.dir/build
make[2]: Entering directory '/home/vagrant/slave/monero-static-win64/build/build/release/CMakeFiles/CMakeTmp'
Building C object CMakeFiles/cmTC_2808b.dir/CheckFunctionExists.c.obj

/C/msys64/mingw64/bin/x86_64-w64-mingw32-gcc.exe   -DCHECK_FUNCTION_EXISTS=socketpair   -o CMakeFiles/cmTC_2808b.dir/CheckFunctionExists.c.obj   -c /C/msys64/mingw64/share/cmake-3.12/Modules/CheckFunctionExists.c
Linking C executable cmTC_2808b.exe

/C/msys64/mingw64/bin/cmake.exe -E remove -f CMakeFiles/cmTC_2808b.dir/objects.a
ar cr CMakeFiles/cmTC_2808b.dir/objects.a "CMakeFiles/cmTC_2808b.dir/CheckFunctionExists.c.obj" 
/C/msys64/mingw64/bin/x86_64-w64-mingw32-gcc.exe  -DCHECK_FUNCTION_EXISTS=socketpair    -Wl,--whole-archive CMakeFiles/cmTC_2808b.dir/objects.a -Wl,--no-whole-archive  -o cmTC_2808b.exe -Wl,--major-image-version,0,--minor-image-version,0 -liphlpapi -lws2_32 -lkernel32 -luser32 -lgdi32 -lwinspool -lshell32 -lole32 -loleaut32 -luuid -lcomdlg32 -ladvapi32 
CMakeFiles/cmTC_2808b.dir/objects.a(CheckFunctionExists.c.obj):CheckFunctionExists.c:(.text+0x15): undefined reference to `socketpair'

collect2.exe: error: ld returned 1 exit status
make[2]: *** [CMakeFiles/cmTC_2808b.dir/build.make:88: cmTC_2808b.exe] Error 1
make[2]: Leaving directory '/home/vagrant/slave/monero-static-win64/build/build/release/CMakeFiles/CMakeTmp'
make[1]: *** [Makefile:121: cmTC_2808b/fast] Error 2
make[1]: Leaving directory '/home/vagrant/slave/monero-static-win64/build/build/release/CMakeFiles/CMakeTmp'


Determining if the function srandom exists failed with the following output:
Change Dir: C:/msys64/home/vagrant/slave/monero-static-win64/build/build/release/CMakeFiles/CMakeTmp

Run Build Command:"C:/msys64/usr/bin/make.exe" "cmTC_b29c8/fast"
make[1]: Entering directory '/home/vagrant/slave/monero-static-win64/build/build/release/CMakeFiles/CMakeTmp'
/usr/bin/make -f CMakeFiles/cmTC_b29c8.dir/build.make CMakeFiles/cmTC_b29c8.dir/build
make[2]: Entering directory '/home/vagrant/slave/monero-static-win64/build/build/release/CMakeFiles/CMakeTmp'
Building C object CMakeFiles/cmTC_b29c8.dir/CheckFunctionExists.c.obj

/C/msys64/mingw64/bin/x86_64-w64-mingw32-gcc.exe   -DCHECK_FUNCTION_EXISTS=srandom   -o CMakeFiles/cmTC_b29c8.dir/CheckFunctionExists.c.obj   -c /C/msys64/mingw64/share/cmake-3.12/Modules/CheckFunctionExists.c
Linking C executable cmTC_b29c8.exe

/C/msys64/mingw64/bin/cmake.exe -E remove -f CMakeFiles/cmTC_b29c8.dir/objects.a
ar cr CMakeFiles/cmTC_b29c8.dir/objects.a "CMakeFiles/cmTC_b29c8.dir/CheckFunctionExists.c.obj" 
/C/msys64/mingw64/bin/x86_64-w64-mingw32-gcc.exe  -DCHECK_FUNCTION_EXISTS=srandom    -Wl,--whole-archive CMakeFiles/cmTC_b29c8.dir/objects.a -Wl,--no-whole-archive  -o cmTC_b29c8.exe -Wl,--major-image-version,0,--minor-image-version,0 -liphlpapi -lws2_32 -lkernel32 -luser32 -lgdi32 -lwinspool -lshell32 -lole32 -loleaut32 -luuid -lcomdlg32 -ladvapi32 
CMakeFiles/cmTC_b29c8.dir/objects.a(CheckFunctionExists.c.obj):CheckFunctionExists.c:(.text+0x15): undefined reference to `srandom'

collect2.exe: error: ld returned 1 exit status
make[2]: *** [CMakeFiles/cmTC_b29c8.dir/build.make:88: cmTC_b29c8.exe] Error 1
make[2]: Leaving directory '/home/vagrant/slave/monero-static-win64/build/build/release/CMakeFiles/CMakeTmp'
make[1]: *** [Makefile:121: cmTC_b29c8/fast] Error 2
make[1]: Leaving directory '/home/vagrant/slave/monero-static-win64/build/build/release/CMakeFiles/CMakeTmp'


Determining if the function strsep exists failed with the following output:
Change Dir: C:/msys64/home/vagrant/slave/monero-static-win64/build/build/release/CMakeFiles/CMakeTmp

Run Build Command:"C:/msys64/usr/bin/make.exe" "cmTC_00ac0/fast"
make[1]: Entering directory '/home/vagrant/slave/monero-static-win64/build/build/release/CMakeFiles/CMakeTmp'
/usr/bin/make -f CMakeFiles/cmTC_00ac0.dir/build.make CMakeFiles/cmTC_00ac0.dir/build
make[2]: Entering directory '/home/vagrant/slave/monero-static-win64/build/build/release/CMakeFiles/CMakeTmp'
Building C object CMakeFiles/cmTC_00ac0.dir/CheckFunctionExists.c.obj

/C/msys64/mingw64/bin/x86_64-w64-mingw32-gcc.exe   -DCHECK_FUNCTION_EXISTS=strsep   -o CMakeFiles/cmTC_00ac0.dir/CheckFunctionExists.c.obj   -c /C/msys64/mingw64/share/cmake-3.12/Modules/CheckFunctionExists.c
Linking C executable cmTC_00ac0.exe

/C/msys64/mingw64/bin/cmake.exe -E remove -f CMakeFiles/cmTC_00ac0.dir/objects.a
ar cr CMakeFiles/cmTC_00ac0.dir/objects.a "CMakeFiles/cmTC_00ac0.dir/CheckFunctionExists.c.obj" 
/C/msys64/mingw64/bin/x86_64-w64-mingw32-gcc.exe  -DCHECK_FUNCTION_EXISTS=strsep    -Wl,--whole-archive CMakeFiles/cmTC_00ac0.dir/objects.a -Wl,--no-whole-archive  -o cmTC_00ac0.exe -Wl,--major-image-version,0,--minor-image-version,0 -liphlpapi -lws2_32 -lkernel32 -luser32 -lgdi32 -lwinspool -lshell32 -lole32 -loleaut32 -luuid -lcomdlg32 -ladvapi32 
CMakeFiles/cmTC_00ac0.dir/objects.a(CheckFunctionExists.c.obj):CheckFunctionExists.c:(.text+0x15): undefined reference to `strsep'

collect2.exe: error: ld returned 1 exit status
make[2]: *** [CMakeFiles/cmTC_00ac0.dir/build.make:88: cmTC_00ac0.exe] Error 1
make[2]: Leaving directory '/home/vagrant/slave/monero-static-win64/build/build/release/CMakeFiles/CMakeTmp'
make[1]: *** [Makefile:121: cmTC_00ac0/fast] Error 2
make[1]: Leaving directory '/home/vagrant/slave/monero-static-win64/build/build/release/CMakeFiles/CMakeTmp'


Determining if the function strlcat exists failed with the following output:
Change Dir: C:/msys64/home/vagrant/slave/monero-static-win64/build/build/release/CMakeFiles/CMakeTmp

Run Build Command:"C:/msys64/usr/bin/make.exe" "cmTC_e82f7/fast"
make[1]: Entering directory '/home/vagrant/slave/monero-static-win64/build/build/release/CMakeFiles/CMakeTmp'
/usr/bin/make -f CMakeFiles/cmTC_e82f7.dir/build.make CMakeFiles/cmTC_e82f7.dir/build
make[2]: Entering directory '/home/vagrant/slave/monero-static-win64/build/build/release/CMakeFiles/CMakeTmp'
Building C object CMakeFiles/cmTC_e82f7.dir/CheckFunctionExists.c.obj

/C/msys64/mingw64/bin/x86_64-w64-mingw32-gcc.exe   -DCHECK_FUNCTION_EXISTS=strlcat   -o CMakeFiles/cmTC_e82f7.dir/CheckFunctionExists.c.obj   -c /C/msys64/mingw64/share/cmake-3.12/Modules/CheckFunctionExists.c
Linking C executable cmTC_e82f7.exe

/C/msys64/mingw64/bin/cmake.exe -E remove -f CMakeFiles/cmTC_e82f7.dir/objects.a
ar cr CMakeFiles/cmTC_e82f7.dir/objects.a "CMakeFiles/cmTC_e82f7.dir/CheckFunctionExists.c.obj" 
/C/msys64/mingw64/bin/x86_64-w64-mingw32-gcc.exe  -DCHECK_FUNCTION_EXISTS=strlcat    -Wl,--whole-archive CMakeFiles/cmTC_e82f7.dir/objects.a -Wl,--no-whole-archive  -o cmTC_e82f7.exe -Wl,--major-image-version,0,--minor-image-version,0 -liphlpapi -lws2_32 -lkernel32 -luser32 -lgdi32 -lwinspool -lshell32 -lole32 -loleaut32 -luuid -lcomdlg32 -ladvapi32 
CMakeFiles/cmTC_e82f7.dir/objects.a(CheckFunctionExists.c.obj):CheckFunctionExists.c:(.text+0x15): undefined reference to `strlcat'

collect2.exe: error: ld returned 1 exit status
make[2]: *** [CMakeFiles/cmTC_e82f7.dir/build.make:88: cmTC_e82f7.exe] Error 1
make[2]: Leaving directory '/home/vagrant/slave/monero-static-win64/build/build/release/CMakeFiles/CMakeTmp'
make[1]: *** [Makefile:121: cmTC_e82f7/fast] Error 2
make[1]: Leaving directory '/home/vagrant/slave/monero-static-win64/build/build/release/CMakeFiles/CMakeTmp'


Determining if the function strlcpy exists failed with the following output:
Change Dir: C:/msys64/home/vagrant/slave/monero-static-win64/build/build/release/CMakeFiles/CMakeTmp

Run Build Command:"C:/msys64/usr/bin/make.exe" "cmTC_ba37d/fast"
make[1]: Entering directory '/home/vagrant/slave/monero-static-win64/build/build/release/CMakeFiles/CMakeTmp'
/usr/bin/make -f CMakeFiles/cmTC_ba37d.dir/build.make CMakeFiles/cmTC_ba37d.dir/build
make[2]: Entering directory '/home/vagrant/slave/monero-static-win64/build/build/release/CMakeFiles/CMakeTmp'
Building C object CMakeFiles/cmTC_ba37d.dir/CheckFunctionExists.c.obj

/C/msys64/mingw64/bin/x86_64-w64-mingw32-gcc.exe   -DCHECK_FUNCTION_EXISTS=strlcpy   -o CMakeFiles/cmTC_ba37d.dir/CheckFunctionExists.c.obj   -c /C/msys64/mingw64/share/cmake-3.12/Modules/CheckFunctionExists.c
Linking C executable cmTC_ba37d.exe

/C/msys64/mingw64/bin/cmake.exe -E remove -f CMakeFiles/cmTC_ba37d.dir/objects.a
ar cr CMakeFiles/cmTC_ba37d.dir/objects.a "CMakeFiles/cmTC_ba37d.dir/CheckFunctionExists.c.obj" 
/C/msys64/mingw64/bin/x86_64-w64-mingw32-gcc.exe  -DCHECK_FUNCTION_EXISTS=strlcpy    -Wl,--whole-archive CMakeFiles/cmTC_ba37d.dir/objects.a -Wl,--no-whole-archive  -o cmTC_ba37d.exe -Wl,--major-image-version,0,--minor-image-version,0 -liphlpapi -lws2_32 -lkernel32 -luser32 -lgdi32 -lwinspool -lshell32 -lole32 -loleaut32 -luuid -lcomdlg32 -ladvapi32 
CMakeFiles/cmTC_ba37d.dir/objects.a(CheckFunctionExists.c.obj):CheckFunctionExists.c:(.text+0x15): undefined reference to `strlcpy'

collect2.exe: error: ld returned 1 exit status
make[2]: *** [CMakeFiles/cmTC_ba37d.dir/build.make:88: cmTC_ba37d.exe] Error 1
make[2]: Leaving directory '/home/vagrant/slave/monero-static-win64/build/build/release/CMakeFiles/CMakeTmp'
make[1]: *** [Makefile:121: cmTC_ba37d/fast] Error 2
make[1]: Leaving directory '/home/vagrant/slave/monero-static-win64/build/build/release/CMakeFiles/CMakeTmp'


Determining if the function strptime exists failed with the following output:
Change Dir: C:/msys64/home/vagrant/slave/monero-static-win64/build/build/release/CMakeFiles/CMakeTmp

Run Build Command:"C:/msys64/usr/bin/make.exe" "cmTC_abe5e/fast"
make[1]: Entering directory '/home/vagrant/slave/monero-static-win64/build/build/release/CMakeFiles/CMakeTmp'
/usr/bin/make -f CMakeFiles/cmTC_abe5e.dir/build.make CMakeFiles/cmTC_abe5e.dir/build
make[2]: Entering directory '/home/vagrant/slave/monero-static-win64/build/build/release/CMakeFiles/CMakeTmp'
Building C object CMakeFiles/cmTC_abe5e.dir/CheckFunctionExists.c.obj

/C/msys64/mingw64/bin/x86_64-w64-mingw32-gcc.exe   -DCHECK_FUNCTION_EXISTS=strptime   -o CMakeFiles/cmTC_abe5e.dir/CheckFunctionExists.c.obj   -c /C/msys64/mingw64/share/cmake-3.12/Modules/CheckFunctionExists.c
Linking C executable cmTC_abe5e.exe

/C/msys64/mingw64/bin/cmake.exe -E remove -f CMakeFiles/cmTC_abe5e.dir/objects.a
ar cr CMakeFiles/cmTC_abe5e.dir/objects.a "CMakeFiles/cmTC_abe5e.dir/CheckFunctionExists.c.obj" 
/C/msys64/mingw64/bin/x86_64-w64-mingw32-gcc.exe  -DCHECK_FUNCTION_EXISTS=strptime    -Wl,--whole-archive CMakeFiles/cmTC_abe5e.dir/objects.a -Wl,--no-whole-archive  -o cmTC_abe5e.exe -Wl,--major-image-version,0,--minor-image-version,0 -liphlpapi -lws2_32 -lkernel32 -luser32 -lgdi32 -lwinspool -lshell32 -lole32 -loleaut32 -luuid -lcomdlg32 -ladvapi32 
CMakeFiles/cmTC_abe5e.dir/objects.a(CheckFunctionExists.c.obj):CheckFunctionExists.c:(.text+0x15): undefined reference to `strptime'

collect2.exe: error: ld returned 1 exit status
make[2]: *** [CMakeFiles/cmTC_abe5e.dir/build.make:88: cmTC_abe5e.exe] Error 1
make[2]: Leaving directory '/home/vagrant/slave/monero-static-win64/build/build/release/CMakeFiles/CMakeTmp'
make[1]: *** [Makefile:121: cmTC_abe5e/fast] Error 2
make[1]: Leaving directory '/home/vagrant/slave/monero-static-win64/build/build/release/CMakeFiles/CMakeTmp'


Determining if the function writev exists failed with the following output:
Change Dir: C:/msys64/home/vagrant/slave/monero-static-win64/build/build/release/CMakeFiles/CMakeTmp

Run Build Command:"C:/msys64/usr/bin/make.exe" "cmTC_b4edc/fast"
make[1]: Entering directory '/home/vagrant/slave/monero-static-win64/build/build/release/CMakeFiles/CMakeTmp'
/usr/bin/make -f CMakeFiles/cmTC_b4edc.dir/build.make CMakeFiles/cmTC_b4edc.dir/build
make[2]: Entering directory '/home/vagrant/slave/monero-static-win64/build/build/release/CMakeFiles/CMakeTmp'
Building C object CMakeFiles/cmTC_b4edc.dir/CheckFunctionExists.c.obj

/C/msys64/mingw64/bin/x86_64-w64-mingw32-gcc.exe   -DCHECK_FUNCTION_EXISTS=writev   -o CMakeFiles/cmTC_b4edc.dir/CheckFunctionExists.c.obj   -c /C/msys64/mingw64/share/cmake-3.12/Modules/CheckFunctionExists.c
Linking C executable cmTC_b4edc.exe

/C/msys64/mingw64/bin/cmake.exe -E remove -f CMakeFiles/cmTC_b4edc.dir/objects.a
ar cr CMakeFiles/cmTC_b4edc.dir/objects.a "CMakeFiles/cmTC_b4edc.dir/CheckFunctionExists.c.obj" 
/C/msys64/mingw64/bin/x86_64-w64-mingw32-gcc.exe  -DCHECK_FUNCTION_EXISTS=writev    -Wl,--whole-archive CMakeFiles/cmTC_b4edc.dir/objects.a -Wl,--no-whole-archive  -o cmTC_b4edc.exe -Wl,--major-image-version,0,--minor-image-version,0 -liphlpapi -lws2_32 -lkernel32 -luser32 -lgdi32 -lwinspool -lshell32 -lole32 -loleaut32 -luuid -lcomdlg32 -ladvapi32 
CMakeFiles/cmTC_b4edc.dir/objects.a(CheckFunctionExists.c.obj):CheckFunctionExists.c:(.text+0x15): undefined reference to `writev'

collect2.exe: error: ld returned 1 exit status
make[2]: *** [CMakeFiles/cmTC_b4edc.dir/build.make:88: cmTC_b4edc.exe] Error 1
make[2]: Leaving directory '/home/vagrant/slave/monero-static-win64/build/build/release/CMakeFiles/CMakeTmp'
make[1]: *** [Makefile:121: cmTC_b4edc/fast] Error 2
make[1]: Leaving directory '/home/vagrant/slave/monero-static-win64/build/build/release/CMakeFiles/CMakeTmp'


Determining size of gid_t failed with the following output:
Change Dir: C:/msys64/home/vagrant/slave/monero-static-win64/build/build/release/CMakeFiles/CMakeTmp

Run Build Command:"C:/msys64/usr/bin/make.exe" "cmTC_9c4c1/fast"
make[1]: Entering directory '/home/vagrant/slave/monero-static-win64/build/build/release/CMakeFiles/CMakeTmp'
/usr/bin/make -f CMakeFiles/cmTC_9c4c1.dir/build.make CMakeFiles/cmTC_9c4c1.dir/build
make[2]: Entering directory '/home/vagrant/slave/monero-static-win64/build/build/release/CMakeFiles/CMakeTmp'
Building C object CMakeFiles/cmTC_9c4c1.dir/gid_t.c.obj

/C/msys64/mingw64/bin/x86_64-w64-mingw32-gcc.exe    -o CMakeFiles/cmTC_9c4c1.dir/gid_t.c.obj   -c /C/msys64/home/vagrant/slave/monero-static-win64/build/build/release/CMakeFiles/CheckTypeSize/gid_t.c
C:/msys64/home/vagrant/slave/monero-static-win64/build/build/release/CMakeFiles/CheckTypeSize/gid_t.c:24:22: error: 'gid_t' undeclared here (not in a function); did you mean 'pid_t'?
 #define SIZE (sizeof(gid_t))
                      ^~~~~
C:/msys64/home/vagrant/slave/monero-static-win64/build/build/release/CMakeFiles/CheckTypeSize/gid_t.c:26:12: note: in expansion of macro 'SIZE'
   ('0' + ((SIZE / 10000)%10)),
            ^~~~
make[2]: *** [CMakeFiles/cmTC_9c4c1.dir/build.make:66: CMakeFiles/cmTC_9c4c1.dir/gid_t.c.obj] Error 1
make[2]: Leaving directory '/home/vagrant/slave/monero-static-win64/build/build/release/CMakeFiles/CMakeTmp'
make[1]: *** [Makefile:121: cmTC_9c4c1/fast] Error 2
make[1]: Leaving directory '/home/vagrant/slave/monero-static-win64/build/build/release/CMakeFiles/CMakeTmp'

C:/msys64/home/vagrant/slave/monero-static-win64/build/build/release/CMakeFiles/CheckTypeSize/gid_t.c:
#include <sys/types.h>
#include <stdint.h>
#include <stddef.h>
#include "sys/types.h"


#undef KEY
#if defined(__i386)
# define KEY '_','_','i','3','8','6'
#elif defined(__x86_64)
# define KEY '_','_','x','8','6','_','6','4'
#elif defined(__ppc__)
# define KEY '_','_','p','p','c','_','_'
#elif defined(__ppc64__)
# define KEY '_','_','p','p','c','6','4','_','_'
#elif defined(__aarch64__)
# define KEY '_','_','a','a','r','c','h','6','4','_','_'
#elif defined(__ARM_ARCH_7A__)
# define KEY '_','_','A','R','M','_','A','R','C','H','_','7','A','_','_'
#elif defined(__ARM_ARCH_7S__)
# define KEY '_','_','A','R','M','_','A','R','C','H','_','7','S','_','_'
#endif

#define SIZE (sizeof(gid_t))
char info_size[] =  {'I', 'N', 'F', 'O', ':', 's','i','z','e','[',
  ('0' + ((SIZE / 10000)%10)),
  ('0' + ((SIZE / 1000)%10)),
  ('0' + ((SIZE / 100)%10)),
  ('0' + ((SIZE / 10)%10)),
  ('0' +  (SIZE    % 10)),
  ']',
#ifdef KEY
  ' ','k','e','y','[', KEY, ']',
#endif
  '\0'};

#ifdef __CLASSIC_C__
int main(argc, argv) int argc; char *argv[];
#else
int main(int argc, char *argv[])
#endif
{
  int require = 0;
  require += info_size[argc];
  (void)argv;
  return require;
}


Determining size of in_addr_t failed with the following output:
Change Dir: C:/msys64/home/vagrant/slave/monero-static-win64/build/build/release/CMakeFiles/CMakeTmp

Run Build Command:"C:/msys64/usr/bin/make.exe" "cmTC_ff69c/fast"
make[1]: Entering directory '/home/vagrant/slave/monero-static-win64/build/build/release/CMakeFiles/CMakeTmp'
/usr/bin/make -f CMakeFiles/cmTC_ff69c.dir/build.make CMakeFiles/cmTC_ff69c.dir/build
make[2]: Entering directory '/home/vagrant/slave/monero-static-win64/build/build/release/CMakeFiles/CMakeTmp'
Building C object CMakeFiles/cmTC_ff69c.dir/in_addr_t.c.obj

/C/msys64/mingw64/bin/x86_64-w64-mingw32-gcc.exe    -o CMakeFiles/cmTC_ff69c.dir/in_addr_t.c.obj   -c /C/msys64/home/vagrant/slave/monero-static-win64/build/build/release/CMakeFiles/CheckTypeSize/in_addr_t.c
C:/msys64/home/vagrant/slave/monero-static-win64/build/build/release/CMakeFiles/CheckTypeSize/in_addr_t.c:4:10: fatal error: netinet/in.h: No such file or directory
 #include "netinet/in.h"
          ^~~~~~~~~~~~~~
compilation terminated.

make[2]: *** [CMakeFiles/cmTC_ff69c.dir/build.make:66: CMakeFiles/cmTC_ff69c.dir/in_addr_t.c.obj] Error 1
make[2]: Leaving directory '/home/vagrant/slave/monero-static-win64/build/build/release/CMakeFiles/CMakeTmp'
make[1]: *** [Makefile:121: cmTC_ff69c/fast] Error 2
make[1]: Leaving directory '/home/vagrant/slave/monero-static-win64/build/build/release/CMakeFiles/CMakeTmp'

C:/msys64/home/vagrant/slave/monero-static-win64/build/build/release/CMakeFiles/CheckTypeSize/in_addr_t.c:
#include <sys/types.h>
#include <stdint.h>
#include <stddef.h>
#include "netinet/in.h"


#undef KEY
#if defined(__i386)
# define KEY '_','_','i','3','8','6'
#elif defined(__x86_64)
# define KEY '_','_','x','8','6','_','6','4'
#elif defined(__ppc__)
# define KEY '_','_','p','p','c','_','_'
#elif defined(__ppc64__)
# define KEY '_','_','p','p','c','6','4','_','_'
#elif defined(__aarch64__)
# define KEY '_','_','a','a','r','c','h','6','4','_','_'
#elif defined(__ARM_ARCH_7A__)
# define KEY '_','_','A','R','M','_','A','R','C','H','_','7','A','_','_'
#elif defined(__ARM_ARCH_7S__)
# define KEY '_','_','A','R','M','_','A','R','C','H','_','7','S','_','_'
#endif

#define SIZE (sizeof(in_addr_t))
char info_size[] =  {'I', 'N', 'F', 'O', ':', 's','i','z','e','[',
  ('0' + ((SIZE / 10000)%10)),
  ('0' + ((SIZE / 1000)%10)),
  ('0' + ((SIZE / 100)%10)),
  ('0' + ((SIZE / 10)%10)),
  ('0' +  (SIZE    % 10)),
  ']',
#ifdef KEY
  ' ','k','e','y','[', KEY, ']',
#endif
  '\0'};

#ifdef __CLASSIC_C__
int main(argc, argv) int argc; char *argv[];
#else
int main(int argc, char *argv[])
#endif
{
  int require = 0;
  require += info_size[argc];
  (void)argv;
  return require;
}


Determining size of in_port_t failed with the following output:
Change Dir: C:/msys64/home/vagrant/slave/monero-static-win64/build/build/release/CMakeFiles/CMakeTmp

Run Build Command:"C:/msys64/usr/bin/make.exe" "cmTC_84afd/fast"
make[1]: Entering directory '/home/vagrant/slave/monero-static-win64/build/build/release/CMakeFiles/CMakeTmp'
/usr/bin/make -f CMakeFiles/cmTC_84afd.dir/build.make CMakeFiles/cmTC_84afd.dir/build
make[2]: Entering directory '/home/vagrant/slave/monero-static-win64/build/build/release/CMakeFiles/CMakeTmp'
Building C object CMakeFiles/cmTC_84afd.dir/in_port_t.c.obj

/C/msys64/mingw64/bin/x86_64-w64-mingw32-gcc.exe    -o CMakeFiles/cmTC_84afd.dir/in_port_t.c.obj   -c /C/msys64/home/vagrant/slave/monero-static-win64/build/build/release/CMakeFiles/CheckTypeSize/in_port_t.c
C:/msys64/home/vagrant/slave/monero-static-win64/build/build/release/CMakeFiles/CheckTypeSize/in_port_t.c:4:10: fatal error: netinet/in.h: No such file or directory
 #include "netinet/in.h"
          ^~~~~~~~~~~~~~
compilation terminated.

make[2]: *** [CMakeFiles/cmTC_84afd.dir/build.make:66: CMakeFiles/cmTC_84afd.dir/in_port_t.c.obj] Error 1
make[2]: Leaving directory '/home/vagrant/slave/monero-static-win64/build/build/release/CMakeFiles/CMakeTmp'
make[1]: *** [Makefile:121: cmTC_84afd/fast] Error 2
make[1]: Leaving directory '/home/vagrant/slave/monero-static-win64/build/build/release/CMakeFiles/CMakeTmp'

C:/msys64/home/vagrant/slave/monero-static-win64/build/build/release/CMakeFiles/CheckTypeSize/in_port_t.c:
#include <sys/types.h>
#include <stdint.h>
#include <stddef.h>
#include "netinet/in.h"


#undef KEY
#if defined(__i386)
# define KEY '_','_','i','3','8','6'
#elif defined(__x86_64)
# define KEY '_','_','x','8','6','_','6','4'
#elif defined(__ppc__)
# define KEY '_','_','p','p','c','_','_'
#elif defined(__ppc64__)
# define KEY '_','_','p','p','c','6','4','_','_'
#elif defined(__aarch64__)
# define KEY '_','_','a','a','r','c','h','6','4','_','_'
#elif defined(__ARM_ARCH_7A__)
# define KEY '_','_','A','R','M','_','A','R','C','H','_','7','A','_','_'
#elif defined(__ARM_ARCH_7S__)
# define KEY '_','_','A','R','M','_','A','R','C','H','_','7','S','_','_'
#endif

#define SIZE (sizeof(in_port_t))
char info_size[] =  {'I', 'N', 'F', 'O', ':', 's','i','z','e','[',
  ('0' + ((SIZE / 10000)%10)),
  ('0' + ((SIZE / 1000)%10)),
  ('0' + ((SIZE / 100)%10)),
  ('0' + ((SIZE / 10)%10)),
  ('0' +  (SIZE    % 10)),
  ']',
#ifdef KEY
  ' ','k','e','y','[', KEY, ']',
#endif
  '\0'};

#ifdef __CLASSIC_C__
int main(argc, argv) int argc; char *argv[];
#else
int main(int argc, char *argv[])
#endif
{
  int require = 0;
  require += info_size[argc];
  (void)argv;
  return require;
}


Determining size of rlim_t failed with the following output:
Change Dir: C:/msys64/home/vagrant/slave/monero-static-win64/build/build/release/CMakeFiles/CMakeTmp

Run Build Command:"C:/msys64/usr/bin/make.exe" "cmTC_5dfac/fast"
make[1]: Entering directory '/home/vagrant/slave/monero-static-win64/build/build/release/CMakeFiles/CMakeTmp'
/usr/bin/make -f CMakeFiles/cmTC_5dfac.dir/build.make CMakeFiles/cmTC_5dfac.dir/build
make[2]: Entering directory '/home/vagrant/slave/monero-static-win64/build/build/release/CMakeFiles/CMakeTmp'
Building C object CMakeFiles/cmTC_5dfac.dir/rlim_t.c.obj

/C/msys64/mingw64/bin/x86_64-w64-mingw32-gcc.exe    -o CMakeFiles/cmTC_5dfac.dir/rlim_t.c.obj   -c /C/msys64/home/vagrant/slave/monero-static-win64/build/build/release/CMakeFiles/CheckTypeSize/rlim_t.c
C:/msys64/home/vagrant/slave/monero-static-win64/build/build/release/CMakeFiles/CheckTypeSize/rlim_t.c:4:10: fatal error: sys/resource.h: No such file or directory
 #include "sys/resource.h"
          ^~~~~~~~~~~~~~~~
compilation terminated.

make[2]: *** [CMakeFiles/cmTC_5dfac.dir/build.make:66: CMakeFiles/cmTC_5dfac.dir/rlim_t.c.obj] Error 1
make[2]: Leaving directory '/home/vagrant/slave/monero-static-win64/build/build/release/CMakeFiles/CMakeTmp'
make[1]: *** [Makefile:121: cmTC_5dfac/fast] Error 2
make[1]: Leaving directory '/home/vagrant/slave/monero-static-win64/build/build/release/CMakeFiles/CMakeTmp'

C:/msys64/home/vagrant/slave/monero-static-win64/build/build/release/CMakeFiles/CheckTypeSize/rlim_t.c:
#include <sys/types.h>
#include <stdint.h>
#include <stddef.h>
#include "sys/resource.h"


#undef KEY
#if defined(__i386)
# define KEY '_','_','i','3','8','6'
#elif defined(__x86_64)
# define KEY '_','_','x','8','6','_','6','4'
#elif defined(__ppc__)
# define KEY '_','_','p','p','c','_','_'
#elif defined(__ppc64__)
# define KEY '_','_','p','p','c','6','4','_','_'
#elif defined(__aarch64__)
# define KEY '_','_','a','a','r','c','h','6','4','_','_'
#elif defined(__ARM_ARCH_7A__)
# define KEY '_','_','A','R','M','_','A','R','C','H','_','7','A','_','_'
#elif defined(__ARM_ARCH_7S__)
# define KEY '_','_','A','R','M','_','A','R','C','H','_','7','S','_','_'
#endif

#define SIZE (sizeof(rlim_t))
char info_size[] =  {'I', 'N', 'F', 'O', ':', 's','i','z','e','[',
  ('0' + ((SIZE / 10000)%10)),
  ('0' + ((SIZE / 1000)%10)),
  ('0' + ((SIZE / 100)%10)),
  ('0' + ((SIZE / 10)%10)),
  ('0' +  (SIZE    % 10)),
  ']',
#ifdef KEY
  ' ','k','e','y','[', KEY, ']',
#endif
  '\0'};

#ifdef __CLASSIC_C__
int main(argc, argv) int argc; char *argv[];
#else
int main(int argc, char *argv[])
#endif
{
  int require = 0;
  require += info_size[argc];
  (void)argv;
  return require;
}


Determining size of uid_t failed with the following output:
Change Dir: C:/msys64/home/vagrant/slave/monero-static-win64/build/build/release/CMakeFiles/CMakeTmp

Run Build Command:"C:/msys64/usr/bin/make.exe" "cmTC_6c00e/fast"
make[1]: Entering directory '/home/vagrant/slave/monero-static-win64/build/build/release/CMakeFiles/CMakeTmp'
/usr/bin/make -f CMakeFiles/cmTC_6c00e.dir/build.make CMakeFiles/cmTC_6c00e.dir/build
make[2]: Entering directory '/home/vagrant/slave/monero-static-win64/build/build/release/CMakeFiles/CMakeTmp'
Building C object CMakeFiles/cmTC_6c00e.dir/uid_t.c.obj

/C/msys64/mingw64/bin/x86_64-w64-mingw32-gcc.exe    -o CMakeFiles/cmTC_6c00e.dir/uid_t.c.obj   -c /C/msys64/home/vagrant/slave/monero-static-win64/build/build/release/CMakeFiles/CheckTypeSize/uid_t.c
C:/msys64/home/vagrant/slave/monero-static-win64/build/build/release/CMakeFiles/CheckTypeSize/uid_t.c:24:22: error: 'uid_t' undeclared here (not in a function); did you mean 'pid_t'?
 #define SIZE (sizeof(uid_t))
                      ^~~~~
C:/msys64/home/vagrant/slave/monero-static-win64/build/build/release/CMakeFiles/CheckTypeSize/uid_t.c:26:12: note: in expansion of macro 'SIZE'
   ('0' + ((SIZE / 10000)%10)),
            ^~~~
make[2]: *** [CMakeFiles/cmTC_6c00e.dir/build.make:66: CMakeFiles/cmTC_6c00e.dir/uid_t.c.obj] Error 1
make[2]: Leaving directory '/home/vagrant/slave/monero-static-win64/build/build/release/CMakeFiles/CMakeTmp'
make[1]: *** [Makefile:121: cmTC_6c00e/fast] Error 2
make[1]: Leaving directory '/home/vagrant/slave/monero-static-win64/build/build/release/CMakeFiles/CMakeTmp'

C:/msys64/home/vagrant/slave/monero-static-win64/build/build/release/CMakeFiles/CheckTypeSize/uid_t.c:
#include <sys/types.h>
#include <stdint.h>
#include <stddef.h>
#include "sys/types.h"


#undef KEY
#if defined(__i386)
# define KEY '_','_','i','3','8','6'
#elif defined(__x86_64)
# define KEY '_','_','x','8','6','_','6','4'
#elif defined(__ppc__)
# define KEY '_','_','p','p','c','_','_'
#elif defined(__ppc64__)
# define KEY '_','_','p','p','c','6','4','_','_'
#elif defined(__aarch64__)
# define KEY '_','_','a','a','r','c','h','6','4','_','_'
#elif defined(__ARM_ARCH_7A__)
# define KEY '_','_','A','R','M','_','A','R','C','H','_','7','A','_','_'
#elif defined(__ARM_ARCH_7S__)
# define KEY '_','_','A','R','M','_','A','R','C','H','_','7','S','_','_'
#endif

#define SIZE (sizeof(uid_t))
char info_size[] =  {'I', 'N', 'F', 'O', ':', 's','i','z','e','[',
  ('0' + ((SIZE / 10000)%10)),
  ('0' + ((SIZE / 1000)%10)),
  ('0' + ((SIZE / 100)%10)),
  ('0' + ((SIZE / 10)%10)),
  ('0' +  (SIZE    % 10)),
  ']',
#ifdef KEY
  ' ','k','e','y','[', KEY, ']',
#endif
  '\0'};

#ifdef __CLASSIC_C__
int main(argc, argv) int argc; char *argv[];
#else
int main(int argc, char *argv[])
#endif
{
  int require = 0;
  require += info_size[argc];
  (void)argv;
  return require;
}


Determining if the pthread_rwlock_t exist failed with the following output:
Change Dir: C:/msys64/home/vagrant/slave/monero-static-win64/build/build/release/CMakeFiles/CMakeTmp

Run Build Command:"C:/msys64/usr/bin/make.exe" "cmTC_8dbe5/fast"
make[1]: Entering directory '/home/vagrant/slave/monero-static-win64/build/build/release/CMakeFiles/CMakeTmp'
/usr/bin/make -f CMakeFiles/cmTC_8dbe5.dir/build.make CMakeFiles/cmTC_8dbe5.dir/build
make[2]: Entering directory '/home/vagrant/slave/monero-static-win64/build/build/release/CMakeFiles/CMakeTmp'
Building C object CMakeFiles/cmTC_8dbe5.dir/CheckSymbolExists.c.obj

/C/msys64/mingw64/bin/x86_64-w64-mingw32-gcc.exe    -o CMakeFiles/cmTC_8dbe5.dir/CheckSymbolExists.c.obj   -c /C/msys64/home/vagrant/slave/monero-static-win64/build/build/release/CMakeFiles/CMakeTmp/CheckSymbolExists.c
C:/msys64/home/vagrant/slave/monero-static-win64/build/build/release/CMakeFiles/CMakeTmp/CheckSymbolExists.c: In function 'main':
C:/msys64/home/vagrant/slave/monero-static-win64/build/build/release/CMakeFiles/CMakeTmp/CheckSymbolExists.c:8:19: error: expected expression before 'pthread_rwlock_t'
   return ((int*)(&pthread_rwlock_t))[argc];
                   ^~~~~~~~~~~~~~~~
make[2]: *** [CMakeFiles/cmTC_8dbe5.dir/build.make:66: CMakeFiles/cmTC_8dbe5.dir/CheckSymbolExists.c.obj] Error 1
make[2]: Leaving directory '/home/vagrant/slave/monero-static-win64/build/build/release/CMakeFiles/CMakeTmp'
make[1]: *** [Makefile:121: cmTC_8dbe5/fast] Error 2
make[1]: Leaving directory '/home/vagrant/slave/monero-static-win64/build/build/release/CMakeFiles/CMakeTmp'

File C:/msys64/home/vagrant/slave/monero-static-win64/build/build/release/CMakeFiles/CMakeTmp/CheckSymbolExists.c:
/* */
#include <pthread.h>

int main(int argc, char** argv)
{
  (void)argv;
#ifndef pthread_rwlock_t
  return ((int*)(&pthread_rwlock_t))[argc];
#else
  (void)argc;
  return 0;
#endif
}

Determining if the pthread_spinlock_t exist failed with the following output:
Change Dir: C:/msys64/home/vagrant/slave/monero-static-win64/build/build/release/CMakeFiles/CMakeTmp

Run Build Command:"C:/msys64/usr/bin/make.exe" "cmTC_ba2ef/fast"
make[1]: Entering directory '/home/vagrant/slave/monero-static-win64/build/build/release/CMakeFiles/CMakeTmp'
/usr/bin/make -f CMakeFiles/cmTC_ba2ef.dir/build.make CMakeFiles/cmTC_ba2ef.dir/build
make[2]: Entering directory '/home/vagrant/slave/monero-static-win64/build/build/release/CMakeFiles/CMakeTmp'
Building C object CMakeFiles/cmTC_ba2ef.dir/CheckSymbolExists.c.obj

/C/msys64/mingw64/bin/x86_64-w64-mingw32-gcc.exe    -o CMakeFiles/cmTC_ba2ef.dir/CheckSymbolExists.c.obj   -c /C/msys64/home/vagrant/slave/monero-static-win64/build/build/release/CMakeFiles/CMakeTmp/CheckSymbolExists.c
C:/msys64/home/vagrant/slave/monero-static-win64/build/build/release/CMakeFiles/CMakeTmp/CheckSymbolExists.c: In function 'main':
C:/msys64/home/vagrant/slave/monero-static-win64/build/build/release/CMakeFiles/CMakeTmp/CheckSymbolExists.c:8:19: error: expected expression before 'pthread_spinlock_t'
   return ((int*)(&pthread_spinlock_t))[argc];
                   ^~~~~~~~~~~~~~~~~~
make[2]: *** [CMakeFiles/cmTC_ba2ef.dir/build.make:66: CMakeFiles/cmTC_ba2ef.dir/CheckSymbolExists.c.obj] Error 1
make[2]: Leaving directory '/home/vagrant/slave/monero-static-win64/build/build/release/CMakeFiles/CMakeTmp'
make[1]: *** [Makefile:121: cmTC_ba2ef/fast] Error 2
make[1]: Leaving directory '/home/vagrant/slave/monero-static-win64/build/build/release/CMakeFiles/CMakeTmp'

File C:/msys64/home/vagrant/slave/monero-static-win64/build/build/release/CMakeFiles/CMakeTmp/CheckSymbolExists.c:
/* */
#include <pthread.h>

int main(int argc, char** argv)
{
  (void)argv;
#ifndef pthread_spinlock_t
  return ((int*)(&pthread_spinlock_t))[argc];
#else
  (void)argc;
  return 0;
#endif
}

Determining if the LIBRESSL_VERSION_TEXT exist failed with the following output:
Change Dir: C:/msys64/home/vagrant/slave/monero-static-win64/build/build/release/CMakeFiles/CMakeTmp

Run Build Command:"C:/msys64/usr/bin/make.exe" "cmTC_d9a0b/fast"
make[1]: Entering directory '/home/vagrant/slave/monero-static-win64/build/build/release/CMakeFiles/CMakeTmp'
/usr/bin/make -f CMakeFiles/cmTC_d9a0b.dir/build.make CMakeFiles/cmTC_d9a0b.dir/build
make[2]: Entering directory '/home/vagrant/slave/monero-static-win64/build/build/release/CMakeFiles/CMakeTmp'
Building C object CMakeFiles/cmTC_d9a0b.dir/CheckSymbolExists.c.obj

/C/msys64/mingw64/bin/x86_64-w64-mingw32-gcc.exe    -o CMakeFiles/cmTC_d9a0b.dir/CheckSymbolExists.c.obj   -c /C/msys64/home/vagrant/slave/monero-static-win64/build/build/release/CMakeFiles/CMakeTmp/CheckSymbolExists.c
C:/msys64/home/vagrant/slave/monero-static-win64/build/build/release/CMakeFiles/CMakeTmp/CheckSymbolExists.c: In function 'main':
C:/msys64/home/vagrant/slave/monero-static-win64/build/build/release/CMakeFiles/CMakeTmp/CheckSymbolExists.c:8:19: error: 'LIBRESSL_VERSION_TEXT' undeclared (first use in this function); did you mean 'OPENSSL_VERSION_TEXT'?
   return ((int*)(&LIBRESSL_VERSION_TEXT))[argc];
                   ^~~~~~~~~~~~~~~~~~~~~
                   OPENSSL_VERSION_TEXT
C:/msys64/home/vagrant/slave/monero-static-win64/build/build/release/CMakeFiles/CMakeTmp/CheckSymbolExists.c:8:19: note: each undeclared identifier is reported only once for each function it appears in
make[2]: *** [CMakeFiles/cmTC_d9a0b.dir/build.make:66: CMakeFiles/cmTC_d9a0b.dir/CheckSymbolExists.c.obj] Error 1
make[2]: Leaving directory '/home/vagrant/slave/monero-static-win64/build/build/release/CMakeFiles/CMakeTmp'
make[1]: *** [Makefile:121: cmTC_d9a0b/fast] Error 2
make[1]: Leaving directory '/home/vagrant/slave/monero-static-win64/build/build/release/CMakeFiles/CMakeTmp'

File C:/msys64/home/vagrant/slave/monero-static-win64/build/build/release/CMakeFiles/CMakeTmp/CheckSymbolExists.c:
/* */
#include <openssl/opensslv.h>

int main(int argc, char** argv)
{
  (void)argv;
#ifndef LIBRESSL_VERSION_TEXT
  return ((int*)(&LIBRESSL_VERSION_TEXT))[argc];
#else
  (void)argc;
  return 0;
#endif
}

Determining if the -Wl,-z,relro linker flag is supported failed with the following output:
Change Dir: C:/msys64/home/vagrant/slave/monero-static-win64/build/build/release/CMakeFiles/CMakeTmp

Run Build Command:"C:/msys64/usr/bin/make.exe" "cmTC_ce18a/fast"
make[1]: Entering directory '/home/vagrant/slave/monero-static-win64/build/build/release/CMakeFiles/CMakeTmp'
/usr/bin/make -f CMakeFiles/cmTC_ce18a.dir/build.make CMakeFiles/cmTC_ce18a.dir/build
make[2]: Entering directory '/home/vagrant/slave/monero-static-win64/build/build/release/CMakeFiles/CMakeTmp'
Building C object CMakeFiles/cmTC_ce18a.dir/CheckLinkerFlag.c.obj

/C/msys64/mingw64/bin/x86_64-w64-mingw32-gcc.exe   -Wl,-z,relro    -Wl,-z,relro -o CMakeFiles/cmTC_ce18a.dir/CheckLinkerFlag.c.obj   -c /C/msys64/home/vagrant/slave/monero-static-win64/build/cmake/CheckLinkerFlag.c
Linking C executable cmTC_ce18a.exe

/C/msys64/mingw64/bin/cmake.exe -E remove -f CMakeFiles/cmTC_ce18a.dir/objects.a
ar cr CMakeFiles/cmTC_ce18a.dir/objects.a "CMakeFiles/cmTC_ce18a.dir/CheckLinkerFlag.c.obj" 
/C/msys64/mingw64/bin/x86_64-w64-mingw32-gcc.exe -Wl,-z,relro     -Wl,--whole-archive CMakeFiles/cmTC_ce18a.dir/objects.a -Wl,--no-whole-archive  -o cmTC_ce18a.exe -Wl,--major-image-version,0,--minor-image-version,0 -lkernel32 -luser32 -lgdi32 -lwinspool -lshell32 -lole32 -loleaut32 -luuid -lcomdlg32 -ladvapi32 
C:/msys64/mingw64/bin/../lib/gcc/x86_64-w64-mingw32/8.2.1/../../../../x86_64-w64-mingw32/bin/ld.exe: unrecognized option '-z'

C:/msys64/mingw64/bin/../lib/gcc/x86_64-w64-mingw32/8.2.1/../../../../x86_64-w64-mingw32/bin/ld.exe: use the --help option for usage information

collect2.exe: error: ld returned 1 exit status
make[2]: *** [CMakeFiles/cmTC_ce18a.dir/build.make:88: cmTC_ce18a.exe] Error 1
make[2]: Leaving directory '/home/vagrant/slave/monero-static-win64/build/build/release/CMakeFiles/CMakeTmp'
make[1]: *** [Makefile:121: cmTC_ce18a/fast] Error 2
make[1]: Leaving directory '/home/vagrant/slave/monero-static-win64/build/build/release/CMakeFiles/CMakeTmp'


Determining if the -Wl,-z,now linker flag is supported failed with the following output:
Change Dir: C:/msys64/home/vagrant/slave/monero-static-win64/build/build/release/CMakeFiles/CMakeTmp

Run Build Command:"C:/msys64/usr/bin/make.exe" "cmTC_2f871/fast"
make[1]: Entering directory '/home/vagrant/slave/monero-static-win64/build/build/release/CMakeFiles/CMakeTmp'
/usr/bin/make -f CMakeFiles/cmTC_2f871.dir/build.make CMakeFiles/cmTC_2f871.dir/build
make[2]: Entering directory '/home/vagrant/slave/monero-static-win64/build/build/release/CMakeFiles/CMakeTmp'
Building C object CMakeFiles/cmTC_2f871.dir/CheckLinkerFlag.c.obj

/C/msys64/mingw64/bin/x86_64-w64-mingw32-gcc.exe   -Wl,-z,now    -Wl,-z,now -o CMakeFiles/cmTC_2f871.dir/CheckLinkerFlag.c.obj   -c /C/msys64/home/vagrant/slave/monero-static-win64/build/cmake/CheckLinkerFlag.c
Linking C executable cmTC_2f871.exe

/C/msys64/mingw64/bin/cmake.exe -E remove -f CMakeFiles/cmTC_2f871.dir/objects.a
ar cr CMakeFiles/cmTC_2f871.dir/objects.a "CMakeFiles/cmTC_2f871.dir/CheckLinkerFlag.c.obj" 
/C/msys64/mingw64/bin/x86_64-w64-mingw32-gcc.exe -Wl,-z,now     -Wl,--whole-archive CMakeFiles/cmTC_2f871.dir/objects.a -Wl,--no-whole-archive  -o cmTC_2f871.exe -Wl,--major-image-version,0,--minor-image-version,0 -lkernel32 -luser32 -lgdi32 -lwinspool -lshell32 -lole32 -loleaut32 -luuid -lcomdlg32 -ladvapi32 
C:/msys64/mingw64/bin/../lib/gcc/x86_64-w64-mingw32/8.2.1/../../../../x86_64-w64-mingw32/bin/ld.exe: unrecognized option '-z'

C:/msys64/mingw64/bin/../lib/gcc/x86_64-w64-mingw32/8.2.1/../../../../x86_64-w64-mingw32/bin/ld.exe: use the --help option for usage information

collect2.exe: error: ld returned 1 exit status
make[2]: *** [CMakeFiles/cmTC_2f871.dir/build.make:88: cmTC_2f871.exe] Error 1
make[2]: Leaving directory '/home/vagrant/slave/monero-static-win64/build/build/release/CMakeFiles/CMakeTmp'
make[1]: *** [Makefile:121: cmTC_2f871/fast] Error 2
make[1]: Leaving directory '/home/vagrant/slave/monero-static-win64/build/build/release/CMakeFiles/CMakeTmp'


Determining if the -Wl,-z,noexecstack linker flag is supported failed with the following output:
Change Dir: C:/msys64/home/vagrant/slave/monero-static-win64/build/build/release/CMakeFiles/CMakeTmp

Run Build Command:"C:/msys64/usr/bin/make.exe" "cmTC_23d0e/fast"
make[1]: Entering directory '/home/vagrant/slave/monero-static-win64/build/build/release/CMakeFiles/CMakeTmp'
/usr/bin/make -f CMakeFiles/cmTC_23d0e.dir/build.make CMakeFiles/cmTC_23d0e.dir/build
make[2]: Entering directory '/home/vagrant/slave/monero-static-win64/build/build/release/CMakeFiles/CMakeTmp'
Building C object CMakeFiles/cmTC_23d0e.dir/CheckLinkerFlag.c.obj

/C/msys64/mingw64/bin/x86_64-w64-mingw32-gcc.exe   -Wl,-z,noexecstack    -Wl,-z,noexecstack -o CMakeFiles/cmTC_23d0e.dir/CheckLinkerFlag.c.obj   -c /C/msys64/home/vagrant/slave/monero-static-win64/build/cmake/CheckLinkerFlag.c
Linking C executable cmTC_23d0e.exe

/C/msys64/mingw64/bin/cmake.exe -E remove -f CMakeFiles/cmTC_23d0e.dir/objects.a
ar cr CMakeFiles/cmTC_23d0e.dir/objects.a "CMakeFiles/cmTC_23d0e.dir/CheckLinkerFlag.c.obj" 
/C/msys64/mingw64/bin/x86_64-w64-mingw32-gcc.exe -Wl,-z,noexecstack     -Wl,--whole-archive CMakeFiles/cmTC_23d0e.dir/objects.a -Wl,--no-whole-archive  -o cmTC_23d0e.exe -Wl,--major-image-version,0,--minor-image-version,0 -lkernel32 -luser32 -lgdi32 -lwinspool -lshell32 -lole32 -loleaut32 -luuid -lcomdlg32 -ladvapi32 
C:/msys64/mingw64/bin/../lib/gcc/x86_64-w64-mingw32/8.2.1/../../../../x86_64-w64-mingw32/bin/ld.exe: unrecognized option '-z'

C:/msys64/mingw64/bin/../lib/gcc/x86_64-w64-mingw32/8.2.1/../../../../x86_64-w64-mingw32/bin/ld.exe: use the --help option for usage information

collect2.exe: error: ld returned 1 exit status
make[2]: *** [CMakeFiles/cmTC_23d0e.dir/build.make:88: cmTC_23d0e.exe] Error 1
make[2]: Leaving directory '/home/vagrant/slave/monero-static-win64/build/build/release/CMakeFiles/CMakeTmp'
make[1]: *** [Makefile:121: cmTC_23d0e/fast] Error 2
make[1]: Leaving directory '/home/vagrant/slave/monero-static-win64/build/build/release/CMakeFiles/CMakeTmp'


Determining if the -Wl,-z,noexecheap linker flag is supported failed with the following output:
Change Dir: C:/msys64/home/vagrant/slave/monero-static-win64/build/build/release/CMakeFiles/CMakeTmp

Run Build Command:"C:/msys64/usr/bin/make.exe" "cmTC_0a062/fast"
make[1]: Entering directory '/home/vagrant/slave/monero-static-win64/build/build/release/CMakeFiles/CMakeTmp'
/usr/bin/make -f CMakeFiles/cmTC_0a062.dir/build.make CMakeFiles/cmTC_0a062.dir/build
make[2]: Entering directory '/home/vagrant/slave/monero-static-win64/build/build/release/CMakeFiles/CMakeTmp'
Building C object CMakeFiles/cmTC_0a062.dir/CheckLinkerFlag.c.obj

/C/msys64/mingw64/bin/x86_64-w64-mingw32-gcc.exe   -Wl,-z,noexecheap    -Wl,-z,noexecheap -o CMakeFiles/cmTC_0a062.dir/CheckLinkerFlag.c.obj   -c /C/msys64/home/vagrant/slave/monero-static-win64/build/cmake/CheckLinkerFlag.c
Linking C executable cmTC_0a062.exe

/C/msys64/mingw64/bin/cmake.exe -E remove -f CMakeFiles/cmTC_0a062.dir/objects.a
ar cr CMakeFiles/cmTC_0a062.dir/objects.a "CMakeFiles/cmTC_0a062.dir/CheckLinkerFlag.c.obj" 
/C/msys64/mingw64/bin/x86_64-w64-mingw32-gcc.exe -Wl,-z,noexecheap     -Wl,--whole-archive CMakeFiles/cmTC_0a062.dir/objects.a -Wl,--no-whole-archive  -o cmTC_0a062.exe -Wl,--major-image-version,0,--minor-image-version,0 -lkernel32 -luser32 -lgdi32 -lwinspool -lshell32 -lole32 -loleaut32 -luuid -lcomdlg32 -ladvapi32 
C:/msys64/mingw64/bin/../lib/gcc/x86_64-w64-mingw32/8.2.1/../../../../x86_64-w64-mingw32/bin/ld.exe: unrecognized option '-z'

C:/msys64/mingw64/bin/../lib/gcc/x86_64-w64-mingw32/8.2.1/../../../../x86_64-w64-mingw32/bin/ld.exe: use the --help option for usage information

collect2.exe: error: ld returned 1 exit status
make[2]: *** [CMakeFiles/cmTC_0a062.dir/build.make:88: cmTC_0a062.exe] Error 1
make[2]: Leaving directory '/home/vagrant/slave/monero-static-win64/build/build/release/CMakeFiles/CMakeTmp'
make[1]: *** [Makefile:121: cmTC_0a062/fast] Error 2
make[1]: Leaving directory '/home/vagrant/slave/monero-static-win64/build/build/release/CMakeFiles/CMakeTmp'


Determining if the function rl_copy_text exists failed with the following output:
Change Dir: C:/msys64/home/vagrant/slave/monero-static-win64/build/build/release/CMakeFiles/CMakeTmp

Run Build Command:"C:/msys64/usr/bin/make.exe" "cmTC_761d3/fast"
make[1]: Entering directory '/home/vagrant/slave/monero-static-win64/build/build/release/CMakeFiles/CMakeTmp'
/usr/bin/make -f CMakeFiles/cmTC_761d3.dir/build.make CMakeFiles/cmTC_761d3.dir/build
make[2]: Entering directory '/home/vagrant/slave/monero-static-win64/build/build/release/CMakeFiles/CMakeTmp'
Building C object CMakeFiles/cmTC_761d3.dir/CheckFunctionExists.c.obj

/C/msys64/mingw64/bin/x86_64-w64-mingw32-gcc.exe   -maes -march=x86-64 -fno-strict-aliasing -std=c11 -D_GNU_SOURCE -m64 -DWIN32_LEAN_AND_MEAN  -Wall -Wextra -Wpointer-arith -Wundef -Wvla -Wwrite-strings -Wno-error=extra -Wno-error=deprecated-declarations -Wno-unused-parameter -Wno-unused-variable -Wno-error=unused-variable -Wno-error=undef -Wno-error=uninitialized -Wlogical-op -Wno-error=maybe-uninitialized -Wno-error=cpp -Wno-error=unused-value -Wno-error=unused-but-set-variable -Waggregate-return -Wnested-externs -Wold-style-definition -Wstrict-prototypes  -fPIC  -U_FORTIFY_SOURCE -D_FORTIFY_SOURCE=1 -Wformat -Wformat-security -mmitigate-rop -fno-strict-aliasing -DCHECK_FUNCTION_EXISTS=rl_copy_text   -o CMakeFiles/cmTC_761d3.dir/CheckFunctionExists.c.obj   -c /C/msys64/mingw64/share/cmake-3.12/Modules/CheckFunctionExists.c
Linking C executable cmTC_761d3.exe

/C/msys64/mingw64/bin/cmake.exe -E remove -f CMakeFiles/cmTC_761d3.dir/objects.a
ar cr CMakeFiles/cmTC_761d3.dir/objects.a "CMakeFiles/cmTC_761d3.dir/CheckFunctionExists.c.obj" 
/C/msys64/mingw64/bin/x86_64-w64-mingw32-gcc.exe  -maes -march=x86-64 -fno-strict-aliasing -std=c11 -D_GNU_SOURCE -m64 -DWIN32_LEAN_AND_MEAN  -Wall -Wextra -Wpointer-arith -Wundef -Wvla -Wwrite-strings -Wno-error=extra -Wno-error=deprecated-declarations -Wno-unused-parameter -Wno-unused-variable -Wno-error=unused-variable -Wno-error=undef -Wno-error=uninitialized -Wlogical-op -Wno-error=maybe-uninitialized -Wno-error=cpp -Wno-error=unused-value -Wno-error=unused-but-set-variable -Waggregate-return -Wnested-externs -Wold-style-definition -Wstrict-prototypes  -fPIC  -U_FORTIFY_SOURCE -D_FORTIFY_SOURCE=1 -Wformat -Wformat-security -mmitigate-rop -fno-strict-aliasing -DCHECK_FUNCTION_EXISTS=rl_copy_text    -Wl,--whole-archive CMakeFiles/cmTC_761d3.dir/objects.a -Wl,--no-whole-archive  -o cmTC_761d3.exe -Wl,--major-image-version,0,--minor-image-version,0 /C/msys64/mingw64/lib/libreadline.a -lkernel32 -luser32 -lgdi32 -lwinspool -lshell32 -lole32 -loleaut32 -luuid -lcomdlg32 -ladvapi32 
C:/msys64/mingw64/lib/libreadline.a(terminal.o):(.text+0x186): undefined reference to `tgetnum'

C:/msys64/mingw64/lib/libreadline.a(terminal.o):(.text+0x2c9): undefined reference to `tgetnum'

C:/msys64/mingw64/lib/libreadline.a(terminal.o):(.text+0x779): undefined reference to `tgetent'

C:/msys64/mingw64/lib/libreadline.a(terminal.o):(.text+0x7bf): undefined reference to `tgetstr'

C:/msys64/mingw64/lib/libreadline.a(terminal.o):(.text+0x81e): undefined reference to `tgetflag'

C:/msys64/mingw64/lib/libreadline.a(terminal.o):(.text+0x86d): undefined reference to `tgetflag'

C:/msys64/mingw64/lib/libreadline.a(terminal.o):(.text+0x988): undefined reference to `tgetflag'

C:/msys64/mingw64/lib/libreadline.a(terminal.o):(.text+0xb87): undefined reference to `tputs'

C:/msys64/mingw64/lib/libreadline.a(terminal.o):(.text+0xc6d): undefined reference to `tputs'

C:/msys64/mingw64/lib/libreadline.a(terminal.o):(.text+0xcb7): undefined reference to `tputs'

C:/msys64/mingw64/lib/libreadline.a(terminal.o):(.text+0xd0d): undefined reference to `tputs'

C:/msys64/mingw64/lib/libreadline.a(terminal.o):(.text+0xd3d): undefined reference to `tputs'

C:/msys64/mingw64/lib/libreadline.a(terminal.o):(.text+0xd80): more undefined references to `tputs' follow

collect2.exe: error: ld returned 1 exit status
make[2]: *** [CMakeFiles/cmTC_761d3.dir/build.make:89: cmTC_761d3.exe] Error 1
make[2]: Leaving directory '/home/vagrant/slave/monero-static-win64/build/build/release/CMakeFiles/CMakeTmp'
make[1]: *** [Makefile:121: cmTC_761d3/fast] Error 2
make[1]: Leaving directory '/home/vagrant/slave/monero-static-win64/build/build/release/CMakeFiles/CMakeTmp'


Determining if the function rl_filename_completion_function exists failed with the following output:
Change Dir: C:/msys64/home/vagrant/slave/monero-static-win64/build/build/release/CMakeFiles/CMakeTmp

Run Build Command:"C:/msys64/usr/bin/make.exe" "cmTC_57df1/fast"
make[1]: Entering directory '/home/vagrant/slave/monero-static-win64/build/build/release/CMakeFiles/CMakeTmp'
/usr/bin/make -f CMakeFiles/cmTC_57df1.dir/build.make CMakeFiles/cmTC_57df1.dir/build
make[2]: Entering directory '/home/vagrant/slave/monero-static-win64/build/build/release/CMakeFiles/CMakeTmp'
Building C object CMakeFiles/cmTC_57df1.dir/CheckFunctionExists.c.obj

/C/msys64/mingw64/bin/x86_64-w64-mingw32-gcc.exe   -maes -march=x86-64 -fno-strict-aliasing -std=c11 -D_GNU_SOURCE -m64 -DWIN32_LEAN_AND_MEAN  -Wall -Wextra -Wpointer-arith -Wundef -Wvla -Wwrite-strings -Wno-error=extra -Wno-error=deprecated-declarations -Wno-unused-parameter -Wno-unused-variable -Wno-error=unused-variable -Wno-error=undef -Wno-error=uninitialized -Wlogical-op -Wno-error=maybe-uninitialized -Wno-error=cpp -Wno-error=unused-value -Wno-error=unused-but-set-variable -Waggregate-return -Wnested-externs -Wold-style-definition -Wstrict-prototypes  -fPIC  -U_FORTIFY_SOURCE -D_FORTIFY_SOURCE=1 -Wformat -Wformat-security -mmitigate-rop -fno-strict-aliasing -DCHECK_FUNCTION_EXISTS=rl_filename_completion_function   -o CMakeFiles/cmTC_57df1.dir/CheckFunctionExists.c.obj   -c /C/msys64/mingw64/share/cmake-3.12/Modules/CheckFunctionExists.c
Linking C executable cmTC_57df1.exe

/C/msys64/mingw64/bin/cmake.exe -E remove -f CMakeFiles/cmTC_57df1.dir/objects.a
ar cr CMakeFiles/cmTC_57df1.dir/objects.a "CMakeFiles/cmTC_57df1.dir/CheckFunctionExists.c.obj" 
/C/msys64/mingw64/bin/x86_64-w64-mingw32-gcc.exe  -maes -march=x86-64 -fno-strict-aliasing -std=c11 -D_GNU_SOURCE -m64 -DWIN32_LEAN_AND_MEAN  -Wall -Wextra -Wpointer-arith -Wundef -Wvla -Wwrite-strings -Wno-error=extra -Wno-error=deprecated-declarations -Wno-unused-parameter -Wno-unused-variable -Wno-error=unused-variable -Wno-error=undef -Wno-error=uninitialized -Wlogical-op -Wno-error=maybe-uninitialized -Wno-error=cpp -Wno-error=unused-value -Wno-error=unused-but-set-variable -Waggregate-return -Wnested-externs -Wold-style-definition -Wstrict-prototypes  -fPIC  -U_FORTIFY_SOURCE -D_FORTIFY_SOURCE=1 -Wformat -Wformat-security -mmitigate-rop -fno-strict-aliasing -DCHECK_FUNCTION_EXISTS=rl_filename_completion_function    -Wl,--whole-archive CMakeFiles/cmTC_57df1.dir/objects.a -Wl,--no-whole-archive  -o cmTC_57df1.exe -Wl,--major-image-version,0,--minor-image-version,0 /C/msys64/mingw64/lib/libreadline.a -lkernel32 -luser32 -lgdi32 -lwinspool -lshell32 -lole32 -loleaut32 -luuid -lcomdlg32 -ladvapi32 
C:/msys64/mingw64/lib/libreadline.a(display.o):(.text+0xa6c): undefined reference to `tputs'

C:/msys64/mingw64/lib/libreadline.a(display.o):(.text+0xb8e): undefined reference to `tputs'

C:/msys64/mingw64/lib/libreadline.a(display.o):(.text+0xbe2): undefined reference to `tputs'

C:/msys64/mingw64/lib/libreadline.a(display.o):(.text+0x19a5): undefined reference to `tputs'

C:/msys64/mingw64/lib/libreadline.a(display.o):(.text+0x2b47): undefined reference to `tputs'

C:/msys64/mingw64/lib/libreadline.a(display.o):(.text+0x2c4e): more undefined references to `tputs' follow

C:/msys64/mingw64/lib/libreadline.a(terminal.o):(.text+0x186): undefined reference to `tgetnum'

C:/msys64/mingw64/lib/libreadline.a(terminal.o):(.text+0x2c9): undefined reference to `tgetnum'

C:/msys64/mingw64/lib/libreadline.a(terminal.o):(.text+0x779): undefined reference to `tgetent'

C:/msys64/mingw64/lib/libreadline.a(terminal.o):(.text+0x7bf): undefined reference to `tgetstr'

C:/msys64/mingw64/lib/libreadline.a(terminal.o):(.text+0x81e): undefined reference to `tgetflag'

C:/msys64/mingw64/lib/libreadline.a(terminal.o):(.text+0x86d): undefined reference to `tgetflag'

C:/msys64/mingw64/lib/libreadline.a(terminal.o):(.text+0x988): undefined reference to `tgetflag'

C:/msys64/mingw64/lib/libreadline.a(terminal.o):(.text+0xb87): undefined reference to `tputs'

C:/msys64/mingw64/lib/libreadline.a(terminal.o):(.text+0xc6d): undefined reference to `tputs'

C:/msys64/mingw64/lib/libreadline.a(terminal.o):(.text+0xcb7): undefined reference to `tputs'

C:/msys64/mingw64/lib/libreadline.a(terminal.o):(.text+0xd0d): undefined reference to `tputs'

C:/msys64/mingw64/lib/libreadline.a(terminal.o):(.text+0xd3d): undefined reference to `tputs'

C:/msys64/mingw64/lib/libreadline.a(terminal.o):(.text+0xd80): more undefined references to `tputs' follow

collect2.exe: error: ld returned 1 exit status
make[2]: *** [CMakeFiles/cmTC_57df1.dir/build.make:89: cmTC_57df1.exe] Error 1
make[2]: Leaving directory '/home/vagrant/slave/monero-static-win64/build/build/release/CMakeFiles/CMakeTmp'
make[1]: *** [Makefile:121: cmTC_57df1/fast] Error 2
make[1]: Leaving directory '/home/vagrant/slave/monero-static-win64/build/build/release/CMakeFiles/CMakeTmp'