(view as text)
Determining if the function memset_s exists in the c failed with the following output:
Change Dir: C:/msys64/home/vagrant/slave/monero-static-win64/build/build/release/CMakeFiles/CMakeTmp

Run Build Command:"C:/msys64/usr/bin/make.exe" "cmTC_ee58a/fast"
make[1]: Entering directory '/home/vagrant/slave/monero-static-win64/build/build/release/CMakeFiles/CMakeTmp'
/usr/bin/make -f CMakeFiles/cmTC_ee58a.dir/build.make CMakeFiles/cmTC_ee58a.dir/build
make[2]: Entering directory '/home/vagrant/slave/monero-static-win64/build/build/release/CMakeFiles/CMakeTmp'
Building C object CMakeFiles/cmTC_ee58a.dir/CheckFunctionExists.c.obj

/C/msys64/mingw64/bin/x86_64-w64-mingw32-gcc.exe   -DCHECK_FUNCTION_EXISTS=memset_s   -o CMakeFiles/cmTC_ee58a.dir/CheckFunctionExists.c.obj   -c /C/msys64/mingw64/share/cmake-3.12/Modules/CheckFunctionExists.c
Linking C executable cmTC_ee58a.exe

/C/msys64/mingw64/bin/cmake.exe -E remove -f CMakeFiles/cmTC_ee58a.dir/objects.a
ar cr CMakeFiles/cmTC_ee58a.dir/objects.a "CMakeFiles/cmTC_ee58a.dir/CheckFunctionExists.c.obj" 
/C/msys64/mingw64/bin/x86_64-w64-mingw32-gcc.exe  -DCHECK_FUNCTION_EXISTS=memset_s    -Wl,--whole-archive CMakeFiles/cmTC_ee58a.dir/objects.a -Wl,--no-whole-archive  -o cmTC_ee58a.exe -Wl,--major-image-version,0,--minor-image-version,0  -L/C/msys64/home/vagrant/slave/monero-static-win64/build/build/release/CMakeFiles/CMakeTmp/string.h -lc -lkernel32 -luser32 -lgdi32 -lwinspool -lshell32 -lole32 -loleaut32 -luuid -lcomdlg32 -ladvapi32 
C:/msys64/mingw64/bin/../lib/gcc/x86_64-w64-mingw32/8.2.1/../../../../x86_64-w64-mingw32/bin/ld.exe: cannot find -lc

collect2.exe: error: ld returned 1 exit status
make[2]: *** [CMakeFiles/cmTC_ee58a.dir/build.make:88: cmTC_ee58a.exe] Error 1
make[2]: Leaving directory '/home/vagrant/slave/monero-static-win64/build/build/release/CMakeFiles/CMakeTmp'
make[1]: *** [Makefile:121: cmTC_ee58a/fast] Error 2
make[1]: Leaving directory '/home/vagrant/slave/monero-static-win64/build/build/release/CMakeFiles/CMakeTmp'


Determining if the function explicit_bzero exists in the c failed with the following output:
Change Dir: C:/msys64/home/vagrant/slave/monero-static-win64/build/build/release/CMakeFiles/CMakeTmp

Run Build Command:"C:/msys64/usr/bin/make.exe" "cmTC_b5302/fast"
make[1]: Entering directory '/home/vagrant/slave/monero-static-win64/build/build/release/CMakeFiles/CMakeTmp'
/usr/bin/make -f CMakeFiles/cmTC_b5302.dir/build.make CMakeFiles/cmTC_b5302.dir/build
make[2]: Entering directory '/home/vagrant/slave/monero-static-win64/build/build/release/CMakeFiles/CMakeTmp'
Building C object CMakeFiles/cmTC_b5302.dir/CheckFunctionExists.c.obj

/C/msys64/mingw64/bin/x86_64-w64-mingw32-gcc.exe   -DCHECK_FUNCTION_EXISTS=explicit_bzero   -o CMakeFiles/cmTC_b5302.dir/CheckFunctionExists.c.obj   -c /C/msys64/mingw64/share/cmake-3.12/Modules/CheckFunctionExists.c
Linking C executable cmTC_b5302.exe

/C/msys64/mingw64/bin/cmake.exe -E remove -f CMakeFiles/cmTC_b5302.dir/objects.a
ar cr CMakeFiles/cmTC_b5302.dir/objects.a "CMakeFiles/cmTC_b5302.dir/CheckFunctionExists.c.obj" 
/C/msys64/mingw64/bin/x86_64-w64-mingw32-gcc.exe  -DCHECK_FUNCTION_EXISTS=explicit_bzero    -Wl,--whole-archive CMakeFiles/cmTC_b5302.dir/objects.a -Wl,--no-whole-archive  -o cmTC_b5302.exe -Wl,--major-image-version,0,--minor-image-version,0  -L/C/msys64/home/vagrant/slave/monero-static-win64/build/build/release/CMakeFiles/CMakeTmp/strings.h -lc -lkernel32 -luser32 -lgdi32 -lwinspool -lshell32 -lole32 -loleaut32 -luuid -lcomdlg32 -ladvapi32 
C:/msys64/mingw64/bin/../lib/gcc/x86_64-w64-mingw32/8.2.1/../../../../x86_64-w64-mingw32/bin/ld.exe: cannot find -lc

collect2.exe: error: ld returned 1 exit status
make[2]: *** [CMakeFiles/cmTC_b5302.dir/build.make:88: cmTC_b5302.exe] Error 1
make[2]: Leaving directory '/home/vagrant/slave/monero-static-win64/build/build/release/CMakeFiles/CMakeTmp'
make[1]: *** [Makefile:121: cmTC_b5302/fast] Error 2
make[1]: Leaving directory '/home/vagrant/slave/monero-static-win64/build/build/release/CMakeFiles/CMakeTmp'


Determining if the function strptime exists failed with the following output:
Change Dir: C:/msys64/home/vagrant/slave/monero-static-win64/build/build/release/CMakeFiles/CMakeTmp

Run Build Command:"C:/msys64/usr/bin/make.exe" "cmTC_d71c3/fast"
make[1]: Entering directory '/home/vagrant/slave/monero-static-win64/build/build/release/CMakeFiles/CMakeTmp'
/usr/bin/make -f CMakeFiles/cmTC_d71c3.dir/build.make CMakeFiles/cmTC_d71c3.dir/build
make[2]: Entering directory '/home/vagrant/slave/monero-static-win64/build/build/release/CMakeFiles/CMakeTmp'
Building C object CMakeFiles/cmTC_d71c3.dir/CheckFunctionExists.c.obj

/C/msys64/mingw64/bin/x86_64-w64-mingw32-gcc.exe   -DCHECK_FUNCTION_EXISTS=strptime   -o CMakeFiles/cmTC_d71c3.dir/CheckFunctionExists.c.obj   -c /C/msys64/mingw64/share/cmake-3.12/Modules/CheckFunctionExists.c
Linking C executable cmTC_d71c3.exe

/C/msys64/mingw64/bin/cmake.exe -E remove -f CMakeFiles/cmTC_d71c3.dir/objects.a
ar cr CMakeFiles/cmTC_d71c3.dir/objects.a "CMakeFiles/cmTC_d71c3.dir/CheckFunctionExists.c.obj" 
/C/msys64/mingw64/bin/x86_64-w64-mingw32-gcc.exe  -DCHECK_FUNCTION_EXISTS=strptime    -Wl,--whole-archive CMakeFiles/cmTC_d71c3.dir/objects.a -Wl,--no-whole-archive  -o cmTC_d71c3.exe -Wl,--major-image-version,0,--minor-image-version,0 -lkernel32 -luser32 -lgdi32 -lwinspool -lshell32 -lole32 -loleaut32 -luuid -lcomdlg32 -ladvapi32 
CMakeFiles/cmTC_d71c3.dir/objects.a(CheckFunctionExists.c.obj):CheckFunctionExists.c:(.text+0x15): undefined reference to `strptime'

collect2.exe: error: ld returned 1 exit status
make[2]: *** [CMakeFiles/cmTC_d71c3.dir/build.make:88: cmTC_d71c3.exe] Error 1
make[2]: Leaving directory '/home/vagrant/slave/monero-static-win64/build/build/release/CMakeFiles/CMakeTmp'
make[1]: *** [Makefile:121: cmTC_d71c3/fast] Error 2
make[1]: Leaving directory '/home/vagrant/slave/monero-static-win64/build/build/release/CMakeFiles/CMakeTmp'


Determining if the include file arpa/inet.h exists failed with the following output:
Change Dir: C:/msys64/home/vagrant/slave/monero-static-win64/build/build/release/CMakeFiles/CMakeTmp

Run Build Command:"C:/msys64/usr/bin/make.exe" "cmTC_c1c9f/fast"
make[1]: Entering directory '/home/vagrant/slave/monero-static-win64/build/build/release/CMakeFiles/CMakeTmp'
/usr/bin/make -f CMakeFiles/cmTC_c1c9f.dir/build.make CMakeFiles/cmTC_c1c9f.dir/build
make[2]: Entering directory '/home/vagrant/slave/monero-static-win64/build/build/release/CMakeFiles/CMakeTmp'
Building C object CMakeFiles/cmTC_c1c9f.dir/CheckIncludeFile.c.obj

/C/msys64/mingw64/bin/x86_64-w64-mingw32-gcc.exe    -o CMakeFiles/cmTC_c1c9f.dir/CheckIncludeFile.c.obj   -c /C/msys64/home/vagrant/slave/monero-static-win64/build/build/release/CMakeFiles/CMakeTmp/CheckIncludeFile.c
C:/msys64/home/vagrant/slave/monero-static-win64/build/build/release/CMakeFiles/CMakeTmp/CheckIncludeFile.c:1:10: fatal error: arpa/inet.h: No such file or directory
 #include <arpa/inet.h>
          ^~~~~~~~~~~~~
compilation terminated.

make[2]: *** [CMakeFiles/cmTC_c1c9f.dir/build.make:66: CMakeFiles/cmTC_c1c9f.dir/CheckIncludeFile.c.obj] Error 1
make[2]: Leaving directory '/home/vagrant/slave/monero-static-win64/build/build/release/CMakeFiles/CMakeTmp'
make[1]: *** [Makefile:121: cmTC_c1c9f/fast] Error 2
make[1]: Leaving directory '/home/vagrant/slave/monero-static-win64/build/build/release/CMakeFiles/CMakeTmp'


Determining if the include file endian.h exists failed with the following output:
Change Dir: C:/msys64/home/vagrant/slave/monero-static-win64/build/build/release/CMakeFiles/CMakeTmp

Run Build Command:"C:/msys64/usr/bin/make.exe" "cmTC_580ab/fast"
make[1]: Entering directory '/home/vagrant/slave/monero-static-win64/build/build/release/CMakeFiles/CMakeTmp'
/usr/bin/make -f CMakeFiles/cmTC_580ab.dir/build.make CMakeFiles/cmTC_580ab.dir/build
make[2]: Entering directory '/home/vagrant/slave/monero-static-win64/build/build/release/CMakeFiles/CMakeTmp'
Building C object CMakeFiles/cmTC_580ab.dir/CheckIncludeFile.c.obj

/C/msys64/mingw64/bin/x86_64-w64-mingw32-gcc.exe    -o CMakeFiles/cmTC_580ab.dir/CheckIncludeFile.c.obj   -c /C/msys64/home/vagrant/slave/monero-static-win64/build/build/release/CMakeFiles/CMakeTmp/CheckIncludeFile.c
C:/msys64/home/vagrant/slave/monero-static-win64/build/build/release/CMakeFiles/CMakeTmp/CheckIncludeFile.c:1:10: fatal error: endian.h: No such file or directory
 #include <endian.h>
          ^~~~~~~~~~
compilation terminated.

make[2]: *** [CMakeFiles/cmTC_580ab.dir/build.make:66: CMakeFiles/cmTC_580ab.dir/CheckIncludeFile.c.obj] Error 1
make[2]: Leaving directory '/home/vagrant/slave/monero-static-win64/build/build/release/CMakeFiles/CMakeTmp'
make[1]: *** [Makefile:121: cmTC_580ab/fast] Error 2
make[1]: Leaving directory '/home/vagrant/slave/monero-static-win64/build/build/release/CMakeFiles/CMakeTmp'


Determining if the include file dlfcn.h exists failed with the following output:
Change Dir: C:/msys64/home/vagrant/slave/monero-static-win64/build/build/release/CMakeFiles/CMakeTmp

Run Build Command:"C:/msys64/usr/bin/make.exe" "cmTC_a6a55/fast"
make[1]: Entering directory '/home/vagrant/slave/monero-static-win64/build/build/release/CMakeFiles/CMakeTmp'
/usr/bin/make -f CMakeFiles/cmTC_a6a55.dir/build.make CMakeFiles/cmTC_a6a55.dir/build
make[2]: Entering directory '/home/vagrant/slave/monero-static-win64/build/build/release/CMakeFiles/CMakeTmp'
Building C object CMakeFiles/cmTC_a6a55.dir/CheckIncludeFile.c.obj

/C/msys64/mingw64/bin/x86_64-w64-mingw32-gcc.exe    -o CMakeFiles/cmTC_a6a55.dir/CheckIncludeFile.c.obj   -c /C/msys64/home/vagrant/slave/monero-static-win64/build/build/release/CMakeFiles/CMakeTmp/CheckIncludeFile.c
C:/msys64/home/vagrant/slave/monero-static-win64/build/build/release/CMakeFiles/CMakeTmp/CheckIncludeFile.c:1:10: fatal error: dlfcn.h: No such file or directory
 #include <dlfcn.h>
          ^~~~~~~~~
compilation terminated.

make[2]: *** [CMakeFiles/cmTC_a6a55.dir/build.make:66: CMakeFiles/cmTC_a6a55.dir/CheckIncludeFile.c.obj] Error 1
make[2]: Leaving directory '/home/vagrant/slave/monero-static-win64/build/build/release/CMakeFiles/CMakeTmp'
make[1]: *** [Makefile:121: cmTC_a6a55/fast] Error 2
make[1]: Leaving directory '/home/vagrant/slave/monero-static-win64/build/build/release/CMakeFiles/CMakeTmp'


Determining if the include file event.h exists failed with the following output:
Change Dir: C:/msys64/home/vagrant/slave/monero-static-win64/build/build/release/CMakeFiles/CMakeTmp

Run Build Command:"C:/msys64/usr/bin/make.exe" "cmTC_6d832/fast"
make[1]: Entering directory '/home/vagrant/slave/monero-static-win64/build/build/release/CMakeFiles/CMakeTmp'
/usr/bin/make -f CMakeFiles/cmTC_6d832.dir/build.make CMakeFiles/cmTC_6d832.dir/build
make[2]: Entering directory '/home/vagrant/slave/monero-static-win64/build/build/release/CMakeFiles/CMakeTmp'
Building C object CMakeFiles/cmTC_6d832.dir/CheckIncludeFile.c.obj

/C/msys64/mingw64/bin/x86_64-w64-mingw32-gcc.exe    -o CMakeFiles/cmTC_6d832.dir/CheckIncludeFile.c.obj   -c /C/msys64/home/vagrant/slave/monero-static-win64/build/build/release/CMakeFiles/CMakeTmp/CheckIncludeFile.c
C:/msys64/home/vagrant/slave/monero-static-win64/build/build/release/CMakeFiles/CMakeTmp/CheckIncludeFile.c:1:10: fatal error: event.h: No such file or directory
 #include <event.h>
          ^~~~~~~~~
compilation terminated.

make[2]: *** [CMakeFiles/cmTC_6d832.dir/build.make:66: CMakeFiles/cmTC_6d832.dir/CheckIncludeFile.c.obj] Error 1
make[2]: Leaving directory '/home/vagrant/slave/monero-static-win64/build/build/release/CMakeFiles/CMakeTmp'
make[1]: *** [Makefile:121: cmTC_6d832/fast] Error 2
make[1]: Leaving directory '/home/vagrant/slave/monero-static-win64/build/build/release/CMakeFiles/CMakeTmp'


Determining if the include file glob.h exists failed with the following output:
Change Dir: C:/msys64/home/vagrant/slave/monero-static-win64/build/build/release/CMakeFiles/CMakeTmp

Run Build Command:"C:/msys64/usr/bin/make.exe" "cmTC_df1fd/fast"
make[1]: Entering directory '/home/vagrant/slave/monero-static-win64/build/build/release/CMakeFiles/CMakeTmp'
/usr/bin/make -f CMakeFiles/cmTC_df1fd.dir/build.make CMakeFiles/cmTC_df1fd.dir/build
make[2]: Entering directory '/home/vagrant/slave/monero-static-win64/build/build/release/CMakeFiles/CMakeTmp'
Building C object CMakeFiles/cmTC_df1fd.dir/CheckIncludeFile.c.obj

/C/msys64/mingw64/bin/x86_64-w64-mingw32-gcc.exe    -o CMakeFiles/cmTC_df1fd.dir/CheckIncludeFile.c.obj   -c /C/msys64/home/vagrant/slave/monero-static-win64/build/build/release/CMakeFiles/CMakeTmp/CheckIncludeFile.c
C:/msys64/home/vagrant/slave/monero-static-win64/build/build/release/CMakeFiles/CMakeTmp/CheckIncludeFile.c:1:10: fatal error: glob.h: No such file or directory
 #include <glob.h>
          ^~~~~~~~
compilation terminated.

make[2]: *** [CMakeFiles/cmTC_df1fd.dir/build.make:66: CMakeFiles/cmTC_df1fd.dir/CheckIncludeFile.c.obj] Error 1
make[2]: Leaving directory '/home/vagrant/slave/monero-static-win64/build/build/release/CMakeFiles/CMakeTmp'
make[1]: *** [Makefile:121: cmTC_df1fd/fast] Error 2
make[1]: Leaving directory '/home/vagrant/slave/monero-static-win64/build/build/release/CMakeFiles/CMakeTmp'


Determining if the include file grp.h exists failed with the following output:
Change Dir: C:/msys64/home/vagrant/slave/monero-static-win64/build/build/release/CMakeFiles/CMakeTmp

Run Build Command:"C:/msys64/usr/bin/make.exe" "cmTC_33367/fast"
make[1]: Entering directory '/home/vagrant/slave/monero-static-win64/build/build/release/CMakeFiles/CMakeTmp'
/usr/bin/make -f CMakeFiles/cmTC_33367.dir/build.make CMakeFiles/cmTC_33367.dir/build
make[2]: Entering directory '/home/vagrant/slave/monero-static-win64/build/build/release/CMakeFiles/CMakeTmp'
Building C object CMakeFiles/cmTC_33367.dir/CheckIncludeFile.c.obj

/C/msys64/mingw64/bin/x86_64-w64-mingw32-gcc.exe    -o CMakeFiles/cmTC_33367.dir/CheckIncludeFile.c.obj   -c /C/msys64/home/vagrant/slave/monero-static-win64/build/build/release/CMakeFiles/CMakeTmp/CheckIncludeFile.c
C:/msys64/home/vagrant/slave/monero-static-win64/build/build/release/CMakeFiles/CMakeTmp/CheckIncludeFile.c:1:10: fatal error: grp.h: No such file or directory
 #include <grp.h>
          ^~~~~~~
compilation terminated.

make[2]: *** [CMakeFiles/cmTC_33367.dir/build.make:66: CMakeFiles/cmTC_33367.dir/CheckIncludeFile.c.obj] Error 1
make[2]: Leaving directory '/home/vagrant/slave/monero-static-win64/build/build/release/CMakeFiles/CMakeTmp'
make[1]: *** [Makefile:121: cmTC_33367/fast] Error 2
make[1]: Leaving directory '/home/vagrant/slave/monero-static-win64/build/build/release/CMakeFiles/CMakeTmp'


Determining if the include file login_cap.h exists failed with the following output:
Change Dir: C:/msys64/home/vagrant/slave/monero-static-win64/build/build/release/CMakeFiles/CMakeTmp

Run Build Command:"C:/msys64/usr/bin/make.exe" "cmTC_afe82/fast"
make[1]: Entering directory '/home/vagrant/slave/monero-static-win64/build/build/release/CMakeFiles/CMakeTmp'
/usr/bin/make -f CMakeFiles/cmTC_afe82.dir/build.make CMakeFiles/cmTC_afe82.dir/build
make[2]: Entering directory '/home/vagrant/slave/monero-static-win64/build/build/release/CMakeFiles/CMakeTmp'
Building C object CMakeFiles/cmTC_afe82.dir/CheckIncludeFile.c.obj

/C/msys64/mingw64/bin/x86_64-w64-mingw32-gcc.exe    -o CMakeFiles/cmTC_afe82.dir/CheckIncludeFile.c.obj   -c /C/msys64/home/vagrant/slave/monero-static-win64/build/build/release/CMakeFiles/CMakeTmp/CheckIncludeFile.c
C:/msys64/home/vagrant/slave/monero-static-win64/build/build/release/CMakeFiles/CMakeTmp/CheckIncludeFile.c:1:10: fatal error: login_cap.h: No such file or directory
 #include <login_cap.h>
          ^~~~~~~~~~~~~
compilation terminated.

make[2]: *** [CMakeFiles/cmTC_afe82.dir/build.make:66: CMakeFiles/cmTC_afe82.dir/CheckIncludeFile.c.obj] Error 1
make[2]: Leaving directory '/home/vagrant/slave/monero-static-win64/build/build/release/CMakeFiles/CMakeTmp'
make[1]: *** [Makefile:121: cmTC_afe82/fast] Error 2
make[1]: Leaving directory '/home/vagrant/slave/monero-static-win64/build/build/release/CMakeFiles/CMakeTmp'


Determining if the include file netdb.h exists failed with the following output:
Change Dir: C:/msys64/home/vagrant/slave/monero-static-win64/build/build/release/CMakeFiles/CMakeTmp

Run Build Command:"C:/msys64/usr/bin/make.exe" "cmTC_20450/fast"
make[1]: Entering directory '/home/vagrant/slave/monero-static-win64/build/build/release/CMakeFiles/CMakeTmp'
/usr/bin/make -f CMakeFiles/cmTC_20450.dir/build.make CMakeFiles/cmTC_20450.dir/build
make[2]: Entering directory '/home/vagrant/slave/monero-static-win64/build/build/release/CMakeFiles/CMakeTmp'
Building C object CMakeFiles/cmTC_20450.dir/CheckIncludeFile.c.obj

/C/msys64/mingw64/bin/x86_64-w64-mingw32-gcc.exe    -o CMakeFiles/cmTC_20450.dir/CheckIncludeFile.c.obj   -c /C/msys64/home/vagrant/slave/monero-static-win64/build/build/release/CMakeFiles/CMakeTmp/CheckIncludeFile.c
C:/msys64/home/vagrant/slave/monero-static-win64/build/build/release/CMakeFiles/CMakeTmp/CheckIncludeFile.c:1:10: fatal error: netdb.h: No such file or directory
 #include <netdb.h>
          ^~~~~~~~~
compilation terminated.

make[2]: *** [CMakeFiles/cmTC_20450.dir/build.make:66: CMakeFiles/cmTC_20450.dir/CheckIncludeFile.c.obj] Error 1
make[2]: Leaving directory '/home/vagrant/slave/monero-static-win64/build/build/release/CMakeFiles/CMakeTmp'
make[1]: *** [Makefile:121: cmTC_20450/fast] Error 2
make[1]: Leaving directory '/home/vagrant/slave/monero-static-win64/build/build/release/CMakeFiles/CMakeTmp'


Determining if the include file netinet/in.h exists failed with the following output:
Change Dir: C:/msys64/home/vagrant/slave/monero-static-win64/build/build/release/CMakeFiles/CMakeTmp

Run Build Command:"C:/msys64/usr/bin/make.exe" "cmTC_281e2/fast"
make[1]: Entering directory '/home/vagrant/slave/monero-static-win64/build/build/release/CMakeFiles/CMakeTmp'
/usr/bin/make -f CMakeFiles/cmTC_281e2.dir/build.make CMakeFiles/cmTC_281e2.dir/build
make[2]: Entering directory '/home/vagrant/slave/monero-static-win64/build/build/release/CMakeFiles/CMakeTmp'
Building C object CMakeFiles/cmTC_281e2.dir/CheckIncludeFile.c.obj

/C/msys64/mingw64/bin/x86_64-w64-mingw32-gcc.exe    -o CMakeFiles/cmTC_281e2.dir/CheckIncludeFile.c.obj   -c /C/msys64/home/vagrant/slave/monero-static-win64/build/build/release/CMakeFiles/CMakeTmp/CheckIncludeFile.c
C:/msys64/home/vagrant/slave/monero-static-win64/build/build/release/CMakeFiles/CMakeTmp/CheckIncludeFile.c:1:10: fatal error: netinet/in.h: No such file or directory
 #include <netinet/in.h>
          ^~~~~~~~~~~~~~
compilation terminated.

make[2]: *** [CMakeFiles/cmTC_281e2.dir/build.make:66: CMakeFiles/cmTC_281e2.dir/CheckIncludeFile.c.obj] Error 1
make[2]: Leaving directory '/home/vagrant/slave/monero-static-win64/build/build/release/CMakeFiles/CMakeTmp'
make[1]: *** [Makefile:121: cmTC_281e2/fast] Error 2
make[1]: Leaving directory '/home/vagrant/slave/monero-static-win64/build/build/release/CMakeFiles/CMakeTmp'


Determining if the include file pwd.h exists failed with the following output:
Change Dir: C:/msys64/home/vagrant/slave/monero-static-win64/build/build/release/CMakeFiles/CMakeTmp

Run Build Command:"C:/msys64/usr/bin/make.exe" "cmTC_e0209/fast"
make[1]: Entering directory '/home/vagrant/slave/monero-static-win64/build/build/release/CMakeFiles/CMakeTmp'
/usr/bin/make -f CMakeFiles/cmTC_e0209.dir/build.make CMakeFiles/cmTC_e0209.dir/build
make[2]: Entering directory '/home/vagrant/slave/monero-static-win64/build/build/release/CMakeFiles/CMakeTmp'
Building C object CMakeFiles/cmTC_e0209.dir/CheckIncludeFile.c.obj

/C/msys64/mingw64/bin/x86_64-w64-mingw32-gcc.exe    -o CMakeFiles/cmTC_e0209.dir/CheckIncludeFile.c.obj   -c /C/msys64/home/vagrant/slave/monero-static-win64/build/build/release/CMakeFiles/CMakeTmp/CheckIncludeFile.c
C:/msys64/home/vagrant/slave/monero-static-win64/build/build/release/CMakeFiles/CMakeTmp/CheckIncludeFile.c:1:10: fatal error: pwd.h: No such file or directory
 #include <pwd.h>
          ^~~~~~~
compilation terminated.

make[2]: *** [CMakeFiles/cmTC_e0209.dir/build.make:66: CMakeFiles/cmTC_e0209.dir/CheckIncludeFile.c.obj] Error 1
make[2]: Leaving directory '/home/vagrant/slave/monero-static-win64/build/build/release/CMakeFiles/CMakeTmp'
make[1]: *** [Makefile:121: cmTC_e0209/fast] Error 2
make[1]: Leaving directory '/home/vagrant/slave/monero-static-win64/build/build/release/CMakeFiles/CMakeTmp'


Determining if the include file sys/resource.h exists failed with the following output:
Change Dir: C:/msys64/home/vagrant/slave/monero-static-win64/build/build/release/CMakeFiles/CMakeTmp

Run Build Command:"C:/msys64/usr/bin/make.exe" "cmTC_7d65b/fast"
make[1]: Entering directory '/home/vagrant/slave/monero-static-win64/build/build/release/CMakeFiles/CMakeTmp'
/usr/bin/make -f CMakeFiles/cmTC_7d65b.dir/build.make CMakeFiles/cmTC_7d65b.dir/build
make[2]: Entering directory '/home/vagrant/slave/monero-static-win64/build/build/release/CMakeFiles/CMakeTmp'
Building C object CMakeFiles/cmTC_7d65b.dir/CheckIncludeFile.c.obj

/C/msys64/mingw64/bin/x86_64-w64-mingw32-gcc.exe    -o CMakeFiles/cmTC_7d65b.dir/CheckIncludeFile.c.obj   -c /C/msys64/home/vagrant/slave/monero-static-win64/build/build/release/CMakeFiles/CMakeTmp/CheckIncludeFile.c
C:/msys64/home/vagrant/slave/monero-static-win64/build/build/release/CMakeFiles/CMakeTmp/CheckIncludeFile.c:1:10: fatal error: sys/resource.h: No such file or directory
 #include <sys/resource.h>
          ^~~~~~~~~~~~~~~~
compilation terminated.

make[2]: *** [CMakeFiles/cmTC_7d65b.dir/build.make:66: CMakeFiles/cmTC_7d65b.dir/CheckIncludeFile.c.obj] Error 1
make[2]: Leaving directory '/home/vagrant/slave/monero-static-win64/build/build/release/CMakeFiles/CMakeTmp'
make[1]: *** [Makefile:121: cmTC_7d65b/fast] Error 2
make[1]: Leaving directory '/home/vagrant/slave/monero-static-win64/build/build/release/CMakeFiles/CMakeTmp'


Determining if the include file sys/sha2.h exists failed with the following output:
Change Dir: C:/msys64/home/vagrant/slave/monero-static-win64/build/build/release/CMakeFiles/CMakeTmp

Run Build Command:"C:/msys64/usr/bin/make.exe" "cmTC_52e28/fast"
make[1]: Entering directory '/home/vagrant/slave/monero-static-win64/build/build/release/CMakeFiles/CMakeTmp'
/usr/bin/make -f CMakeFiles/cmTC_52e28.dir/build.make CMakeFiles/cmTC_52e28.dir/build
make[2]: Entering directory '/home/vagrant/slave/monero-static-win64/build/build/release/CMakeFiles/CMakeTmp'
Building C object CMakeFiles/cmTC_52e28.dir/CheckIncludeFile.c.obj

/C/msys64/mingw64/bin/x86_64-w64-mingw32-gcc.exe    -o CMakeFiles/cmTC_52e28.dir/CheckIncludeFile.c.obj   -c /C/msys64/home/vagrant/slave/monero-static-win64/build/build/release/CMakeFiles/CMakeTmp/CheckIncludeFile.c
C:/msys64/home/vagrant/slave/monero-static-win64/build/build/release/CMakeFiles/CMakeTmp/CheckIncludeFile.c:1:10: fatal error: sys/sha2.h: No such file or directory
 #include <sys/sha2.h>
          ^~~~~~~~~~~~
compilation terminated.

make[2]: *** [CMakeFiles/cmTC_52e28.dir/build.make:66: CMakeFiles/cmTC_52e28.dir/CheckIncludeFile.c.obj] Error 1
make[2]: Leaving directory '/home/vagrant/slave/monero-static-win64/build/build/release/CMakeFiles/CMakeTmp'
make[1]: *** [Makefile:121: cmTC_52e28/fast] Error 2
make[1]: Leaving directory '/home/vagrant/slave/monero-static-win64/build/build/release/CMakeFiles/CMakeTmp'


Determining if the include file sys/socket.h exists failed with the following output:
Change Dir: C:/msys64/home/vagrant/slave/monero-static-win64/build/build/release/CMakeFiles/CMakeTmp

Run Build Command:"C:/msys64/usr/bin/make.exe" "cmTC_0fe67/fast"
make[1]: Entering directory '/home/vagrant/slave/monero-static-win64/build/build/release/CMakeFiles/CMakeTmp'
/usr/bin/make -f CMakeFiles/cmTC_0fe67.dir/build.make CMakeFiles/cmTC_0fe67.dir/build
make[2]: Entering directory '/home/vagrant/slave/monero-static-win64/build/build/release/CMakeFiles/CMakeTmp'
Building C object CMakeFiles/cmTC_0fe67.dir/CheckIncludeFile.c.obj

/C/msys64/mingw64/bin/x86_64-w64-mingw32-gcc.exe    -o CMakeFiles/cmTC_0fe67.dir/CheckIncludeFile.c.obj   -c /C/msys64/home/vagrant/slave/monero-static-win64/build/build/release/CMakeFiles/CMakeTmp/CheckIncludeFile.c
C:/msys64/home/vagrant/slave/monero-static-win64/build/build/release/CMakeFiles/CMakeTmp/CheckIncludeFile.c:1:10: fatal error: sys/socket.h: No such file or directory
 #include <sys/socket.h>
          ^~~~~~~~~~~~~~
compilation terminated.

make[2]: *** [CMakeFiles/cmTC_0fe67.dir/build.make:66: CMakeFiles/cmTC_0fe67.dir/CheckIncludeFile.c.obj] Error 1
make[2]: Leaving directory '/home/vagrant/slave/monero-static-win64/build/build/release/CMakeFiles/CMakeTmp'
make[1]: *** [Makefile:121: cmTC_0fe67/fast] Error 2
make[1]: Leaving directory '/home/vagrant/slave/monero-static-win64/build/build/release/CMakeFiles/CMakeTmp'


Determining if the include file sys/sysctl.h exists failed with the following output:
Change Dir: C:/msys64/home/vagrant/slave/monero-static-win64/build/build/release/CMakeFiles/CMakeTmp

Run Build Command:"C:/msys64/usr/bin/make.exe" "cmTC_a6345/fast"
make[1]: Entering directory '/home/vagrant/slave/monero-static-win64/build/build/release/CMakeFiles/CMakeTmp'
/usr/bin/make -f CMakeFiles/cmTC_a6345.dir/build.make CMakeFiles/cmTC_a6345.dir/build
make[2]: Entering directory '/home/vagrant/slave/monero-static-win64/build/build/release/CMakeFiles/CMakeTmp'
Building C object CMakeFiles/cmTC_a6345.dir/CheckIncludeFile.c.obj

/C/msys64/mingw64/bin/x86_64-w64-mingw32-gcc.exe    -o CMakeFiles/cmTC_a6345.dir/CheckIncludeFile.c.obj   -c /C/msys64/home/vagrant/slave/monero-static-win64/build/build/release/CMakeFiles/CMakeTmp/CheckIncludeFile.c
C:/msys64/home/vagrant/slave/monero-static-win64/build/build/release/CMakeFiles/CMakeTmp/CheckIncludeFile.c:1:10: fatal error: sys/sysctl.h: No such file or directory
 #include <sys/sysctl.h>
          ^~~~~~~~~~~~~~
compilation terminated.

make[2]: *** [CMakeFiles/cmTC_a6345.dir/build.make:66: CMakeFiles/cmTC_a6345.dir/CheckIncludeFile.c.obj] Error 1
make[2]: Leaving directory '/home/vagrant/slave/monero-static-win64/build/build/release/CMakeFiles/CMakeTmp'
make[1]: *** [Makefile:121: cmTC_a6345/fast] Error 2
make[1]: Leaving directory '/home/vagrant/slave/monero-static-win64/build/build/release/CMakeFiles/CMakeTmp'


Determining if the include file sys/uio.h exists failed with the following output:
Change Dir: C:/msys64/home/vagrant/slave/monero-static-win64/build/build/release/CMakeFiles/CMakeTmp

Run Build Command:"C:/msys64/usr/bin/make.exe" "cmTC_428e2/fast"
make[1]: Entering directory '/home/vagrant/slave/monero-static-win64/build/build/release/CMakeFiles/CMakeTmp'
/usr/bin/make -f CMakeFiles/cmTC_428e2.dir/build.make CMakeFiles/cmTC_428e2.dir/build
make[2]: Entering directory '/home/vagrant/slave/monero-static-win64/build/build/release/CMakeFiles/CMakeTmp'
Building C object CMakeFiles/cmTC_428e2.dir/CheckIncludeFile.c.obj

/C/msys64/mingw64/bin/x86_64-w64-mingw32-gcc.exe    -o CMakeFiles/cmTC_428e2.dir/CheckIncludeFile.c.obj   -c /C/msys64/home/vagrant/slave/monero-static-win64/build/build/release/CMakeFiles/CMakeTmp/CheckIncludeFile.c
C:/msys64/home/vagrant/slave/monero-static-win64/build/build/release/CMakeFiles/CMakeTmp/CheckIncludeFile.c:1:10: fatal error: sys/uio.h: No such file or directory
 #include <sys/uio.h>
          ^~~~~~~~~~~
compilation terminated.

make[2]: *** [CMakeFiles/cmTC_428e2.dir/build.make:66: CMakeFiles/cmTC_428e2.dir/CheckIncludeFile.c.obj] Error 1
make[2]: Leaving directory '/home/vagrant/slave/monero-static-win64/build/build/release/CMakeFiles/CMakeTmp'
make[1]: *** [Makefile:121: cmTC_428e2/fast] Error 2
make[1]: Leaving directory '/home/vagrant/slave/monero-static-win64/build/build/release/CMakeFiles/CMakeTmp'


Determining if the include file sys/un.h exists failed with the following output:
Change Dir: C:/msys64/home/vagrant/slave/monero-static-win64/build/build/release/CMakeFiles/CMakeTmp

Run Build Command:"C:/msys64/usr/bin/make.exe" "cmTC_19c35/fast"
make[1]: Entering directory '/home/vagrant/slave/monero-static-win64/build/build/release/CMakeFiles/CMakeTmp'
/usr/bin/make -f CMakeFiles/cmTC_19c35.dir/build.make CMakeFiles/cmTC_19c35.dir/build
make[2]: Entering directory '/home/vagrant/slave/monero-static-win64/build/build/release/CMakeFiles/CMakeTmp'
Building C object CMakeFiles/cmTC_19c35.dir/CheckIncludeFile.c.obj

/C/msys64/mingw64/bin/x86_64-w64-mingw32-gcc.exe    -o CMakeFiles/cmTC_19c35.dir/CheckIncludeFile.c.obj   -c /C/msys64/home/vagrant/slave/monero-static-win64/build/build/release/CMakeFiles/CMakeTmp/CheckIncludeFile.c
C:/msys64/home/vagrant/slave/monero-static-win64/build/build/release/CMakeFiles/CMakeTmp/CheckIncludeFile.c:1:10: fatal error: sys/un.h: No such file or directory
 #include <sys/un.h>
          ^~~~~~~~~~
compilation terminated.

make[2]: *** [CMakeFiles/cmTC_19c35.dir/build.make:66: CMakeFiles/cmTC_19c35.dir/CheckIncludeFile.c.obj] Error 1
make[2]: Leaving directory '/home/vagrant/slave/monero-static-win64/build/build/release/CMakeFiles/CMakeTmp'
make[1]: *** [Makefile:121: cmTC_19c35/fast] Error 2
make[1]: Leaving directory '/home/vagrant/slave/monero-static-win64/build/build/release/CMakeFiles/CMakeTmp'


Determining if the include file sys/wait.h exists failed with the following output:
Change Dir: C:/msys64/home/vagrant/slave/monero-static-win64/build/build/release/CMakeFiles/CMakeTmp

Run Build Command:"C:/msys64/usr/bin/make.exe" "cmTC_181c6/fast"
make[1]: Entering directory '/home/vagrant/slave/monero-static-win64/build/build/release/CMakeFiles/CMakeTmp'
/usr/bin/make -f CMakeFiles/cmTC_181c6.dir/build.make CMakeFiles/cmTC_181c6.dir/build
make[2]: Entering directory '/home/vagrant/slave/monero-static-win64/build/build/release/CMakeFiles/CMakeTmp'
Building C object CMakeFiles/cmTC_181c6.dir/CheckIncludeFile.c.obj

/C/msys64/mingw64/bin/x86_64-w64-mingw32-gcc.exe    -o CMakeFiles/cmTC_181c6.dir/CheckIncludeFile.c.obj   -c /C/msys64/home/vagrant/slave/monero-static-win64/build/build/release/CMakeFiles/CMakeTmp/CheckIncludeFile.c
C:/msys64/home/vagrant/slave/monero-static-win64/build/build/release/CMakeFiles/CMakeTmp/CheckIncludeFile.c:1:10: fatal error: sys/wait.h: No such file or directory
 #include <sys/wait.h>
          ^~~~~~~~~~~~
compilation terminated.

make[2]: *** [CMakeFiles/cmTC_181c6.dir/build.make:66: CMakeFiles/cmTC_181c6.dir/CheckIncludeFile.c.obj] Error 1
make[2]: Leaving directory '/home/vagrant/slave/monero-static-win64/build/build/release/CMakeFiles/CMakeTmp'
make[1]: *** [Makefile:121: cmTC_181c6/fast] Error 2
make[1]: Leaving directory '/home/vagrant/slave/monero-static-win64/build/build/release/CMakeFiles/CMakeTmp'


Determining if the include file syslog.h exists failed with the following output:
Change Dir: C:/msys64/home/vagrant/slave/monero-static-win64/build/build/release/CMakeFiles/CMakeTmp

Run Build Command:"C:/msys64/usr/bin/make.exe" "cmTC_4e896/fast"
make[1]: Entering directory '/home/vagrant/slave/monero-static-win64/build/build/release/CMakeFiles/CMakeTmp'
/usr/bin/make -f CMakeFiles/cmTC_4e896.dir/build.make CMakeFiles/cmTC_4e896.dir/build
make[2]: Entering directory '/home/vagrant/slave/monero-static-win64/build/build/release/CMakeFiles/CMakeTmp'
Building C object CMakeFiles/cmTC_4e896.dir/CheckIncludeFile.c.obj

/C/msys64/mingw64/bin/x86_64-w64-mingw32-gcc.exe    -o CMakeFiles/cmTC_4e896.dir/CheckIncludeFile.c.obj   -c /C/msys64/home/vagrant/slave/monero-static-win64/build/build/release/CMakeFiles/CMakeTmp/CheckIncludeFile.c
C:/msys64/home/vagrant/slave/monero-static-win64/build/build/release/CMakeFiles/CMakeTmp/CheckIncludeFile.c:1:10: fatal error: syslog.h: No such file or directory
 #include <syslog.h>
          ^~~~~~~~~~
compilation terminated.

make[2]: *** [CMakeFiles/cmTC_4e896.dir/build.make:66: CMakeFiles/cmTC_4e896.dir/CheckIncludeFile.c.obj] Error 1
make[2]: Leaving directory '/home/vagrant/slave/monero-static-win64/build/build/release/CMakeFiles/CMakeTmp'
make[1]: *** [Makefile:121: cmTC_4e896/fast] Error 2
make[1]: Leaving directory '/home/vagrant/slave/monero-static-win64/build/build/release/CMakeFiles/CMakeTmp'


Determining if the include file vfork.h exists failed with the following output:
Change Dir: C:/msys64/home/vagrant/slave/monero-static-win64/build/build/release/CMakeFiles/CMakeTmp

Run Build Command:"C:/msys64/usr/bin/make.exe" "cmTC_bc82b/fast"
make[1]: Entering directory '/home/vagrant/slave/monero-static-win64/build/build/release/CMakeFiles/CMakeTmp'
/usr/bin/make -f CMakeFiles/cmTC_bc82b.dir/build.make CMakeFiles/cmTC_bc82b.dir/build
make[2]: Entering directory '/home/vagrant/slave/monero-static-win64/build/build/release/CMakeFiles/CMakeTmp'
Building C object CMakeFiles/cmTC_bc82b.dir/CheckIncludeFile.c.obj

/C/msys64/mingw64/bin/x86_64-w64-mingw32-gcc.exe    -o CMakeFiles/cmTC_bc82b.dir/CheckIncludeFile.c.obj   -c /C/msys64/home/vagrant/slave/monero-static-win64/build/build/release/CMakeFiles/CMakeTmp/CheckIncludeFile.c
C:/msys64/home/vagrant/slave/monero-static-win64/build/build/release/CMakeFiles/CMakeTmp/CheckIncludeFile.c:1:10: fatal error: vfork.h: No such file or directory
 #include <vfork.h>
          ^~~~~~~~~
compilation terminated.

make[2]: *** [CMakeFiles/cmTC_bc82b.dir/build.make:66: CMakeFiles/cmTC_bc82b.dir/CheckIncludeFile.c.obj] Error 1
make[2]: Leaving directory '/home/vagrant/slave/monero-static-win64/build/build/release/CMakeFiles/CMakeTmp'
make[1]: *** [Makefile:121: cmTC_bc82b/fast] Error 2
make[1]: Leaving directory '/home/vagrant/slave/monero-static-win64/build/build/release/CMakeFiles/CMakeTmp'


Determining if the function arc4random exists failed with the following output:
Change Dir: C:/msys64/home/vagrant/slave/monero-static-win64/build/build/release/CMakeFiles/CMakeTmp

Run Build Command:"C:/msys64/usr/bin/make.exe" "cmTC_46277/fast"
make[1]: Entering directory '/home/vagrant/slave/monero-static-win64/build/build/release/CMakeFiles/CMakeTmp'
/usr/bin/make -f CMakeFiles/cmTC_46277.dir/build.make CMakeFiles/cmTC_46277.dir/build
make[2]: Entering directory '/home/vagrant/slave/monero-static-win64/build/build/release/CMakeFiles/CMakeTmp'
Building C object CMakeFiles/cmTC_46277.dir/CheckFunctionExists.c.obj

/C/msys64/mingw64/bin/x86_64-w64-mingw32-gcc.exe   -DCHECK_FUNCTION_EXISTS=arc4random   -o CMakeFiles/cmTC_46277.dir/CheckFunctionExists.c.obj   -c /C/msys64/mingw64/share/cmake-3.12/Modules/CheckFunctionExists.c
Linking C executable cmTC_46277.exe

/C/msys64/mingw64/bin/cmake.exe -E remove -f CMakeFiles/cmTC_46277.dir/objects.a
ar cr CMakeFiles/cmTC_46277.dir/objects.a "CMakeFiles/cmTC_46277.dir/CheckFunctionExists.c.obj" 
/C/msys64/mingw64/bin/x86_64-w64-mingw32-gcc.exe  -DCHECK_FUNCTION_EXISTS=arc4random    -Wl,--whole-archive CMakeFiles/cmTC_46277.dir/objects.a -Wl,--no-whole-archive  -o cmTC_46277.exe -Wl,--major-image-version,0,--minor-image-version,0 -liphlpapi -lws2_32 -lkernel32 -luser32 -lgdi32 -lwinspool -lshell32 -lole32 -loleaut32 -luuid -lcomdlg32 -ladvapi32 
CMakeFiles/cmTC_46277.dir/objects.a(CheckFunctionExists.c.obj):CheckFunctionExists.c:(.text+0x15): undefined reference to `arc4random'

collect2.exe: error: ld returned 1 exit status
make[2]: *** [CMakeFiles/cmTC_46277.dir/build.make:88: cmTC_46277.exe] Error 1
make[2]: Leaving directory '/home/vagrant/slave/monero-static-win64/build/build/release/CMakeFiles/CMakeTmp'
make[1]: *** [Makefile:121: cmTC_46277/fast] Error 2
make[1]: Leaving directory '/home/vagrant/slave/monero-static-win64/build/build/release/CMakeFiles/CMakeTmp'


Determining if the function arc4random_uniform exists failed with the following output:
Change Dir: C:/msys64/home/vagrant/slave/monero-static-win64/build/build/release/CMakeFiles/CMakeTmp

Run Build Command:"C:/msys64/usr/bin/make.exe" "cmTC_b5c84/fast"
make[1]: Entering directory '/home/vagrant/slave/monero-static-win64/build/build/release/CMakeFiles/CMakeTmp'
/usr/bin/make -f CMakeFiles/cmTC_b5c84.dir/build.make CMakeFiles/cmTC_b5c84.dir/build
make[2]: Entering directory '/home/vagrant/slave/monero-static-win64/build/build/release/CMakeFiles/CMakeTmp'
Building C object CMakeFiles/cmTC_b5c84.dir/CheckFunctionExists.c.obj

/C/msys64/mingw64/bin/x86_64-w64-mingw32-gcc.exe   -DCHECK_FUNCTION_EXISTS=arc4random_uniform   -o CMakeFiles/cmTC_b5c84.dir/CheckFunctionExists.c.obj   -c /C/msys64/mingw64/share/cmake-3.12/Modules/CheckFunctionExists.c
Linking C executable cmTC_b5c84.exe

/C/msys64/mingw64/bin/cmake.exe -E remove -f CMakeFiles/cmTC_b5c84.dir/objects.a
ar cr CMakeFiles/cmTC_b5c84.dir/objects.a "CMakeFiles/cmTC_b5c84.dir/CheckFunctionExists.c.obj" 
/C/msys64/mingw64/bin/x86_64-w64-mingw32-gcc.exe  -DCHECK_FUNCTION_EXISTS=arc4random_uniform    -Wl,--whole-archive CMakeFiles/cmTC_b5c84.dir/objects.a -Wl,--no-whole-archive  -o cmTC_b5c84.exe -Wl,--major-image-version,0,--minor-image-version,0 -liphlpapi -lws2_32 -lkernel32 -luser32 -lgdi32 -lwinspool -lshell32 -lole32 -loleaut32 -luuid -lcomdlg32 -ladvapi32 
CMakeFiles/cmTC_b5c84.dir/objects.a(CheckFunctionExists.c.obj):CheckFunctionExists.c:(.text+0x15): undefined reference to `arc4random_uniform'

collect2.exe: error: ld returned 1 exit status
make[2]: *** [CMakeFiles/cmTC_b5c84.dir/build.make:88: cmTC_b5c84.exe] Error 1
make[2]: Leaving directory '/home/vagrant/slave/monero-static-win64/build/build/release/CMakeFiles/CMakeTmp'
make[1]: *** [Makefile:121: cmTC_b5c84/fast] Error 2
make[1]: Leaving directory '/home/vagrant/slave/monero-static-win64/build/build/release/CMakeFiles/CMakeTmp'


Determining if the function chown exists failed with the following output:
Change Dir: C:/msys64/home/vagrant/slave/monero-static-win64/build/build/release/CMakeFiles/CMakeTmp

Run Build Command:"C:/msys64/usr/bin/make.exe" "cmTC_46875/fast"
make[1]: Entering directory '/home/vagrant/slave/monero-static-win64/build/build/release/CMakeFiles/CMakeTmp'
/usr/bin/make -f CMakeFiles/cmTC_46875.dir/build.make CMakeFiles/cmTC_46875.dir/build
make[2]: Entering directory '/home/vagrant/slave/monero-static-win64/build/build/release/CMakeFiles/CMakeTmp'
Building C object CMakeFiles/cmTC_46875.dir/CheckFunctionExists.c.obj

/C/msys64/mingw64/bin/x86_64-w64-mingw32-gcc.exe   -DCHECK_FUNCTION_EXISTS=chown   -o CMakeFiles/cmTC_46875.dir/CheckFunctionExists.c.obj   -c /C/msys64/mingw64/share/cmake-3.12/Modules/CheckFunctionExists.c
Linking C executable cmTC_46875.exe

/C/msys64/mingw64/bin/cmake.exe -E remove -f CMakeFiles/cmTC_46875.dir/objects.a
ar cr CMakeFiles/cmTC_46875.dir/objects.a "CMakeFiles/cmTC_46875.dir/CheckFunctionExists.c.obj" 
/C/msys64/mingw64/bin/x86_64-w64-mingw32-gcc.exe  -DCHECK_FUNCTION_EXISTS=chown    -Wl,--whole-archive CMakeFiles/cmTC_46875.dir/objects.a -Wl,--no-whole-archive  -o cmTC_46875.exe -Wl,--major-image-version,0,--minor-image-version,0 -liphlpapi -lws2_32 -lkernel32 -luser32 -lgdi32 -lwinspool -lshell32 -lole32 -loleaut32 -luuid -lcomdlg32 -ladvapi32 
CMakeFiles/cmTC_46875.dir/objects.a(CheckFunctionExists.c.obj):CheckFunctionExists.c:(.text+0x15): undefined reference to `chown'

collect2.exe: error: ld returned 1 exit status
make[2]: *** [CMakeFiles/cmTC_46875.dir/build.make:88: cmTC_46875.exe] Error 1
make[2]: Leaving directory '/home/vagrant/slave/monero-static-win64/build/build/release/CMakeFiles/CMakeTmp'
make[1]: *** [Makefile:121: cmTC_46875/fast] Error 2
make[1]: Leaving directory '/home/vagrant/slave/monero-static-win64/build/build/release/CMakeFiles/CMakeTmp'


Determining if the function chroot exists failed with the following output:
Change Dir: C:/msys64/home/vagrant/slave/monero-static-win64/build/build/release/CMakeFiles/CMakeTmp

Run Build Command:"C:/msys64/usr/bin/make.exe" "cmTC_aef21/fast"
make[1]: Entering directory '/home/vagrant/slave/monero-static-win64/build/build/release/CMakeFiles/CMakeTmp'
/usr/bin/make -f CMakeFiles/cmTC_aef21.dir/build.make CMakeFiles/cmTC_aef21.dir/build
make[2]: Entering directory '/home/vagrant/slave/monero-static-win64/build/build/release/CMakeFiles/CMakeTmp'
Building C object CMakeFiles/cmTC_aef21.dir/CheckFunctionExists.c.obj

/C/msys64/mingw64/bin/x86_64-w64-mingw32-gcc.exe   -DCHECK_FUNCTION_EXISTS=chroot   -o CMakeFiles/cmTC_aef21.dir/CheckFunctionExists.c.obj   -c /C/msys64/mingw64/share/cmake-3.12/Modules/CheckFunctionExists.c
Linking C executable cmTC_aef21.exe

/C/msys64/mingw64/bin/cmake.exe -E remove -f CMakeFiles/cmTC_aef21.dir/objects.a
ar cr CMakeFiles/cmTC_aef21.dir/objects.a "CMakeFiles/cmTC_aef21.dir/CheckFunctionExists.c.obj" 
/C/msys64/mingw64/bin/x86_64-w64-mingw32-gcc.exe  -DCHECK_FUNCTION_EXISTS=chroot    -Wl,--whole-archive CMakeFiles/cmTC_aef21.dir/objects.a -Wl,--no-whole-archive  -o cmTC_aef21.exe -Wl,--major-image-version,0,--minor-image-version,0 -liphlpapi -lws2_32 -lkernel32 -luser32 -lgdi32 -lwinspool -lshell32 -lole32 -loleaut32 -luuid -lcomdlg32 -ladvapi32 
CMakeFiles/cmTC_aef21.dir/objects.a(CheckFunctionExists.c.obj):CheckFunctionExists.c:(.text+0x15): undefined reference to `chroot'

collect2.exe: error: ld returned 1 exit status
make[2]: *** [CMakeFiles/cmTC_aef21.dir/build.make:88: cmTC_aef21.exe] Error 1
make[2]: Leaving directory '/home/vagrant/slave/monero-static-win64/build/build/release/CMakeFiles/CMakeTmp'
make[1]: *** [Makefile:121: cmTC_aef21/fast] Error 2
make[1]: Leaving directory '/home/vagrant/slave/monero-static-win64/build/build/release/CMakeFiles/CMakeTmp'


Determining if the function ctime_r exists failed with the following output:
Change Dir: C:/msys64/home/vagrant/slave/monero-static-win64/build/build/release/CMakeFiles/CMakeTmp

Run Build Command:"C:/msys64/usr/bin/make.exe" "cmTC_d77fc/fast"
make[1]: Entering directory '/home/vagrant/slave/monero-static-win64/build/build/release/CMakeFiles/CMakeTmp'
/usr/bin/make -f CMakeFiles/cmTC_d77fc.dir/build.make CMakeFiles/cmTC_d77fc.dir/build
make[2]: Entering directory '/home/vagrant/slave/monero-static-win64/build/build/release/CMakeFiles/CMakeTmp'
Building C object CMakeFiles/cmTC_d77fc.dir/CheckFunctionExists.c.obj

/C/msys64/mingw64/bin/x86_64-w64-mingw32-gcc.exe   -DCHECK_FUNCTION_EXISTS=ctime_r   -o CMakeFiles/cmTC_d77fc.dir/CheckFunctionExists.c.obj   -c /C/msys64/mingw64/share/cmake-3.12/Modules/CheckFunctionExists.c
Linking C executable cmTC_d77fc.exe

/C/msys64/mingw64/bin/cmake.exe -E remove -f CMakeFiles/cmTC_d77fc.dir/objects.a
ar cr CMakeFiles/cmTC_d77fc.dir/objects.a "CMakeFiles/cmTC_d77fc.dir/CheckFunctionExists.c.obj" 
/C/msys64/mingw64/bin/x86_64-w64-mingw32-gcc.exe  -DCHECK_FUNCTION_EXISTS=ctime_r    -Wl,--whole-archive CMakeFiles/cmTC_d77fc.dir/objects.a -Wl,--no-whole-archive  -o cmTC_d77fc.exe -Wl,--major-image-version,0,--minor-image-version,0 -liphlpapi -lws2_32 -lkernel32 -luser32 -lgdi32 -lwinspool -lshell32 -lole32 -loleaut32 -luuid -lcomdlg32 -ladvapi32 
CMakeFiles/cmTC_d77fc.dir/objects.a(CheckFunctionExists.c.obj):CheckFunctionExists.c:(.text+0x15): undefined reference to `ctime_r'

collect2.exe: error: ld returned 1 exit status
make[2]: *** [CMakeFiles/cmTC_d77fc.dir/build.make:88: cmTC_d77fc.exe] Error 1
make[2]: Leaving directory '/home/vagrant/slave/monero-static-win64/build/build/release/CMakeFiles/CMakeTmp'
make[1]: *** [Makefile:121: cmTC_d77fc/fast] Error 2
make[1]: Leaving directory '/home/vagrant/slave/monero-static-win64/build/build/release/CMakeFiles/CMakeTmp'


Determining if the function daemon exists failed with the following output:
Change Dir: C:/msys64/home/vagrant/slave/monero-static-win64/build/build/release/CMakeFiles/CMakeTmp

Run Build Command:"C:/msys64/usr/bin/make.exe" "cmTC_40b68/fast"
make[1]: Entering directory '/home/vagrant/slave/monero-static-win64/build/build/release/CMakeFiles/CMakeTmp'
/usr/bin/make -f CMakeFiles/cmTC_40b68.dir/build.make CMakeFiles/cmTC_40b68.dir/build
make[2]: Entering directory '/home/vagrant/slave/monero-static-win64/build/build/release/CMakeFiles/CMakeTmp'
Building C object CMakeFiles/cmTC_40b68.dir/CheckFunctionExists.c.obj

/C/msys64/mingw64/bin/x86_64-w64-mingw32-gcc.exe   -DCHECK_FUNCTION_EXISTS=daemon   -o CMakeFiles/cmTC_40b68.dir/CheckFunctionExists.c.obj   -c /C/msys64/mingw64/share/cmake-3.12/Modules/CheckFunctionExists.c
Linking C executable cmTC_40b68.exe

/C/msys64/mingw64/bin/cmake.exe -E remove -f CMakeFiles/cmTC_40b68.dir/objects.a
ar cr CMakeFiles/cmTC_40b68.dir/objects.a "CMakeFiles/cmTC_40b68.dir/CheckFunctionExists.c.obj" 
/C/msys64/mingw64/bin/x86_64-w64-mingw32-gcc.exe  -DCHECK_FUNCTION_EXISTS=daemon    -Wl,--whole-archive CMakeFiles/cmTC_40b68.dir/objects.a -Wl,--no-whole-archive  -o cmTC_40b68.exe -Wl,--major-image-version,0,--minor-image-version,0 -liphlpapi -lws2_32 -lkernel32 -luser32 -lgdi32 -lwinspool -lshell32 -lole32 -loleaut32 -luuid -lcomdlg32 -ladvapi32 
CMakeFiles/cmTC_40b68.dir/objects.a(CheckFunctionExists.c.obj):CheckFunctionExists.c:(.text+0x15): undefined reference to `daemon'

collect2.exe: error: ld returned 1 exit status
make[2]: *** [CMakeFiles/cmTC_40b68.dir/build.make:88: cmTC_40b68.exe] Error 1
make[2]: Leaving directory '/home/vagrant/slave/monero-static-win64/build/build/release/CMakeFiles/CMakeTmp'
make[1]: *** [Makefile:121: cmTC_40b68/fast] Error 2
make[1]: Leaving directory '/home/vagrant/slave/monero-static-win64/build/build/release/CMakeFiles/CMakeTmp'


Determining if the function endprotoent exists failed with the following output:
Change Dir: C:/msys64/home/vagrant/slave/monero-static-win64/build/build/release/CMakeFiles/CMakeTmp

Run Build Command:"C:/msys64/usr/bin/make.exe" "cmTC_0c3bd/fast"
make[1]: Entering directory '/home/vagrant/slave/monero-static-win64/build/build/release/CMakeFiles/CMakeTmp'
/usr/bin/make -f CMakeFiles/cmTC_0c3bd.dir/build.make CMakeFiles/cmTC_0c3bd.dir/build
make[2]: Entering directory '/home/vagrant/slave/monero-static-win64/build/build/release/CMakeFiles/CMakeTmp'
Building C object CMakeFiles/cmTC_0c3bd.dir/CheckFunctionExists.c.obj

/C/msys64/mingw64/bin/x86_64-w64-mingw32-gcc.exe   -DCHECK_FUNCTION_EXISTS=endprotoent   -o CMakeFiles/cmTC_0c3bd.dir/CheckFunctionExists.c.obj   -c /C/msys64/mingw64/share/cmake-3.12/Modules/CheckFunctionExists.c
Linking C executable cmTC_0c3bd.exe

/C/msys64/mingw64/bin/cmake.exe -E remove -f CMakeFiles/cmTC_0c3bd.dir/objects.a
ar cr CMakeFiles/cmTC_0c3bd.dir/objects.a "CMakeFiles/cmTC_0c3bd.dir/CheckFunctionExists.c.obj" 
/C/msys64/mingw64/bin/x86_64-w64-mingw32-gcc.exe  -DCHECK_FUNCTION_EXISTS=endprotoent    -Wl,--whole-archive CMakeFiles/cmTC_0c3bd.dir/objects.a -Wl,--no-whole-archive  -o cmTC_0c3bd.exe -Wl,--major-image-version,0,--minor-image-version,0 -liphlpapi -lws2_32 -lkernel32 -luser32 -lgdi32 -lwinspool -lshell32 -lole32 -loleaut32 -luuid -lcomdlg32 -ladvapi32 
CMakeFiles/cmTC_0c3bd.dir/objects.a(CheckFunctionExists.c.obj):CheckFunctionExists.c:(.text+0x15): undefined reference to `endprotoent'

collect2.exe: error: ld returned 1 exit status
make[2]: *** [CMakeFiles/cmTC_0c3bd.dir/build.make:88: cmTC_0c3bd.exe] Error 1
make[2]: Leaving directory '/home/vagrant/slave/monero-static-win64/build/build/release/CMakeFiles/CMakeTmp'
make[1]: *** [Makefile:121: cmTC_0c3bd/fast] Error 2
make[1]: Leaving directory '/home/vagrant/slave/monero-static-win64/build/build/release/CMakeFiles/CMakeTmp'


Determining if the function endservent exists failed with the following output:
Change Dir: C:/msys64/home/vagrant/slave/monero-static-win64/build/build/release/CMakeFiles/CMakeTmp

Run Build Command:"C:/msys64/usr/bin/make.exe" "cmTC_b2018/fast"
make[1]: Entering directory '/home/vagrant/slave/monero-static-win64/build/build/release/CMakeFiles/CMakeTmp'
/usr/bin/make -f CMakeFiles/cmTC_b2018.dir/build.make CMakeFiles/cmTC_b2018.dir/build
make[2]: Entering directory '/home/vagrant/slave/monero-static-win64/build/build/release/CMakeFiles/CMakeTmp'
Building C object CMakeFiles/cmTC_b2018.dir/CheckFunctionExists.c.obj

/C/msys64/mingw64/bin/x86_64-w64-mingw32-gcc.exe   -DCHECK_FUNCTION_EXISTS=endservent   -o CMakeFiles/cmTC_b2018.dir/CheckFunctionExists.c.obj   -c /C/msys64/mingw64/share/cmake-3.12/Modules/CheckFunctionExists.c
Linking C executable cmTC_b2018.exe

/C/msys64/mingw64/bin/cmake.exe -E remove -f CMakeFiles/cmTC_b2018.dir/objects.a
ar cr CMakeFiles/cmTC_b2018.dir/objects.a "CMakeFiles/cmTC_b2018.dir/CheckFunctionExists.c.obj" 
/C/msys64/mingw64/bin/x86_64-w64-mingw32-gcc.exe  -DCHECK_FUNCTION_EXISTS=endservent    -Wl,--whole-archive CMakeFiles/cmTC_b2018.dir/objects.a -Wl,--no-whole-archive  -o cmTC_b2018.exe -Wl,--major-image-version,0,--minor-image-version,0 -liphlpapi -lws2_32 -lkernel32 -luser32 -lgdi32 -lwinspool -lshell32 -lole32 -loleaut32 -luuid -lcomdlg32 -ladvapi32 
CMakeFiles/cmTC_b2018.dir/objects.a(CheckFunctionExists.c.obj):CheckFunctionExists.c:(.text+0x15): undefined reference to `endservent'

collect2.exe: error: ld returned 1 exit status
make[2]: *** [CMakeFiles/cmTC_b2018.dir/build.make:88: cmTC_b2018.exe] Error 1
make[2]: Leaving directory '/home/vagrant/slave/monero-static-win64/build/build/release/CMakeFiles/CMakeTmp'
make[1]: *** [Makefile:121: cmTC_b2018/fast] Error 2
make[1]: Leaving directory '/home/vagrant/slave/monero-static-win64/build/build/release/CMakeFiles/CMakeTmp'


Determining if the function fork exists failed with the following output:
Change Dir: C:/msys64/home/vagrant/slave/monero-static-win64/build/build/release/CMakeFiles/CMakeTmp

Run Build Command:"C:/msys64/usr/bin/make.exe" "cmTC_3286d/fast"
make[1]: Entering directory '/home/vagrant/slave/monero-static-win64/build/build/release/CMakeFiles/CMakeTmp'
/usr/bin/make -f CMakeFiles/cmTC_3286d.dir/build.make CMakeFiles/cmTC_3286d.dir/build
make[2]: Entering directory '/home/vagrant/slave/monero-static-win64/build/build/release/CMakeFiles/CMakeTmp'
Building C object CMakeFiles/cmTC_3286d.dir/CheckFunctionExists.c.obj

/C/msys64/mingw64/bin/x86_64-w64-mingw32-gcc.exe   -DCHECK_FUNCTION_EXISTS=fork   -o CMakeFiles/cmTC_3286d.dir/CheckFunctionExists.c.obj   -c /C/msys64/mingw64/share/cmake-3.12/Modules/CheckFunctionExists.c
<command-line>: warning: conflicting types for built-in function 'fork' [-Wbuiltin-declaration-mismatch]
C:/msys64/mingw64/share/cmake-3.12/Modules/CheckFunctionExists.c:7:3: note: in expansion of macro 'CHECK_FUNCTION_EXISTS'
   CHECK_FUNCTION_EXISTS(void);
   ^~~~~~~~~~~~~~~~~~~~~
Linking C executable cmTC_3286d.exe

/C/msys64/mingw64/bin/cmake.exe -E remove -f CMakeFiles/cmTC_3286d.dir/objects.a
ar cr CMakeFiles/cmTC_3286d.dir/objects.a "CMakeFiles/cmTC_3286d.dir/CheckFunctionExists.c.obj" 
/C/msys64/mingw64/bin/x86_64-w64-mingw32-gcc.exe  -DCHECK_FUNCTION_EXISTS=fork    -Wl,--whole-archive CMakeFiles/cmTC_3286d.dir/objects.a -Wl,--no-whole-archive  -o cmTC_3286d.exe -Wl,--major-image-version,0,--minor-image-version,0 -liphlpapi -lws2_32 -lkernel32 -luser32 -lgdi32 -lwinspool -lshell32 -lole32 -loleaut32 -luuid -lcomdlg32 -ladvapi32 
CMakeFiles/cmTC_3286d.dir/objects.a(CheckFunctionExists.c.obj):CheckFunctionExists.c:(.text+0x15): undefined reference to `fork'

collect2.exe: error: ld returned 1 exit status
make[2]: *** [CMakeFiles/cmTC_3286d.dir/build.make:88: cmTC_3286d.exe] Error 1
make[2]: Leaving directory '/home/vagrant/slave/monero-static-win64/build/build/release/CMakeFiles/CMakeTmp'
make[1]: *** [Makefile:121: cmTC_3286d/fast] Error 2
make[1]: Leaving directory '/home/vagrant/slave/monero-static-win64/build/build/release/CMakeFiles/CMakeTmp'


Determining if the function fsync exists failed with the following output:
Change Dir: C:/msys64/home/vagrant/slave/monero-static-win64/build/build/release/CMakeFiles/CMakeTmp

Run Build Command:"C:/msys64/usr/bin/make.exe" "cmTC_9f160/fast"
make[1]: Entering directory '/home/vagrant/slave/monero-static-win64/build/build/release/CMakeFiles/CMakeTmp'
/usr/bin/make -f CMakeFiles/cmTC_9f160.dir/build.make CMakeFiles/cmTC_9f160.dir/build
make[2]: Entering directory '/home/vagrant/slave/monero-static-win64/build/build/release/CMakeFiles/CMakeTmp'
Building C object CMakeFiles/cmTC_9f160.dir/CheckFunctionExists.c.obj

/C/msys64/mingw64/bin/x86_64-w64-mingw32-gcc.exe   -DCHECK_FUNCTION_EXISTS=fsync   -o CMakeFiles/cmTC_9f160.dir/CheckFunctionExists.c.obj   -c /C/msys64/mingw64/share/cmake-3.12/Modules/CheckFunctionExists.c
Linking C executable cmTC_9f160.exe

/C/msys64/mingw64/bin/cmake.exe -E remove -f CMakeFiles/cmTC_9f160.dir/objects.a
ar cr CMakeFiles/cmTC_9f160.dir/objects.a "CMakeFiles/cmTC_9f160.dir/CheckFunctionExists.c.obj" 
/C/msys64/mingw64/bin/x86_64-w64-mingw32-gcc.exe  -DCHECK_FUNCTION_EXISTS=fsync    -Wl,--whole-archive CMakeFiles/cmTC_9f160.dir/objects.a -Wl,--no-whole-archive  -o cmTC_9f160.exe -Wl,--major-image-version,0,--minor-image-version,0 -liphlpapi -lws2_32 -lkernel32 -luser32 -lgdi32 -lwinspool -lshell32 -lole32 -loleaut32 -luuid -lcomdlg32 -ladvapi32 
CMakeFiles/cmTC_9f160.dir/objects.a(CheckFunctionExists.c.obj):CheckFunctionExists.c:(.text+0x15): undefined reference to `fsync'

collect2.exe: error: ld returned 1 exit status
make[2]: *** [CMakeFiles/cmTC_9f160.dir/build.make:88: cmTC_9f160.exe] Error 1
make[2]: Leaving directory '/home/vagrant/slave/monero-static-win64/build/build/release/CMakeFiles/CMakeTmp'
make[1]: *** [Makefile:121: cmTC_9f160/fast] Error 2
make[1]: Leaving directory '/home/vagrant/slave/monero-static-win64/build/build/release/CMakeFiles/CMakeTmp'


Determining if the function getauxval exists failed with the following output:
Change Dir: C:/msys64/home/vagrant/slave/monero-static-win64/build/build/release/CMakeFiles/CMakeTmp

Run Build Command:"C:/msys64/usr/bin/make.exe" "cmTC_6da97/fast"
make[1]: Entering directory '/home/vagrant/slave/monero-static-win64/build/build/release/CMakeFiles/CMakeTmp'
/usr/bin/make -f CMakeFiles/cmTC_6da97.dir/build.make CMakeFiles/cmTC_6da97.dir/build
make[2]: Entering directory '/home/vagrant/slave/monero-static-win64/build/build/release/CMakeFiles/CMakeTmp'
Building C object CMakeFiles/cmTC_6da97.dir/CheckFunctionExists.c.obj

/C/msys64/mingw64/bin/x86_64-w64-mingw32-gcc.exe   -DCHECK_FUNCTION_EXISTS=getauxval   -o CMakeFiles/cmTC_6da97.dir/CheckFunctionExists.c.obj   -c /C/msys64/mingw64/share/cmake-3.12/Modules/CheckFunctionExists.c
Linking C executable cmTC_6da97.exe

/C/msys64/mingw64/bin/cmake.exe -E remove -f CMakeFiles/cmTC_6da97.dir/objects.a
ar cr CMakeFiles/cmTC_6da97.dir/objects.a "CMakeFiles/cmTC_6da97.dir/CheckFunctionExists.c.obj" 
/C/msys64/mingw64/bin/x86_64-w64-mingw32-gcc.exe  -DCHECK_FUNCTION_EXISTS=getauxval    -Wl,--whole-archive CMakeFiles/cmTC_6da97.dir/objects.a -Wl,--no-whole-archive  -o cmTC_6da97.exe -Wl,--major-image-version,0,--minor-image-version,0 -liphlpapi -lws2_32 -lkernel32 -luser32 -lgdi32 -lwinspool -lshell32 -lole32 -loleaut32 -luuid -lcomdlg32 -ladvapi32 
CMakeFiles/cmTC_6da97.dir/objects.a(CheckFunctionExists.c.obj):CheckFunctionExists.c:(.text+0x15): undefined reference to `getauxval'

collect2.exe: error: ld returned 1 exit status
make[2]: *** [CMakeFiles/cmTC_6da97.dir/build.make:88: cmTC_6da97.exe] Error 1
make[2]: Leaving directory '/home/vagrant/slave/monero-static-win64/build/build/release/CMakeFiles/CMakeTmp'
make[1]: *** [Makefile:121: cmTC_6da97/fast] Error 2
make[1]: Leaving directory '/home/vagrant/slave/monero-static-win64/build/build/release/CMakeFiles/CMakeTmp'


Determining if the function getentropy exists failed with the following output:
Change Dir: C:/msys64/home/vagrant/slave/monero-static-win64/build/build/release/CMakeFiles/CMakeTmp

Run Build Command:"C:/msys64/usr/bin/make.exe" "cmTC_39d54/fast"
make[1]: Entering directory '/home/vagrant/slave/monero-static-win64/build/build/release/CMakeFiles/CMakeTmp'
/usr/bin/make -f CMakeFiles/cmTC_39d54.dir/build.make CMakeFiles/cmTC_39d54.dir/build
make[2]: Entering directory '/home/vagrant/slave/monero-static-win64/build/build/release/CMakeFiles/CMakeTmp'
Building C object CMakeFiles/cmTC_39d54.dir/CheckFunctionExists.c.obj

/C/msys64/mingw64/bin/x86_64-w64-mingw32-gcc.exe   -DCHECK_FUNCTION_EXISTS=getentropy   -o CMakeFiles/cmTC_39d54.dir/CheckFunctionExists.c.obj   -c /C/msys64/mingw64/share/cmake-3.12/Modules/CheckFunctionExists.c
Linking C executable cmTC_39d54.exe

/C/msys64/mingw64/bin/cmake.exe -E remove -f CMakeFiles/cmTC_39d54.dir/objects.a
ar cr CMakeFiles/cmTC_39d54.dir/objects.a "CMakeFiles/cmTC_39d54.dir/CheckFunctionExists.c.obj" 
/C/msys64/mingw64/bin/x86_64-w64-mingw32-gcc.exe  -DCHECK_FUNCTION_EXISTS=getentropy    -Wl,--whole-archive CMakeFiles/cmTC_39d54.dir/objects.a -Wl,--no-whole-archive  -o cmTC_39d54.exe -Wl,--major-image-version,0,--minor-image-version,0 -liphlpapi -lws2_32 -lkernel32 -luser32 -lgdi32 -lwinspool -lshell32 -lole32 -loleaut32 -luuid -lcomdlg32 -ladvapi32 
CMakeFiles/cmTC_39d54.dir/objects.a(CheckFunctionExists.c.obj):CheckFunctionExists.c:(.text+0x15): undefined reference to `getentropy'

collect2.exe: error: ld returned 1 exit status
make[2]: *** [CMakeFiles/cmTC_39d54.dir/build.make:88: cmTC_39d54.exe] Error 1
make[2]: Leaving directory '/home/vagrant/slave/monero-static-win64/build/build/release/CMakeFiles/CMakeTmp'
make[1]: *** [Makefile:121: cmTC_39d54/fast] Error 2
make[1]: Leaving directory '/home/vagrant/slave/monero-static-win64/build/build/release/CMakeFiles/CMakeTmp'


Determining if the function getpwnam exists failed with the following output:
Change Dir: C:/msys64/home/vagrant/slave/monero-static-win64/build/build/release/CMakeFiles/CMakeTmp

Run Build Command:"C:/msys64/usr/bin/make.exe" "cmTC_c179e/fast"
make[1]: Entering directory '/home/vagrant/slave/monero-static-win64/build/build/release/CMakeFiles/CMakeTmp'
/usr/bin/make -f CMakeFiles/cmTC_c179e.dir/build.make CMakeFiles/cmTC_c179e.dir/build
make[2]: Entering directory '/home/vagrant/slave/monero-static-win64/build/build/release/CMakeFiles/CMakeTmp'
Building C object CMakeFiles/cmTC_c179e.dir/CheckFunctionExists.c.obj

/C/msys64/mingw64/bin/x86_64-w64-mingw32-gcc.exe   -DCHECK_FUNCTION_EXISTS=getpwnam   -o CMakeFiles/cmTC_c179e.dir/CheckFunctionExists.c.obj   -c /C/msys64/mingw64/share/cmake-3.12/Modules/CheckFunctionExists.c
Linking C executable cmTC_c179e.exe

/C/msys64/mingw64/bin/cmake.exe -E remove -f CMakeFiles/cmTC_c179e.dir/objects.a
ar cr CMakeFiles/cmTC_c179e.dir/objects.a "CMakeFiles/cmTC_c179e.dir/CheckFunctionExists.c.obj" 
/C/msys64/mingw64/bin/x86_64-w64-mingw32-gcc.exe  -DCHECK_FUNCTION_EXISTS=getpwnam    -Wl,--whole-archive CMakeFiles/cmTC_c179e.dir/objects.a -Wl,--no-whole-archive  -o cmTC_c179e.exe -Wl,--major-image-version,0,--minor-image-version,0 -liphlpapi -lws2_32 -lkernel32 -luser32 -lgdi32 -lwinspool -lshell32 -lole32 -loleaut32 -luuid -lcomdlg32 -ladvapi32 
CMakeFiles/cmTC_c179e.dir/objects.a(CheckFunctionExists.c.obj):CheckFunctionExists.c:(.text+0x15): undefined reference to `getpwnam'

collect2.exe: error: ld returned 1 exit status
make[2]: *** [CMakeFiles/cmTC_c179e.dir/build.make:88: cmTC_c179e.exe] Error 1
make[2]: Leaving directory '/home/vagrant/slave/monero-static-win64/build/build/release/CMakeFiles/CMakeTmp'
make[1]: *** [Makefile:121: cmTC_c179e/fast] Error 2
make[1]: Leaving directory '/home/vagrant/slave/monero-static-win64/build/build/release/CMakeFiles/CMakeTmp'


Determining if the function getrlimit exists failed with the following output:
Change Dir: C:/msys64/home/vagrant/slave/monero-static-win64/build/build/release/CMakeFiles/CMakeTmp

Run Build Command:"C:/msys64/usr/bin/make.exe" "cmTC_c12ca/fast"
make[1]: Entering directory '/home/vagrant/slave/monero-static-win64/build/build/release/CMakeFiles/CMakeTmp'
/usr/bin/make -f CMakeFiles/cmTC_c12ca.dir/build.make CMakeFiles/cmTC_c12ca.dir/build
make[2]: Entering directory '/home/vagrant/slave/monero-static-win64/build/build/release/CMakeFiles/CMakeTmp'
Building C object CMakeFiles/cmTC_c12ca.dir/CheckFunctionExists.c.obj

/C/msys64/mingw64/bin/x86_64-w64-mingw32-gcc.exe   -DCHECK_FUNCTION_EXISTS=getrlimit   -o CMakeFiles/cmTC_c12ca.dir/CheckFunctionExists.c.obj   -c /C/msys64/mingw64/share/cmake-3.12/Modules/CheckFunctionExists.c
Linking C executable cmTC_c12ca.exe

/C/msys64/mingw64/bin/cmake.exe -E remove -f CMakeFiles/cmTC_c12ca.dir/objects.a
ar cr CMakeFiles/cmTC_c12ca.dir/objects.a "CMakeFiles/cmTC_c12ca.dir/CheckFunctionExists.c.obj" 
/C/msys64/mingw64/bin/x86_64-w64-mingw32-gcc.exe  -DCHECK_FUNCTION_EXISTS=getrlimit    -Wl,--whole-archive CMakeFiles/cmTC_c12ca.dir/objects.a -Wl,--no-whole-archive  -o cmTC_c12ca.exe -Wl,--major-image-version,0,--minor-image-version,0 -liphlpapi -lws2_32 -lkernel32 -luser32 -lgdi32 -lwinspool -lshell32 -lole32 -loleaut32 -luuid -lcomdlg32 -ladvapi32 
CMakeFiles/cmTC_c12ca.dir/objects.a(CheckFunctionExists.c.obj):CheckFunctionExists.c:(.text+0x15): undefined reference to `getrlimit'

collect2.exe: error: ld returned 1 exit status
make[2]: *** [CMakeFiles/cmTC_c12ca.dir/build.make:88: cmTC_c12ca.exe] Error 1
make[2]: Leaving directory '/home/vagrant/slave/monero-static-win64/build/build/release/CMakeFiles/CMakeTmp'
make[1]: *** [Makefile:121: cmTC_c12ca/fast] Error 2
make[1]: Leaving directory '/home/vagrant/slave/monero-static-win64/build/build/release/CMakeFiles/CMakeTmp'


Determining if the function glob exists failed with the following output:
Change Dir: C:/msys64/home/vagrant/slave/monero-static-win64/build/build/release/CMakeFiles/CMakeTmp

Run Build Command:"C:/msys64/usr/bin/make.exe" "cmTC_30c46/fast"
make[1]: Entering directory '/home/vagrant/slave/monero-static-win64/build/build/release/CMakeFiles/CMakeTmp'
/usr/bin/make -f CMakeFiles/cmTC_30c46.dir/build.make CMakeFiles/cmTC_30c46.dir/build
make[2]: Entering directory '/home/vagrant/slave/monero-static-win64/build/build/release/CMakeFiles/CMakeTmp'
Building C object CMakeFiles/cmTC_30c46.dir/CheckFunctionExists.c.obj

/C/msys64/mingw64/bin/x86_64-w64-mingw32-gcc.exe   -DCHECK_FUNCTION_EXISTS=glob   -o CMakeFiles/cmTC_30c46.dir/CheckFunctionExists.c.obj   -c /C/msys64/mingw64/share/cmake-3.12/Modules/CheckFunctionExists.c
Linking C executable cmTC_30c46.exe

/C/msys64/mingw64/bin/cmake.exe -E remove -f CMakeFiles/cmTC_30c46.dir/objects.a
ar cr CMakeFiles/cmTC_30c46.dir/objects.a "CMakeFiles/cmTC_30c46.dir/CheckFunctionExists.c.obj" 
/C/msys64/mingw64/bin/x86_64-w64-mingw32-gcc.exe  -DCHECK_FUNCTION_EXISTS=glob    -Wl,--whole-archive CMakeFiles/cmTC_30c46.dir/objects.a -Wl,--no-whole-archive  -o cmTC_30c46.exe -Wl,--major-image-version,0,--minor-image-version,0 -liphlpapi -lws2_32 -lkernel32 -luser32 -lgdi32 -lwinspool -lshell32 -lole32 -loleaut32 -luuid -lcomdlg32 -ladvapi32 
CMakeFiles/cmTC_30c46.dir/objects.a(CheckFunctionExists.c.obj):CheckFunctionExists.c:(.text+0x15): undefined reference to `glob'

collect2.exe: error: ld returned 1 exit status
make[2]: *** [CMakeFiles/cmTC_30c46.dir/build.make:88: cmTC_30c46.exe] Error 1
make[2]: Leaving directory '/home/vagrant/slave/monero-static-win64/build/build/release/CMakeFiles/CMakeTmp'
make[1]: *** [Makefile:121: cmTC_30c46/fast] Error 2
make[1]: Leaving directory '/home/vagrant/slave/monero-static-win64/build/build/release/CMakeFiles/CMakeTmp'


Determining if the function gmtime_r exists failed with the following output:
Change Dir: C:/msys64/home/vagrant/slave/monero-static-win64/build/build/release/CMakeFiles/CMakeTmp

Run Build Command:"C:/msys64/usr/bin/make.exe" "cmTC_cff98/fast"
make[1]: Entering directory '/home/vagrant/slave/monero-static-win64/build/build/release/CMakeFiles/CMakeTmp'
/usr/bin/make -f CMakeFiles/cmTC_cff98.dir/build.make CMakeFiles/cmTC_cff98.dir/build
make[2]: Entering directory '/home/vagrant/slave/monero-static-win64/build/build/release/CMakeFiles/CMakeTmp'
Building C object CMakeFiles/cmTC_cff98.dir/CheckFunctionExists.c.obj

/C/msys64/mingw64/bin/x86_64-w64-mingw32-gcc.exe   -DCHECK_FUNCTION_EXISTS=gmtime_r   -o CMakeFiles/cmTC_cff98.dir/CheckFunctionExists.c.obj   -c /C/msys64/mingw64/share/cmake-3.12/Modules/CheckFunctionExists.c
Linking C executable cmTC_cff98.exe

/C/msys64/mingw64/bin/cmake.exe -E remove -f CMakeFiles/cmTC_cff98.dir/objects.a
ar cr CMakeFiles/cmTC_cff98.dir/objects.a "CMakeFiles/cmTC_cff98.dir/CheckFunctionExists.c.obj" 
/C/msys64/mingw64/bin/x86_64-w64-mingw32-gcc.exe  -DCHECK_FUNCTION_EXISTS=gmtime_r    -Wl,--whole-archive CMakeFiles/cmTC_cff98.dir/objects.a -Wl,--no-whole-archive  -o cmTC_cff98.exe -Wl,--major-image-version,0,--minor-image-version,0 -liphlpapi -lws2_32 -lkernel32 -luser32 -lgdi32 -lwinspool -lshell32 -lole32 -loleaut32 -luuid -lcomdlg32 -ladvapi32 
CMakeFiles/cmTC_cff98.dir/objects.a(CheckFunctionExists.c.obj):CheckFunctionExists.c:(.text+0x15): undefined reference to `gmtime_r'

collect2.exe: error: ld returned 1 exit status
make[2]: *** [CMakeFiles/cmTC_cff98.dir/build.make:88: cmTC_cff98.exe] Error 1
make[2]: Leaving directory '/home/vagrant/slave/monero-static-win64/build/build/release/CMakeFiles/CMakeTmp'
make[1]: *** [Makefile:121: cmTC_cff98/fast] Error 2
make[1]: Leaving directory '/home/vagrant/slave/monero-static-win64/build/build/release/CMakeFiles/CMakeTmp'


Determining if the function fcntl exists failed with the following output:
Change Dir: C:/msys64/home/vagrant/slave/monero-static-win64/build/build/release/CMakeFiles/CMakeTmp

Run Build Command:"C:/msys64/usr/bin/make.exe" "cmTC_f0038/fast"
make[1]: Entering directory '/home/vagrant/slave/monero-static-win64/build/build/release/CMakeFiles/CMakeTmp'
/usr/bin/make -f CMakeFiles/cmTC_f0038.dir/build.make CMakeFiles/cmTC_f0038.dir/build
make[2]: Entering directory '/home/vagrant/slave/monero-static-win64/build/build/release/CMakeFiles/CMakeTmp'
Building C object CMakeFiles/cmTC_f0038.dir/CheckFunctionExists.c.obj

/C/msys64/mingw64/bin/x86_64-w64-mingw32-gcc.exe   -DCHECK_FUNCTION_EXISTS=fcntl   -o CMakeFiles/cmTC_f0038.dir/CheckFunctionExists.c.obj   -c /C/msys64/mingw64/share/cmake-3.12/Modules/CheckFunctionExists.c
Linking C executable cmTC_f0038.exe

/C/msys64/mingw64/bin/cmake.exe -E remove -f CMakeFiles/cmTC_f0038.dir/objects.a
ar cr CMakeFiles/cmTC_f0038.dir/objects.a "CMakeFiles/cmTC_f0038.dir/CheckFunctionExists.c.obj" 
/C/msys64/mingw64/bin/x86_64-w64-mingw32-gcc.exe  -DCHECK_FUNCTION_EXISTS=fcntl    -Wl,--whole-archive CMakeFiles/cmTC_f0038.dir/objects.a -Wl,--no-whole-archive  -o cmTC_f0038.exe -Wl,--major-image-version,0,--minor-image-version,0 -liphlpapi -lws2_32 -lkernel32 -luser32 -lgdi32 -lwinspool -lshell32 -lole32 -loleaut32 -luuid -lcomdlg32 -ladvapi32 
CMakeFiles/cmTC_f0038.dir/objects.a(CheckFunctionExists.c.obj):CheckFunctionExists.c:(.text+0x15): undefined reference to `fcntl'

collect2.exe: error: ld returned 1 exit status
make[2]: *** [CMakeFiles/cmTC_f0038.dir/build.make:88: cmTC_f0038.exe] Error 1
make[2]: Leaving directory '/home/vagrant/slave/monero-static-win64/build/build/release/CMakeFiles/CMakeTmp'
make[1]: *** [Makefile:121: cmTC_f0038/fast] Error 2
make[1]: Leaving directory '/home/vagrant/slave/monero-static-win64/build/build/release/CMakeFiles/CMakeTmp'


Determining if the function inet_aton exists failed with the following output:
Change Dir: C:/msys64/home/vagrant/slave/monero-static-win64/build/build/release/CMakeFiles/CMakeTmp

Run Build Command:"C:/msys64/usr/bin/make.exe" "cmTC_61251/fast"
make[1]: Entering directory '/home/vagrant/slave/monero-static-win64/build/build/release/CMakeFiles/CMakeTmp'
/usr/bin/make -f CMakeFiles/cmTC_61251.dir/build.make CMakeFiles/cmTC_61251.dir/build
make[2]: Entering directory '/home/vagrant/slave/monero-static-win64/build/build/release/CMakeFiles/CMakeTmp'
Building C object CMakeFiles/cmTC_61251.dir/CheckFunctionExists.c.obj

/C/msys64/mingw64/bin/x86_64-w64-mingw32-gcc.exe   -DCHECK_FUNCTION_EXISTS=inet_aton   -o CMakeFiles/cmTC_61251.dir/CheckFunctionExists.c.obj   -c /C/msys64/mingw64/share/cmake-3.12/Modules/CheckFunctionExists.c
Linking C executable cmTC_61251.exe

/C/msys64/mingw64/bin/cmake.exe -E remove -f CMakeFiles/cmTC_61251.dir/objects.a
ar cr CMakeFiles/cmTC_61251.dir/objects.a "CMakeFiles/cmTC_61251.dir/CheckFunctionExists.c.obj" 
/C/msys64/mingw64/bin/x86_64-w64-mingw32-gcc.exe  -DCHECK_FUNCTION_EXISTS=inet_aton    -Wl,--whole-archive CMakeFiles/cmTC_61251.dir/objects.a -Wl,--no-whole-archive  -o cmTC_61251.exe -Wl,--major-image-version,0,--minor-image-version,0 -liphlpapi -lws2_32 -lkernel32 -luser32 -lgdi32 -lwinspool -lshell32 -lole32 -loleaut32 -luuid -lcomdlg32 -ladvapi32 
CMakeFiles/cmTC_61251.dir/objects.a(CheckFunctionExists.c.obj):CheckFunctionExists.c:(.text+0x15): undefined reference to `inet_aton'

collect2.exe: error: ld returned 1 exit status
make[2]: *** [CMakeFiles/cmTC_61251.dir/build.make:88: cmTC_61251.exe] Error 1
make[2]: Leaving directory '/home/vagrant/slave/monero-static-win64/build/build/release/CMakeFiles/CMakeTmp'
make[1]: *** [Makefile:121: cmTC_61251/fast] Error 2
make[1]: Leaving directory '/home/vagrant/slave/monero-static-win64/build/build/release/CMakeFiles/CMakeTmp'


Determining if the function initgroups exists failed with the following output:
Change Dir: C:/msys64/home/vagrant/slave/monero-static-win64/build/build/release/CMakeFiles/CMakeTmp

Run Build Command:"C:/msys64/usr/bin/make.exe" "cmTC_86dfe/fast"
make[1]: Entering directory '/home/vagrant/slave/monero-static-win64/build/build/release/CMakeFiles/CMakeTmp'
/usr/bin/make -f CMakeFiles/cmTC_86dfe.dir/build.make CMakeFiles/cmTC_86dfe.dir/build
make[2]: Entering directory '/home/vagrant/slave/monero-static-win64/build/build/release/CMakeFiles/CMakeTmp'
Building C object CMakeFiles/cmTC_86dfe.dir/CheckFunctionExists.c.obj

/C/msys64/mingw64/bin/x86_64-w64-mingw32-gcc.exe   -DCHECK_FUNCTION_EXISTS=initgroups   -o CMakeFiles/cmTC_86dfe.dir/CheckFunctionExists.c.obj   -c /C/msys64/mingw64/share/cmake-3.12/Modules/CheckFunctionExists.c
Linking C executable cmTC_86dfe.exe

/C/msys64/mingw64/bin/cmake.exe -E remove -f CMakeFiles/cmTC_86dfe.dir/objects.a
ar cr CMakeFiles/cmTC_86dfe.dir/objects.a "CMakeFiles/cmTC_86dfe.dir/CheckFunctionExists.c.obj" 
/C/msys64/mingw64/bin/x86_64-w64-mingw32-gcc.exe  -DCHECK_FUNCTION_EXISTS=initgroups    -Wl,--whole-archive CMakeFiles/cmTC_86dfe.dir/objects.a -Wl,--no-whole-archive  -o cmTC_86dfe.exe -Wl,--major-image-version,0,--minor-image-version,0 -liphlpapi -lws2_32 -lkernel32 -luser32 -lgdi32 -lwinspool -lshell32 -lole32 -loleaut32 -luuid -lcomdlg32 -ladvapi32 
CMakeFiles/cmTC_86dfe.dir/objects.a(CheckFunctionExists.c.obj):CheckFunctionExists.c:(.text+0x15): undefined reference to `initgroups'

collect2.exe: error: ld returned 1 exit status
make[2]: *** [CMakeFiles/cmTC_86dfe.dir/build.make:88: cmTC_86dfe.exe] Error 1
make[2]: Leaving directory '/home/vagrant/slave/monero-static-win64/build/build/release/CMakeFiles/CMakeTmp'
make[1]: *** [Makefile:121: cmTC_86dfe/fast] Error 2
make[1]: Leaving directory '/home/vagrant/slave/monero-static-win64/build/build/release/CMakeFiles/CMakeTmp'


Determining if the function kill exists failed with the following output:
Change Dir: C:/msys64/home/vagrant/slave/monero-static-win64/build/build/release/CMakeFiles/CMakeTmp

Run Build Command:"C:/msys64/usr/bin/make.exe" "cmTC_ae319/fast"
make[1]: Entering directory '/home/vagrant/slave/monero-static-win64/build/build/release/CMakeFiles/CMakeTmp'
/usr/bin/make -f CMakeFiles/cmTC_ae319.dir/build.make CMakeFiles/cmTC_ae319.dir/build
make[2]: Entering directory '/home/vagrant/slave/monero-static-win64/build/build/release/CMakeFiles/CMakeTmp'
Building C object CMakeFiles/cmTC_ae319.dir/CheckFunctionExists.c.obj

/C/msys64/mingw64/bin/x86_64-w64-mingw32-gcc.exe   -DCHECK_FUNCTION_EXISTS=kill   -o CMakeFiles/cmTC_ae319.dir/CheckFunctionExists.c.obj   -c /C/msys64/mingw64/share/cmake-3.12/Modules/CheckFunctionExists.c
Linking C executable cmTC_ae319.exe

/C/msys64/mingw64/bin/cmake.exe -E remove -f CMakeFiles/cmTC_ae319.dir/objects.a
ar cr CMakeFiles/cmTC_ae319.dir/objects.a "CMakeFiles/cmTC_ae319.dir/CheckFunctionExists.c.obj" 
/C/msys64/mingw64/bin/x86_64-w64-mingw32-gcc.exe  -DCHECK_FUNCTION_EXISTS=kill    -Wl,--whole-archive CMakeFiles/cmTC_ae319.dir/objects.a -Wl,--no-whole-archive  -o cmTC_ae319.exe -Wl,--major-image-version,0,--minor-image-version,0 -liphlpapi -lws2_32 -lkernel32 -luser32 -lgdi32 -lwinspool -lshell32 -lole32 -loleaut32 -luuid -lcomdlg32 -ladvapi32 
CMakeFiles/cmTC_ae319.dir/objects.a(CheckFunctionExists.c.obj):CheckFunctionExists.c:(.text+0x15): undefined reference to `kill'

collect2.exe: error: ld returned 1 exit status
make[2]: *** [CMakeFiles/cmTC_ae319.dir/build.make:88: cmTC_ae319.exe] Error 1
make[2]: Leaving directory '/home/vagrant/slave/monero-static-win64/build/build/release/CMakeFiles/CMakeTmp'
make[1]: *** [Makefile:121: cmTC_ae319/fast] Error 2
make[1]: Leaving directory '/home/vagrant/slave/monero-static-win64/build/build/release/CMakeFiles/CMakeTmp'


Determining if the function localtime_r exists failed with the following output:
Change Dir: C:/msys64/home/vagrant/slave/monero-static-win64/build/build/release/CMakeFiles/CMakeTmp

Run Build Command:"C:/msys64/usr/bin/make.exe" "cmTC_0b2b0/fast"
make[1]: Entering directory '/home/vagrant/slave/monero-static-win64/build/build/release/CMakeFiles/CMakeTmp'
/usr/bin/make -f CMakeFiles/cmTC_0b2b0.dir/build.make CMakeFiles/cmTC_0b2b0.dir/build
make[2]: Entering directory '/home/vagrant/slave/monero-static-win64/build/build/release/CMakeFiles/CMakeTmp'
Building C object CMakeFiles/cmTC_0b2b0.dir/CheckFunctionExists.c.obj

/C/msys64/mingw64/bin/x86_64-w64-mingw32-gcc.exe   -DCHECK_FUNCTION_EXISTS=localtime_r   -o CMakeFiles/cmTC_0b2b0.dir/CheckFunctionExists.c.obj   -c /C/msys64/mingw64/share/cmake-3.12/Modules/CheckFunctionExists.c
Linking C executable cmTC_0b2b0.exe

/C/msys64/mingw64/bin/cmake.exe -E remove -f CMakeFiles/cmTC_0b2b0.dir/objects.a
ar cr CMakeFiles/cmTC_0b2b0.dir/objects.a "CMakeFiles/cmTC_0b2b0.dir/CheckFunctionExists.c.obj" 
/C/msys64/mingw64/bin/x86_64-w64-mingw32-gcc.exe  -DCHECK_FUNCTION_EXISTS=localtime_r    -Wl,--whole-archive CMakeFiles/cmTC_0b2b0.dir/objects.a -Wl,--no-whole-archive  -o cmTC_0b2b0.exe -Wl,--major-image-version,0,--minor-image-version,0 -liphlpapi -lws2_32 -lkernel32 -luser32 -lgdi32 -lwinspool -lshell32 -lole32 -loleaut32 -luuid -lcomdlg32 -ladvapi32 
CMakeFiles/cmTC_0b2b0.dir/objects.a(CheckFunctionExists.c.obj):CheckFunctionExists.c:(.text+0x15): undefined reference to `localtime_r'

collect2.exe: error: ld returned 1 exit status
make[2]: *** [CMakeFiles/cmTC_0b2b0.dir/build.make:88: cmTC_0b2b0.exe] Error 1
make[2]: Leaving directory '/home/vagrant/slave/monero-static-win64/build/build/release/CMakeFiles/CMakeTmp'
make[1]: *** [Makefile:121: cmTC_0b2b0/fast] Error 2
make[1]: Leaving directory '/home/vagrant/slave/monero-static-win64/build/build/release/CMakeFiles/CMakeTmp'


Determining if the function random exists failed with the following output:
Change Dir: C:/msys64/home/vagrant/slave/monero-static-win64/build/build/release/CMakeFiles/CMakeTmp

Run Build Command:"C:/msys64/usr/bin/make.exe" "cmTC_be3db/fast"
make[1]: Entering directory '/home/vagrant/slave/monero-static-win64/build/build/release/CMakeFiles/CMakeTmp'
/usr/bin/make -f CMakeFiles/cmTC_be3db.dir/build.make CMakeFiles/cmTC_be3db.dir/build
make[2]: Entering directory '/home/vagrant/slave/monero-static-win64/build/build/release/CMakeFiles/CMakeTmp'
Building C object CMakeFiles/cmTC_be3db.dir/CheckFunctionExists.c.obj

/C/msys64/mingw64/bin/x86_64-w64-mingw32-gcc.exe   -DCHECK_FUNCTION_EXISTS=random   -o CMakeFiles/cmTC_be3db.dir/CheckFunctionExists.c.obj   -c /C/msys64/mingw64/share/cmake-3.12/Modules/CheckFunctionExists.c
Linking C executable cmTC_be3db.exe

/C/msys64/mingw64/bin/cmake.exe -E remove -f CMakeFiles/cmTC_be3db.dir/objects.a
ar cr CMakeFiles/cmTC_be3db.dir/objects.a "CMakeFiles/cmTC_be3db.dir/CheckFunctionExists.c.obj" 
/C/msys64/mingw64/bin/x86_64-w64-mingw32-gcc.exe  -DCHECK_FUNCTION_EXISTS=random    -Wl,--whole-archive CMakeFiles/cmTC_be3db.dir/objects.a -Wl,--no-whole-archive  -o cmTC_be3db.exe -Wl,--major-image-version,0,--minor-image-version,0 -liphlpapi -lws2_32 -lkernel32 -luser32 -lgdi32 -lwinspool -lshell32 -lole32 -loleaut32 -luuid -lcomdlg32 -ladvapi32 
CMakeFiles/cmTC_be3db.dir/objects.a(CheckFunctionExists.c.obj):CheckFunctionExists.c:(.text+0x15): undefined reference to `random'

collect2.exe: error: ld returned 1 exit status
make[2]: *** [CMakeFiles/cmTC_be3db.dir/build.make:88: cmTC_be3db.exe] Error 1
make[2]: Leaving directory '/home/vagrant/slave/monero-static-win64/build/build/release/CMakeFiles/CMakeTmp'
make[1]: *** [Makefile:121: cmTC_be3db/fast] Error 2
make[1]: Leaving directory '/home/vagrant/slave/monero-static-win64/build/build/release/CMakeFiles/CMakeTmp'


Determining if the function reallocarray exists failed with the following output:
Change Dir: C:/msys64/home/vagrant/slave/monero-static-win64/build/build/release/CMakeFiles/CMakeTmp

Run Build Command:"C:/msys64/usr/bin/make.exe" "cmTC_cb706/fast"
make[1]: Entering directory '/home/vagrant/slave/monero-static-win64/build/build/release/CMakeFiles/CMakeTmp'
/usr/bin/make -f CMakeFiles/cmTC_cb706.dir/build.make CMakeFiles/cmTC_cb706.dir/build
make[2]: Entering directory '/home/vagrant/slave/monero-static-win64/build/build/release/CMakeFiles/CMakeTmp'
Building C object CMakeFiles/cmTC_cb706.dir/CheckFunctionExists.c.obj

/C/msys64/mingw64/bin/x86_64-w64-mingw32-gcc.exe   -DCHECK_FUNCTION_EXISTS=reallocarray   -o CMakeFiles/cmTC_cb706.dir/CheckFunctionExists.c.obj   -c /C/msys64/mingw64/share/cmake-3.12/Modules/CheckFunctionExists.c
Linking C executable cmTC_cb706.exe

/C/msys64/mingw64/bin/cmake.exe -E remove -f CMakeFiles/cmTC_cb706.dir/objects.a
ar cr CMakeFiles/cmTC_cb706.dir/objects.a "CMakeFiles/cmTC_cb706.dir/CheckFunctionExists.c.obj" 
/C/msys64/mingw64/bin/x86_64-w64-mingw32-gcc.exe  -DCHECK_FUNCTION_EXISTS=reallocarray    -Wl,--whole-archive CMakeFiles/cmTC_cb706.dir/objects.a -Wl,--no-whole-archive  -o cmTC_cb706.exe -Wl,--major-image-version,0,--minor-image-version,0 -liphlpapi -lws2_32 -lkernel32 -luser32 -lgdi32 -lwinspool -lshell32 -lole32 -loleaut32 -luuid -lcomdlg32 -ladvapi32 
CMakeFiles/cmTC_cb706.dir/objects.a(CheckFunctionExists.c.obj):CheckFunctionExists.c:(.text+0x15): undefined reference to `reallocarray'

collect2.exe: error: ld returned 1 exit status
make[2]: *** [CMakeFiles/cmTC_cb706.dir/build.make:88: cmTC_cb706.exe] Error 1
make[2]: Leaving directory '/home/vagrant/slave/monero-static-win64/build/build/release/CMakeFiles/CMakeTmp'
make[1]: *** [Makefile:121: cmTC_cb706/fast] Error 2
make[1]: Leaving directory '/home/vagrant/slave/monero-static-win64/build/build/release/CMakeFiles/CMakeTmp'


Determining if the function recvmsg exists failed with the following output:
Change Dir: C:/msys64/home/vagrant/slave/monero-static-win64/build/build/release/CMakeFiles/CMakeTmp

Run Build Command:"C:/msys64/usr/bin/make.exe" "cmTC_deea7/fast"
make[1]: Entering directory '/home/vagrant/slave/monero-static-win64/build/build/release/CMakeFiles/CMakeTmp'
/usr/bin/make -f CMakeFiles/cmTC_deea7.dir/build.make CMakeFiles/cmTC_deea7.dir/build
make[2]: Entering directory '/home/vagrant/slave/monero-static-win64/build/build/release/CMakeFiles/CMakeTmp'
Building C object CMakeFiles/cmTC_deea7.dir/CheckFunctionExists.c.obj

/C/msys64/mingw64/bin/x86_64-w64-mingw32-gcc.exe   -DCHECK_FUNCTION_EXISTS=recvmsg   -o CMakeFiles/cmTC_deea7.dir/CheckFunctionExists.c.obj   -c /C/msys64/mingw64/share/cmake-3.12/Modules/CheckFunctionExists.c
Linking C executable cmTC_deea7.exe

/C/msys64/mingw64/bin/cmake.exe -E remove -f CMakeFiles/cmTC_deea7.dir/objects.a
ar cr CMakeFiles/cmTC_deea7.dir/objects.a "CMakeFiles/cmTC_deea7.dir/CheckFunctionExists.c.obj" 
/C/msys64/mingw64/bin/x86_64-w64-mingw32-gcc.exe  -DCHECK_FUNCTION_EXISTS=recvmsg    -Wl,--whole-archive CMakeFiles/cmTC_deea7.dir/objects.a -Wl,--no-whole-archive  -o cmTC_deea7.exe -Wl,--major-image-version,0,--minor-image-version,0 -liphlpapi -lws2_32 -lkernel32 -luser32 -lgdi32 -lwinspool -lshell32 -lole32 -loleaut32 -luuid -lcomdlg32 -ladvapi32 
CMakeFiles/cmTC_deea7.dir/objects.a(CheckFunctionExists.c.obj):CheckFunctionExists.c:(.text+0x15): undefined reference to `recvmsg'

collect2.exe: error: ld returned 1 exit status
make[2]: *** [CMakeFiles/cmTC_deea7.dir/build.make:88: cmTC_deea7.exe] Error 1
make[2]: Leaving directory '/home/vagrant/slave/monero-static-win64/build/build/release/CMakeFiles/CMakeTmp'
make[1]: *** [Makefile:121: cmTC_deea7/fast] Error 2
make[1]: Leaving directory '/home/vagrant/slave/monero-static-win64/build/build/release/CMakeFiles/CMakeTmp'


Determining if the function sbrk exists failed with the following output:
Change Dir: C:/msys64/home/vagrant/slave/monero-static-win64/build/build/release/CMakeFiles/CMakeTmp

Run Build Command:"C:/msys64/usr/bin/make.exe" "cmTC_2b2a8/fast"
make[1]: Entering directory '/home/vagrant/slave/monero-static-win64/build/build/release/CMakeFiles/CMakeTmp'
/usr/bin/make -f CMakeFiles/cmTC_2b2a8.dir/build.make CMakeFiles/cmTC_2b2a8.dir/build
make[2]: Entering directory '/home/vagrant/slave/monero-static-win64/build/build/release/CMakeFiles/CMakeTmp'
Building C object CMakeFiles/cmTC_2b2a8.dir/CheckFunctionExists.c.obj

/C/msys64/mingw64/bin/x86_64-w64-mingw32-gcc.exe   -DCHECK_FUNCTION_EXISTS=sbrk   -o CMakeFiles/cmTC_2b2a8.dir/CheckFunctionExists.c.obj   -c /C/msys64/mingw64/share/cmake-3.12/Modules/CheckFunctionExists.c
Linking C executable cmTC_2b2a8.exe

/C/msys64/mingw64/bin/cmake.exe -E remove -f CMakeFiles/cmTC_2b2a8.dir/objects.a
ar cr CMakeFiles/cmTC_2b2a8.dir/objects.a "CMakeFiles/cmTC_2b2a8.dir/CheckFunctionExists.c.obj" 
/C/msys64/mingw64/bin/x86_64-w64-mingw32-gcc.exe  -DCHECK_FUNCTION_EXISTS=sbrk    -Wl,--whole-archive CMakeFiles/cmTC_2b2a8.dir/objects.a -Wl,--no-whole-archive  -o cmTC_2b2a8.exe -Wl,--major-image-version,0,--minor-image-version,0 -liphlpapi -lws2_32 -lkernel32 -luser32 -lgdi32 -lwinspool -lshell32 -lole32 -loleaut32 -luuid -lcomdlg32 -ladvapi32 
CMakeFiles/cmTC_2b2a8.dir/objects.a(CheckFunctionExists.c.obj):CheckFunctionExists.c:(.text+0x15): undefined reference to `sbrk'

collect2.exe: error: ld returned 1 exit status
make[2]: *** [CMakeFiles/cmTC_2b2a8.dir/build.make:88: cmTC_2b2a8.exe] Error 1
make[2]: Leaving directory '/home/vagrant/slave/monero-static-win64/build/build/release/CMakeFiles/CMakeTmp'
make[1]: *** [Makefile:121: cmTC_2b2a8/fast] Error 2
make[1]: Leaving directory '/home/vagrant/slave/monero-static-win64/build/build/release/CMakeFiles/CMakeTmp'


Determining if the function sendmsg exists failed with the following output:
Change Dir: C:/msys64/home/vagrant/slave/monero-static-win64/build/build/release/CMakeFiles/CMakeTmp

Run Build Command:"C:/msys64/usr/bin/make.exe" "cmTC_9f795/fast"
make[1]: Entering directory '/home/vagrant/slave/monero-static-win64/build/build/release/CMakeFiles/CMakeTmp'
/usr/bin/make -f CMakeFiles/cmTC_9f795.dir/build.make CMakeFiles/cmTC_9f795.dir/build
make[2]: Entering directory '/home/vagrant/slave/monero-static-win64/build/build/release/CMakeFiles/CMakeTmp'
Building C object CMakeFiles/cmTC_9f795.dir/CheckFunctionExists.c.obj

/C/msys64/mingw64/bin/x86_64-w64-mingw32-gcc.exe   -DCHECK_FUNCTION_EXISTS=sendmsg   -o CMakeFiles/cmTC_9f795.dir/CheckFunctionExists.c.obj   -c /C/msys64/mingw64/share/cmake-3.12/Modules/CheckFunctionExists.c
Linking C executable cmTC_9f795.exe

/C/msys64/mingw64/bin/cmake.exe -E remove -f CMakeFiles/cmTC_9f795.dir/objects.a
ar cr CMakeFiles/cmTC_9f795.dir/objects.a "CMakeFiles/cmTC_9f795.dir/CheckFunctionExists.c.obj" 
/C/msys64/mingw64/bin/x86_64-w64-mingw32-gcc.exe  -DCHECK_FUNCTION_EXISTS=sendmsg    -Wl,--whole-archive CMakeFiles/cmTC_9f795.dir/objects.a -Wl,--no-whole-archive  -o cmTC_9f795.exe -Wl,--major-image-version,0,--minor-image-version,0 -liphlpapi -lws2_32 -lkernel32 -luser32 -lgdi32 -lwinspool -lshell32 -lole32 -loleaut32 -luuid -lcomdlg32 -ladvapi32 
CMakeFiles/cmTC_9f795.dir/objects.a(CheckFunctionExists.c.obj):CheckFunctionExists.c:(.text+0x15): undefined reference to `sendmsg'

collect2.exe: error: ld returned 1 exit status
make[2]: *** [CMakeFiles/cmTC_9f795.dir/build.make:88: cmTC_9f795.exe] Error 1
make[2]: Leaving directory '/home/vagrant/slave/monero-static-win64/build/build/release/CMakeFiles/CMakeTmp'
make[1]: *** [Makefile:121: cmTC_9f795/fast] Error 2
make[1]: Leaving directory '/home/vagrant/slave/monero-static-win64/build/build/release/CMakeFiles/CMakeTmp'


Determining if the function setregid exists failed with the following output:
Change Dir: C:/msys64/home/vagrant/slave/monero-static-win64/build/build/release/CMakeFiles/CMakeTmp

Run Build Command:"C:/msys64/usr/bin/make.exe" "cmTC_842fe/fast"
make[1]: Entering directory '/home/vagrant/slave/monero-static-win64/build/build/release/CMakeFiles/CMakeTmp'
/usr/bin/make -f CMakeFiles/cmTC_842fe.dir/build.make CMakeFiles/cmTC_842fe.dir/build
make[2]: Entering directory '/home/vagrant/slave/monero-static-win64/build/build/release/CMakeFiles/CMakeTmp'
Building C object CMakeFiles/cmTC_842fe.dir/CheckFunctionExists.c.obj

/C/msys64/mingw64/bin/x86_64-w64-mingw32-gcc.exe   -DCHECK_FUNCTION_EXISTS=setregid   -o CMakeFiles/cmTC_842fe.dir/CheckFunctionExists.c.obj   -c /C/msys64/mingw64/share/cmake-3.12/Modules/CheckFunctionExists.c
Linking C executable cmTC_842fe.exe

/C/msys64/mingw64/bin/cmake.exe -E remove -f CMakeFiles/cmTC_842fe.dir/objects.a
ar cr CMakeFiles/cmTC_842fe.dir/objects.a "CMakeFiles/cmTC_842fe.dir/CheckFunctionExists.c.obj" 
/C/msys64/mingw64/bin/x86_64-w64-mingw32-gcc.exe  -DCHECK_FUNCTION_EXISTS=setregid    -Wl,--whole-archive CMakeFiles/cmTC_842fe.dir/objects.a -Wl,--no-whole-archive  -o cmTC_842fe.exe -Wl,--major-image-version,0,--minor-image-version,0 -liphlpapi -lws2_32 -lkernel32 -luser32 -lgdi32 -lwinspool -lshell32 -lole32 -loleaut32 -luuid -lcomdlg32 -ladvapi32 
CMakeFiles/cmTC_842fe.dir/objects.a(CheckFunctionExists.c.obj):CheckFunctionExists.c:(.text+0x15): undefined reference to `setregid'

collect2.exe: error: ld returned 1 exit status
make[2]: *** [CMakeFiles/cmTC_842fe.dir/build.make:88: cmTC_842fe.exe] Error 1
make[2]: Leaving directory '/home/vagrant/slave/monero-static-win64/build/build/release/CMakeFiles/CMakeTmp'
make[1]: *** [Makefile:121: cmTC_842fe/fast] Error 2
make[1]: Leaving directory '/home/vagrant/slave/monero-static-win64/build/build/release/CMakeFiles/CMakeTmp'


Determining if the function setresgid exists failed with the following output:
Change Dir: C:/msys64/home/vagrant/slave/monero-static-win64/build/build/release/CMakeFiles/CMakeTmp

Run Build Command:"C:/msys64/usr/bin/make.exe" "cmTC_1824c/fast"
make[1]: Entering directory '/home/vagrant/slave/monero-static-win64/build/build/release/CMakeFiles/CMakeTmp'
/usr/bin/make -f CMakeFiles/cmTC_1824c.dir/build.make CMakeFiles/cmTC_1824c.dir/build
make[2]: Entering directory '/home/vagrant/slave/monero-static-win64/build/build/release/CMakeFiles/CMakeTmp'
Building C object CMakeFiles/cmTC_1824c.dir/CheckFunctionExists.c.obj

/C/msys64/mingw64/bin/x86_64-w64-mingw32-gcc.exe   -DCHECK_FUNCTION_EXISTS=setresgid   -o CMakeFiles/cmTC_1824c.dir/CheckFunctionExists.c.obj   -c /C/msys64/mingw64/share/cmake-3.12/Modules/CheckFunctionExists.c
Linking C executable cmTC_1824c.exe

/C/msys64/mingw64/bin/cmake.exe -E remove -f CMakeFiles/cmTC_1824c.dir/objects.a
ar cr CMakeFiles/cmTC_1824c.dir/objects.a "CMakeFiles/cmTC_1824c.dir/CheckFunctionExists.c.obj" 
/C/msys64/mingw64/bin/x86_64-w64-mingw32-gcc.exe  -DCHECK_FUNCTION_EXISTS=setresgid    -Wl,--whole-archive CMakeFiles/cmTC_1824c.dir/objects.a -Wl,--no-whole-archive  -o cmTC_1824c.exe -Wl,--major-image-version,0,--minor-image-version,0 -liphlpapi -lws2_32 -lkernel32 -luser32 -lgdi32 -lwinspool -lshell32 -lole32 -loleaut32 -luuid -lcomdlg32 -ladvapi32 
CMakeFiles/cmTC_1824c.dir/objects.a(CheckFunctionExists.c.obj):CheckFunctionExists.c:(.text+0x15): undefined reference to `setresgid'

collect2.exe: error: ld returned 1 exit status
make[2]: *** [CMakeFiles/cmTC_1824c.dir/build.make:88: cmTC_1824c.exe] Error 1
make[2]: Leaving directory '/home/vagrant/slave/monero-static-win64/build/build/release/CMakeFiles/CMakeTmp'
make[1]: *** [Makefile:121: cmTC_1824c/fast] Error 2
make[1]: Leaving directory '/home/vagrant/slave/monero-static-win64/build/build/release/CMakeFiles/CMakeTmp'


Determining if the function setresuid exists failed with the following output:
Change Dir: C:/msys64/home/vagrant/slave/monero-static-win64/build/build/release/CMakeFiles/CMakeTmp

Run Build Command:"C:/msys64/usr/bin/make.exe" "cmTC_3bff9/fast"
make[1]: Entering directory '/home/vagrant/slave/monero-static-win64/build/build/release/CMakeFiles/CMakeTmp'
/usr/bin/make -f CMakeFiles/cmTC_3bff9.dir/build.make CMakeFiles/cmTC_3bff9.dir/build
make[2]: Entering directory '/home/vagrant/slave/monero-static-win64/build/build/release/CMakeFiles/CMakeTmp'
Building C object CMakeFiles/cmTC_3bff9.dir/CheckFunctionExists.c.obj

/C/msys64/mingw64/bin/x86_64-w64-mingw32-gcc.exe   -DCHECK_FUNCTION_EXISTS=setresuid   -o CMakeFiles/cmTC_3bff9.dir/CheckFunctionExists.c.obj   -c /C/msys64/mingw64/share/cmake-3.12/Modules/CheckFunctionExists.c
Linking C executable cmTC_3bff9.exe

/C/msys64/mingw64/bin/cmake.exe -E remove -f CMakeFiles/cmTC_3bff9.dir/objects.a
ar cr CMakeFiles/cmTC_3bff9.dir/objects.a "CMakeFiles/cmTC_3bff9.dir/CheckFunctionExists.c.obj" 
/C/msys64/mingw64/bin/x86_64-w64-mingw32-gcc.exe  -DCHECK_FUNCTION_EXISTS=setresuid    -Wl,--whole-archive CMakeFiles/cmTC_3bff9.dir/objects.a -Wl,--no-whole-archive  -o cmTC_3bff9.exe -Wl,--major-image-version,0,--minor-image-version,0 -liphlpapi -lws2_32 -lkernel32 -luser32 -lgdi32 -lwinspool -lshell32 -lole32 -loleaut32 -luuid -lcomdlg32 -ladvapi32 
CMakeFiles/cmTC_3bff9.dir/objects.a(CheckFunctionExists.c.obj):CheckFunctionExists.c:(.text+0x15): undefined reference to `setresuid'

collect2.exe: error: ld returned 1 exit status
make[2]: *** [CMakeFiles/cmTC_3bff9.dir/build.make:88: cmTC_3bff9.exe] Error 1
make[2]: Leaving directory '/home/vagrant/slave/monero-static-win64/build/build/release/CMakeFiles/CMakeTmp'
make[1]: *** [Makefile:121: cmTC_3bff9/fast] Error 2
make[1]: Leaving directory '/home/vagrant/slave/monero-static-win64/build/build/release/CMakeFiles/CMakeTmp'


Determining if the function setreuid exists failed with the following output:
Change Dir: C:/msys64/home/vagrant/slave/monero-static-win64/build/build/release/CMakeFiles/CMakeTmp

Run Build Command:"C:/msys64/usr/bin/make.exe" "cmTC_074ec/fast"
make[1]: Entering directory '/home/vagrant/slave/monero-static-win64/build/build/release/CMakeFiles/CMakeTmp'
/usr/bin/make -f CMakeFiles/cmTC_074ec.dir/build.make CMakeFiles/cmTC_074ec.dir/build
make[2]: Entering directory '/home/vagrant/slave/monero-static-win64/build/build/release/CMakeFiles/CMakeTmp'
Building C object CMakeFiles/cmTC_074ec.dir/CheckFunctionExists.c.obj

/C/msys64/mingw64/bin/x86_64-w64-mingw32-gcc.exe   -DCHECK_FUNCTION_EXISTS=setreuid   -o CMakeFiles/cmTC_074ec.dir/CheckFunctionExists.c.obj   -c /C/msys64/mingw64/share/cmake-3.12/Modules/CheckFunctionExists.c
Linking C executable cmTC_074ec.exe

/C/msys64/mingw64/bin/cmake.exe -E remove -f CMakeFiles/cmTC_074ec.dir/objects.a
ar cr CMakeFiles/cmTC_074ec.dir/objects.a "CMakeFiles/cmTC_074ec.dir/CheckFunctionExists.c.obj" 
/C/msys64/mingw64/bin/x86_64-w64-mingw32-gcc.exe  -DCHECK_FUNCTION_EXISTS=setreuid    -Wl,--whole-archive CMakeFiles/cmTC_074ec.dir/objects.a -Wl,--no-whole-archive  -o cmTC_074ec.exe -Wl,--major-image-version,0,--minor-image-version,0 -liphlpapi -lws2_32 -lkernel32 -luser32 -lgdi32 -lwinspool -lshell32 -lole32 -loleaut32 -luuid -lcomdlg32 -ladvapi32 
CMakeFiles/cmTC_074ec.dir/objects.a(CheckFunctionExists.c.obj):CheckFunctionExists.c:(.text+0x15): undefined reference to `setreuid'

collect2.exe: error: ld returned 1 exit status
make[2]: *** [CMakeFiles/cmTC_074ec.dir/build.make:88: cmTC_074ec.exe] Error 1
make[2]: Leaving directory '/home/vagrant/slave/monero-static-win64/build/build/release/CMakeFiles/CMakeTmp'
make[1]: *** [Makefile:121: cmTC_074ec/fast] Error 2
make[1]: Leaving directory '/home/vagrant/slave/monero-static-win64/build/build/release/CMakeFiles/CMakeTmp'


Determining if the function setrlimit exists failed with the following output:
Change Dir: C:/msys64/home/vagrant/slave/monero-static-win64/build/build/release/CMakeFiles/CMakeTmp

Run Build Command:"C:/msys64/usr/bin/make.exe" "cmTC_61e4e/fast"
make[1]: Entering directory '/home/vagrant/slave/monero-static-win64/build/build/release/CMakeFiles/CMakeTmp'
/usr/bin/make -f CMakeFiles/cmTC_61e4e.dir/build.make CMakeFiles/cmTC_61e4e.dir/build
make[2]: Entering directory '/home/vagrant/slave/monero-static-win64/build/build/release/CMakeFiles/CMakeTmp'
Building C object CMakeFiles/cmTC_61e4e.dir/CheckFunctionExists.c.obj

/C/msys64/mingw64/bin/x86_64-w64-mingw32-gcc.exe   -DCHECK_FUNCTION_EXISTS=setrlimit   -o CMakeFiles/cmTC_61e4e.dir/CheckFunctionExists.c.obj   -c /C/msys64/mingw64/share/cmake-3.12/Modules/CheckFunctionExists.c
Linking C executable cmTC_61e4e.exe

/C/msys64/mingw64/bin/cmake.exe -E remove -f CMakeFiles/cmTC_61e4e.dir/objects.a
ar cr CMakeFiles/cmTC_61e4e.dir/objects.a "CMakeFiles/cmTC_61e4e.dir/CheckFunctionExists.c.obj" 
/C/msys64/mingw64/bin/x86_64-w64-mingw32-gcc.exe  -DCHECK_FUNCTION_EXISTS=setrlimit    -Wl,--whole-archive CMakeFiles/cmTC_61e4e.dir/objects.a -Wl,--no-whole-archive  -o cmTC_61e4e.exe -Wl,--major-image-version,0,--minor-image-version,0 -liphlpapi -lws2_32 -lkernel32 -luser32 -lgdi32 -lwinspool -lshell32 -lole32 -loleaut32 -luuid -lcomdlg32 -ladvapi32 
CMakeFiles/cmTC_61e4e.dir/objects.a(CheckFunctionExists.c.obj):CheckFunctionExists.c:(.text+0x15): undefined reference to `setrlimit'

collect2.exe: error: ld returned 1 exit status
make[2]: *** [CMakeFiles/cmTC_61e4e.dir/build.make:88: cmTC_61e4e.exe] Error 1
make[2]: Leaving directory '/home/vagrant/slave/monero-static-win64/build/build/release/CMakeFiles/CMakeTmp'
make[1]: *** [Makefile:121: cmTC_61e4e/fast] Error 2
make[1]: Leaving directory '/home/vagrant/slave/monero-static-win64/build/build/release/CMakeFiles/CMakeTmp'


Determining if the function setsid exists failed with the following output:
Change Dir: C:/msys64/home/vagrant/slave/monero-static-win64/build/build/release/CMakeFiles/CMakeTmp

Run Build Command:"C:/msys64/usr/bin/make.exe" "cmTC_6d881/fast"
make[1]: Entering directory '/home/vagrant/slave/monero-static-win64/build/build/release/CMakeFiles/CMakeTmp'
/usr/bin/make -f CMakeFiles/cmTC_6d881.dir/build.make CMakeFiles/cmTC_6d881.dir/build
make[2]: Entering directory '/home/vagrant/slave/monero-static-win64/build/build/release/CMakeFiles/CMakeTmp'
Building C object CMakeFiles/cmTC_6d881.dir/CheckFunctionExists.c.obj

/C/msys64/mingw64/bin/x86_64-w64-mingw32-gcc.exe   -DCHECK_FUNCTION_EXISTS=setsid   -o CMakeFiles/cmTC_6d881.dir/CheckFunctionExists.c.obj   -c /C/msys64/mingw64/share/cmake-3.12/Modules/CheckFunctionExists.c
Linking C executable cmTC_6d881.exe

/C/msys64/mingw64/bin/cmake.exe -E remove -f CMakeFiles/cmTC_6d881.dir/objects.a
ar cr CMakeFiles/cmTC_6d881.dir/objects.a "CMakeFiles/cmTC_6d881.dir/CheckFunctionExists.c.obj" 
/C/msys64/mingw64/bin/x86_64-w64-mingw32-gcc.exe  -DCHECK_FUNCTION_EXISTS=setsid    -Wl,--whole-archive CMakeFiles/cmTC_6d881.dir/objects.a -Wl,--no-whole-archive  -o cmTC_6d881.exe -Wl,--major-image-version,0,--minor-image-version,0 -liphlpapi -lws2_32 -lkernel32 -luser32 -lgdi32 -lwinspool -lshell32 -lole32 -loleaut32 -luuid -lcomdlg32 -ladvapi32 
CMakeFiles/cmTC_6d881.dir/objects.a(CheckFunctionExists.c.obj):CheckFunctionExists.c:(.text+0x15): undefined reference to `setsid'

collect2.exe: error: ld returned 1 exit status
make[2]: *** [CMakeFiles/cmTC_6d881.dir/build.make:88: cmTC_6d881.exe] Error 1
make[2]: Leaving directory '/home/vagrant/slave/monero-static-win64/build/build/release/CMakeFiles/CMakeTmp'
make[1]: *** [Makefile:121: cmTC_6d881/fast] Error 2
make[1]: Leaving directory '/home/vagrant/slave/monero-static-win64/build/build/release/CMakeFiles/CMakeTmp'


Determining if the function setusercontent exists failed with the following output:
Change Dir: C:/msys64/home/vagrant/slave/monero-static-win64/build/build/release/CMakeFiles/CMakeTmp

Run Build Command:"C:/msys64/usr/bin/make.exe" "cmTC_19dc6/fast"
make[1]: Entering directory '/home/vagrant/slave/monero-static-win64/build/build/release/CMakeFiles/CMakeTmp'
/usr/bin/make -f CMakeFiles/cmTC_19dc6.dir/build.make CMakeFiles/cmTC_19dc6.dir/build
make[2]: Entering directory '/home/vagrant/slave/monero-static-win64/build/build/release/CMakeFiles/CMakeTmp'
Building C object CMakeFiles/cmTC_19dc6.dir/CheckFunctionExists.c.obj

/C/msys64/mingw64/bin/x86_64-w64-mingw32-gcc.exe   -DCHECK_FUNCTION_EXISTS=setusercontent   -o CMakeFiles/cmTC_19dc6.dir/CheckFunctionExists.c.obj   -c /C/msys64/mingw64/share/cmake-3.12/Modules/CheckFunctionExists.c
Linking C executable cmTC_19dc6.exe

/C/msys64/mingw64/bin/cmake.exe -E remove -f CMakeFiles/cmTC_19dc6.dir/objects.a
ar cr CMakeFiles/cmTC_19dc6.dir/objects.a "CMakeFiles/cmTC_19dc6.dir/CheckFunctionExists.c.obj" 
/C/msys64/mingw64/bin/x86_64-w64-mingw32-gcc.exe  -DCHECK_FUNCTION_EXISTS=setusercontent    -Wl,--whole-archive CMakeFiles/cmTC_19dc6.dir/objects.a -Wl,--no-whole-archive  -o cmTC_19dc6.exe -Wl,--major-image-version,0,--minor-image-version,0 -liphlpapi -lws2_32 -lkernel32 -luser32 -lgdi32 -lwinspool -lshell32 -lole32 -loleaut32 -luuid -lcomdlg32 -ladvapi32 
CMakeFiles/cmTC_19dc6.dir/objects.a(CheckFunctionExists.c.obj):CheckFunctionExists.c:(.text+0x15): undefined reference to `setusercontent'

collect2.exe: error: ld returned 1 exit status
make[2]: *** [CMakeFiles/cmTC_19dc6.dir/build.make:88: cmTC_19dc6.exe] Error 1
make[2]: Leaving directory '/home/vagrant/slave/monero-static-win64/build/build/release/CMakeFiles/CMakeTmp'
make[1]: *** [Makefile:121: cmTC_19dc6/fast] Error 2
make[1]: Leaving directory '/home/vagrant/slave/monero-static-win64/build/build/release/CMakeFiles/CMakeTmp'


Determining if the function sigprocmask exists failed with the following output:
Change Dir: C:/msys64/home/vagrant/slave/monero-static-win64/build/build/release/CMakeFiles/CMakeTmp

Run Build Command:"C:/msys64/usr/bin/make.exe" "cmTC_0b361/fast"
make[1]: Entering directory '/home/vagrant/slave/monero-static-win64/build/build/release/CMakeFiles/CMakeTmp'
/usr/bin/make -f CMakeFiles/cmTC_0b361.dir/build.make CMakeFiles/cmTC_0b361.dir/build
make[2]: Entering directory '/home/vagrant/slave/monero-static-win64/build/build/release/CMakeFiles/CMakeTmp'
Building C object CMakeFiles/cmTC_0b361.dir/CheckFunctionExists.c.obj

/C/msys64/mingw64/bin/x86_64-w64-mingw32-gcc.exe   -DCHECK_FUNCTION_EXISTS=sigprocmask   -o CMakeFiles/cmTC_0b361.dir/CheckFunctionExists.c.obj   -c /C/msys64/mingw64/share/cmake-3.12/Modules/CheckFunctionExists.c
Linking C executable cmTC_0b361.exe

/C/msys64/mingw64/bin/cmake.exe -E remove -f CMakeFiles/cmTC_0b361.dir/objects.a
ar cr CMakeFiles/cmTC_0b361.dir/objects.a "CMakeFiles/cmTC_0b361.dir/CheckFunctionExists.c.obj" 
/C/msys64/mingw64/bin/x86_64-w64-mingw32-gcc.exe  -DCHECK_FUNCTION_EXISTS=sigprocmask    -Wl,--whole-archive CMakeFiles/cmTC_0b361.dir/objects.a -Wl,--no-whole-archive  -o cmTC_0b361.exe -Wl,--major-image-version,0,--minor-image-version,0 -liphlpapi -lws2_32 -lkernel32 -luser32 -lgdi32 -lwinspool -lshell32 -lole32 -loleaut32 -luuid -lcomdlg32 -ladvapi32 
CMakeFiles/cmTC_0b361.dir/objects.a(CheckFunctionExists.c.obj):CheckFunctionExists.c:(.text+0x15): undefined reference to `sigprocmask'

collect2.exe: error: ld returned 1 exit status
make[2]: *** [CMakeFiles/cmTC_0b361.dir/build.make:88: cmTC_0b361.exe] Error 1
make[2]: Leaving directory '/home/vagrant/slave/monero-static-win64/build/build/release/CMakeFiles/CMakeTmp'
make[1]: *** [Makefile:121: cmTC_0b361/fast] Error 2
make[1]: Leaving directory '/home/vagrant/slave/monero-static-win64/build/build/release/CMakeFiles/CMakeTmp'


Determining if the function socketpair exists failed with the following output:
Change Dir: C:/msys64/home/vagrant/slave/monero-static-win64/build/build/release/CMakeFiles/CMakeTmp

Run Build Command:"C:/msys64/usr/bin/make.exe" "cmTC_55a17/fast"
make[1]: Entering directory '/home/vagrant/slave/monero-static-win64/build/build/release/CMakeFiles/CMakeTmp'
/usr/bin/make -f CMakeFiles/cmTC_55a17.dir/build.make CMakeFiles/cmTC_55a17.dir/build
make[2]: Entering directory '/home/vagrant/slave/monero-static-win64/build/build/release/CMakeFiles/CMakeTmp'
Building C object CMakeFiles/cmTC_55a17.dir/CheckFunctionExists.c.obj

/C/msys64/mingw64/bin/x86_64-w64-mingw32-gcc.exe   -DCHECK_FUNCTION_EXISTS=socketpair   -o CMakeFiles/cmTC_55a17.dir/CheckFunctionExists.c.obj   -c /C/msys64/mingw64/share/cmake-3.12/Modules/CheckFunctionExists.c
Linking C executable cmTC_55a17.exe

/C/msys64/mingw64/bin/cmake.exe -E remove -f CMakeFiles/cmTC_55a17.dir/objects.a
ar cr CMakeFiles/cmTC_55a17.dir/objects.a "CMakeFiles/cmTC_55a17.dir/CheckFunctionExists.c.obj" 
/C/msys64/mingw64/bin/x86_64-w64-mingw32-gcc.exe  -DCHECK_FUNCTION_EXISTS=socketpair    -Wl,--whole-archive CMakeFiles/cmTC_55a17.dir/objects.a -Wl,--no-whole-archive  -o cmTC_55a17.exe -Wl,--major-image-version,0,--minor-image-version,0 -liphlpapi -lws2_32 -lkernel32 -luser32 -lgdi32 -lwinspool -lshell32 -lole32 -loleaut32 -luuid -lcomdlg32 -ladvapi32 
CMakeFiles/cmTC_55a17.dir/objects.a(CheckFunctionExists.c.obj):CheckFunctionExists.c:(.text+0x15): undefined reference to `socketpair'

collect2.exe: error: ld returned 1 exit status
make[2]: *** [CMakeFiles/cmTC_55a17.dir/build.make:88: cmTC_55a17.exe] Error 1
make[2]: Leaving directory '/home/vagrant/slave/monero-static-win64/build/build/release/CMakeFiles/CMakeTmp'
make[1]: *** [Makefile:121: cmTC_55a17/fast] Error 2
make[1]: Leaving directory '/home/vagrant/slave/monero-static-win64/build/build/release/CMakeFiles/CMakeTmp'


Determining if the function srandom exists failed with the following output:
Change Dir: C:/msys64/home/vagrant/slave/monero-static-win64/build/build/release/CMakeFiles/CMakeTmp

Run Build Command:"C:/msys64/usr/bin/make.exe" "cmTC_3e09b/fast"
make[1]: Entering directory '/home/vagrant/slave/monero-static-win64/build/build/release/CMakeFiles/CMakeTmp'
/usr/bin/make -f CMakeFiles/cmTC_3e09b.dir/build.make CMakeFiles/cmTC_3e09b.dir/build
make[2]: Entering directory '/home/vagrant/slave/monero-static-win64/build/build/release/CMakeFiles/CMakeTmp'
Building C object CMakeFiles/cmTC_3e09b.dir/CheckFunctionExists.c.obj

/C/msys64/mingw64/bin/x86_64-w64-mingw32-gcc.exe   -DCHECK_FUNCTION_EXISTS=srandom   -o CMakeFiles/cmTC_3e09b.dir/CheckFunctionExists.c.obj   -c /C/msys64/mingw64/share/cmake-3.12/Modules/CheckFunctionExists.c
Linking C executable cmTC_3e09b.exe

/C/msys64/mingw64/bin/cmake.exe -E remove -f CMakeFiles/cmTC_3e09b.dir/objects.a
ar cr CMakeFiles/cmTC_3e09b.dir/objects.a "CMakeFiles/cmTC_3e09b.dir/CheckFunctionExists.c.obj" 
/C/msys64/mingw64/bin/x86_64-w64-mingw32-gcc.exe  -DCHECK_FUNCTION_EXISTS=srandom    -Wl,--whole-archive CMakeFiles/cmTC_3e09b.dir/objects.a -Wl,--no-whole-archive  -o cmTC_3e09b.exe -Wl,--major-image-version,0,--minor-image-version,0 -liphlpapi -lws2_32 -lkernel32 -luser32 -lgdi32 -lwinspool -lshell32 -lole32 -loleaut32 -luuid -lcomdlg32 -ladvapi32 
CMakeFiles/cmTC_3e09b.dir/objects.a(CheckFunctionExists.c.obj):CheckFunctionExists.c:(.text+0x15): undefined reference to `srandom'

collect2.exe: error: ld returned 1 exit status
make[2]: *** [CMakeFiles/cmTC_3e09b.dir/build.make:88: cmTC_3e09b.exe] Error 1
make[2]: Leaving directory '/home/vagrant/slave/monero-static-win64/build/build/release/CMakeFiles/CMakeTmp'
make[1]: *** [Makefile:121: cmTC_3e09b/fast] Error 2
make[1]: Leaving directory '/home/vagrant/slave/monero-static-win64/build/build/release/CMakeFiles/CMakeTmp'


Determining if the function strsep exists failed with the following output:
Change Dir: C:/msys64/home/vagrant/slave/monero-static-win64/build/build/release/CMakeFiles/CMakeTmp

Run Build Command:"C:/msys64/usr/bin/make.exe" "cmTC_c782d/fast"
make[1]: Entering directory '/home/vagrant/slave/monero-static-win64/build/build/release/CMakeFiles/CMakeTmp'
/usr/bin/make -f CMakeFiles/cmTC_c782d.dir/build.make CMakeFiles/cmTC_c782d.dir/build
make[2]: Entering directory '/home/vagrant/slave/monero-static-win64/build/build/release/CMakeFiles/CMakeTmp'
Building C object CMakeFiles/cmTC_c782d.dir/CheckFunctionExists.c.obj

/C/msys64/mingw64/bin/x86_64-w64-mingw32-gcc.exe   -DCHECK_FUNCTION_EXISTS=strsep   -o CMakeFiles/cmTC_c782d.dir/CheckFunctionExists.c.obj   -c /C/msys64/mingw64/share/cmake-3.12/Modules/CheckFunctionExists.c
Linking C executable cmTC_c782d.exe

/C/msys64/mingw64/bin/cmake.exe -E remove -f CMakeFiles/cmTC_c782d.dir/objects.a
ar cr CMakeFiles/cmTC_c782d.dir/objects.a "CMakeFiles/cmTC_c782d.dir/CheckFunctionExists.c.obj" 
/C/msys64/mingw64/bin/x86_64-w64-mingw32-gcc.exe  -DCHECK_FUNCTION_EXISTS=strsep    -Wl,--whole-archive CMakeFiles/cmTC_c782d.dir/objects.a -Wl,--no-whole-archive  -o cmTC_c782d.exe -Wl,--major-image-version,0,--minor-image-version,0 -liphlpapi -lws2_32 -lkernel32 -luser32 -lgdi32 -lwinspool -lshell32 -lole32 -loleaut32 -luuid -lcomdlg32 -ladvapi32 
CMakeFiles/cmTC_c782d.dir/objects.a(CheckFunctionExists.c.obj):CheckFunctionExists.c:(.text+0x15): undefined reference to `strsep'

collect2.exe: error: ld returned 1 exit status
make[2]: *** [CMakeFiles/cmTC_c782d.dir/build.make:88: cmTC_c782d.exe] Error 1
make[2]: Leaving directory '/home/vagrant/slave/monero-static-win64/build/build/release/CMakeFiles/CMakeTmp'
make[1]: *** [Makefile:121: cmTC_c782d/fast] Error 2
make[1]: Leaving directory '/home/vagrant/slave/monero-static-win64/build/build/release/CMakeFiles/CMakeTmp'


Determining if the function strlcat exists failed with the following output:
Change Dir: C:/msys64/home/vagrant/slave/monero-static-win64/build/build/release/CMakeFiles/CMakeTmp

Run Build Command:"C:/msys64/usr/bin/make.exe" "cmTC_9b708/fast"
make[1]: Entering directory '/home/vagrant/slave/monero-static-win64/build/build/release/CMakeFiles/CMakeTmp'
/usr/bin/make -f CMakeFiles/cmTC_9b708.dir/build.make CMakeFiles/cmTC_9b708.dir/build
make[2]: Entering directory '/home/vagrant/slave/monero-static-win64/build/build/release/CMakeFiles/CMakeTmp'
Building C object CMakeFiles/cmTC_9b708.dir/CheckFunctionExists.c.obj

/C/msys64/mingw64/bin/x86_64-w64-mingw32-gcc.exe   -DCHECK_FUNCTION_EXISTS=strlcat   -o CMakeFiles/cmTC_9b708.dir/CheckFunctionExists.c.obj   -c /C/msys64/mingw64/share/cmake-3.12/Modules/CheckFunctionExists.c
Linking C executable cmTC_9b708.exe

/C/msys64/mingw64/bin/cmake.exe -E remove -f CMakeFiles/cmTC_9b708.dir/objects.a
ar cr CMakeFiles/cmTC_9b708.dir/objects.a "CMakeFiles/cmTC_9b708.dir/CheckFunctionExists.c.obj" 
/C/msys64/mingw64/bin/x86_64-w64-mingw32-gcc.exe  -DCHECK_FUNCTION_EXISTS=strlcat    -Wl,--whole-archive CMakeFiles/cmTC_9b708.dir/objects.a -Wl,--no-whole-archive  -o cmTC_9b708.exe -Wl,--major-image-version,0,--minor-image-version,0 -liphlpapi -lws2_32 -lkernel32 -luser32 -lgdi32 -lwinspool -lshell32 -lole32 -loleaut32 -luuid -lcomdlg32 -ladvapi32 
CMakeFiles/cmTC_9b708.dir/objects.a(CheckFunctionExists.c.obj):CheckFunctionExists.c:(.text+0x15): undefined reference to `strlcat'

collect2.exe: error: ld returned 1 exit status
make[2]: *** [CMakeFiles/cmTC_9b708.dir/build.make:88: cmTC_9b708.exe] Error 1
make[2]: Leaving directory '/home/vagrant/slave/monero-static-win64/build/build/release/CMakeFiles/CMakeTmp'
make[1]: *** [Makefile:121: cmTC_9b708/fast] Error 2
make[1]: Leaving directory '/home/vagrant/slave/monero-static-win64/build/build/release/CMakeFiles/CMakeTmp'


Determining if the function strlcpy exists failed with the following output:
Change Dir: C:/msys64/home/vagrant/slave/monero-static-win64/build/build/release/CMakeFiles/CMakeTmp

Run Build Command:"C:/msys64/usr/bin/make.exe" "cmTC_5fd95/fast"
make[1]: Entering directory '/home/vagrant/slave/monero-static-win64/build/build/release/CMakeFiles/CMakeTmp'
/usr/bin/make -f CMakeFiles/cmTC_5fd95.dir/build.make CMakeFiles/cmTC_5fd95.dir/build
make[2]: Entering directory '/home/vagrant/slave/monero-static-win64/build/build/release/CMakeFiles/CMakeTmp'
Building C object CMakeFiles/cmTC_5fd95.dir/CheckFunctionExists.c.obj

/C/msys64/mingw64/bin/x86_64-w64-mingw32-gcc.exe   -DCHECK_FUNCTION_EXISTS=strlcpy   -o CMakeFiles/cmTC_5fd95.dir/CheckFunctionExists.c.obj   -c /C/msys64/mingw64/share/cmake-3.12/Modules/CheckFunctionExists.c
Linking C executable cmTC_5fd95.exe

/C/msys64/mingw64/bin/cmake.exe -E remove -f CMakeFiles/cmTC_5fd95.dir/objects.a
ar cr CMakeFiles/cmTC_5fd95.dir/objects.a "CMakeFiles/cmTC_5fd95.dir/CheckFunctionExists.c.obj" 
/C/msys64/mingw64/bin/x86_64-w64-mingw32-gcc.exe  -DCHECK_FUNCTION_EXISTS=strlcpy    -Wl,--whole-archive CMakeFiles/cmTC_5fd95.dir/objects.a -Wl,--no-whole-archive  -o cmTC_5fd95.exe -Wl,--major-image-version,0,--minor-image-version,0 -liphlpapi -lws2_32 -lkernel32 -luser32 -lgdi32 -lwinspool -lshell32 -lole32 -loleaut32 -luuid -lcomdlg32 -ladvapi32 
CMakeFiles/cmTC_5fd95.dir/objects.a(CheckFunctionExists.c.obj):CheckFunctionExists.c:(.text+0x15): undefined reference to `strlcpy'

collect2.exe: error: ld returned 1 exit status
make[2]: *** [CMakeFiles/cmTC_5fd95.dir/build.make:88: cmTC_5fd95.exe] Error 1
make[2]: Leaving directory '/home/vagrant/slave/monero-static-win64/build/build/release/CMakeFiles/CMakeTmp'
make[1]: *** [Makefile:121: cmTC_5fd95/fast] Error 2
make[1]: Leaving directory '/home/vagrant/slave/monero-static-win64/build/build/release/CMakeFiles/CMakeTmp'


Determining if the function strptime exists failed with the following output:
Change Dir: C:/msys64/home/vagrant/slave/monero-static-win64/build/build/release/CMakeFiles/CMakeTmp

Run Build Command:"C:/msys64/usr/bin/make.exe" "cmTC_1d37f/fast"
make[1]: Entering directory '/home/vagrant/slave/monero-static-win64/build/build/release/CMakeFiles/CMakeTmp'
/usr/bin/make -f CMakeFiles/cmTC_1d37f.dir/build.make CMakeFiles/cmTC_1d37f.dir/build
make[2]: Entering directory '/home/vagrant/slave/monero-static-win64/build/build/release/CMakeFiles/CMakeTmp'
Building C object CMakeFiles/cmTC_1d37f.dir/CheckFunctionExists.c.obj

/C/msys64/mingw64/bin/x86_64-w64-mingw32-gcc.exe   -DCHECK_FUNCTION_EXISTS=strptime   -o CMakeFiles/cmTC_1d37f.dir/CheckFunctionExists.c.obj   -c /C/msys64/mingw64/share/cmake-3.12/Modules/CheckFunctionExists.c
Linking C executable cmTC_1d37f.exe

/C/msys64/mingw64/bin/cmake.exe -E remove -f CMakeFiles/cmTC_1d37f.dir/objects.a
ar cr CMakeFiles/cmTC_1d37f.dir/objects.a "CMakeFiles/cmTC_1d37f.dir/CheckFunctionExists.c.obj" 
/C/msys64/mingw64/bin/x86_64-w64-mingw32-gcc.exe  -DCHECK_FUNCTION_EXISTS=strptime    -Wl,--whole-archive CMakeFiles/cmTC_1d37f.dir/objects.a -Wl,--no-whole-archive  -o cmTC_1d37f.exe -Wl,--major-image-version,0,--minor-image-version,0 -liphlpapi -lws2_32 -lkernel32 -luser32 -lgdi32 -lwinspool -lshell32 -lole32 -loleaut32 -luuid -lcomdlg32 -ladvapi32 
CMakeFiles/cmTC_1d37f.dir/objects.a(CheckFunctionExists.c.obj):CheckFunctionExists.c:(.text+0x15): undefined reference to `strptime'

collect2.exe: error: ld returned 1 exit status
make[2]: *** [CMakeFiles/cmTC_1d37f.dir/build.make:88: cmTC_1d37f.exe] Error 1
make[2]: Leaving directory '/home/vagrant/slave/monero-static-win64/build/build/release/CMakeFiles/CMakeTmp'
make[1]: *** [Makefile:121: cmTC_1d37f/fast] Error 2
make[1]: Leaving directory '/home/vagrant/slave/monero-static-win64/build/build/release/CMakeFiles/CMakeTmp'


Determining if the function writev exists failed with the following output:
Change Dir: C:/msys64/home/vagrant/slave/monero-static-win64/build/build/release/CMakeFiles/CMakeTmp

Run Build Command:"C:/msys64/usr/bin/make.exe" "cmTC_95df8/fast"
make[1]: Entering directory '/home/vagrant/slave/monero-static-win64/build/build/release/CMakeFiles/CMakeTmp'
/usr/bin/make -f CMakeFiles/cmTC_95df8.dir/build.make CMakeFiles/cmTC_95df8.dir/build
make[2]: Entering directory '/home/vagrant/slave/monero-static-win64/build/build/release/CMakeFiles/CMakeTmp'
Building C object CMakeFiles/cmTC_95df8.dir/CheckFunctionExists.c.obj

/C/msys64/mingw64/bin/x86_64-w64-mingw32-gcc.exe   -DCHECK_FUNCTION_EXISTS=writev   -o CMakeFiles/cmTC_95df8.dir/CheckFunctionExists.c.obj   -c /C/msys64/mingw64/share/cmake-3.12/Modules/CheckFunctionExists.c
Linking C executable cmTC_95df8.exe

/C/msys64/mingw64/bin/cmake.exe -E remove -f CMakeFiles/cmTC_95df8.dir/objects.a
ar cr CMakeFiles/cmTC_95df8.dir/objects.a "CMakeFiles/cmTC_95df8.dir/CheckFunctionExists.c.obj" 
/C/msys64/mingw64/bin/x86_64-w64-mingw32-gcc.exe  -DCHECK_FUNCTION_EXISTS=writev    -Wl,--whole-archive CMakeFiles/cmTC_95df8.dir/objects.a -Wl,--no-whole-archive  -o cmTC_95df8.exe -Wl,--major-image-version,0,--minor-image-version,0 -liphlpapi -lws2_32 -lkernel32 -luser32 -lgdi32 -lwinspool -lshell32 -lole32 -loleaut32 -luuid -lcomdlg32 -ladvapi32 
CMakeFiles/cmTC_95df8.dir/objects.a(CheckFunctionExists.c.obj):CheckFunctionExists.c:(.text+0x15): undefined reference to `writev'

collect2.exe: error: ld returned 1 exit status
make[2]: *** [CMakeFiles/cmTC_95df8.dir/build.make:88: cmTC_95df8.exe] Error 1
make[2]: Leaving directory '/home/vagrant/slave/monero-static-win64/build/build/release/CMakeFiles/CMakeTmp'
make[1]: *** [Makefile:121: cmTC_95df8/fast] Error 2
make[1]: Leaving directory '/home/vagrant/slave/monero-static-win64/build/build/release/CMakeFiles/CMakeTmp'


Determining size of gid_t failed with the following output:
Change Dir: C:/msys64/home/vagrant/slave/monero-static-win64/build/build/release/CMakeFiles/CMakeTmp

Run Build Command:"C:/msys64/usr/bin/make.exe" "cmTC_d86de/fast"
make[1]: Entering directory '/home/vagrant/slave/monero-static-win64/build/build/release/CMakeFiles/CMakeTmp'
/usr/bin/make -f CMakeFiles/cmTC_d86de.dir/build.make CMakeFiles/cmTC_d86de.dir/build
make[2]: Entering directory '/home/vagrant/slave/monero-static-win64/build/build/release/CMakeFiles/CMakeTmp'
Building C object CMakeFiles/cmTC_d86de.dir/gid_t.c.obj

/C/msys64/mingw64/bin/x86_64-w64-mingw32-gcc.exe    -o CMakeFiles/cmTC_d86de.dir/gid_t.c.obj   -c /C/msys64/home/vagrant/slave/monero-static-win64/build/build/release/CMakeFiles/CheckTypeSize/gid_t.c
C:/msys64/home/vagrant/slave/monero-static-win64/build/build/release/CMakeFiles/CheckTypeSize/gid_t.c:24:22: error: 'gid_t' undeclared here (not in a function); did you mean 'pid_t'?
 #define SIZE (sizeof(gid_t))
                      ^~~~~
C:/msys64/home/vagrant/slave/monero-static-win64/build/build/release/CMakeFiles/CheckTypeSize/gid_t.c:26:12: note: in expansion of macro 'SIZE'
   ('0' + ((SIZE / 10000)%10)),
            ^~~~
make[2]: *** [CMakeFiles/cmTC_d86de.dir/build.make:66: CMakeFiles/cmTC_d86de.dir/gid_t.c.obj] Error 1
make[2]: Leaving directory '/home/vagrant/slave/monero-static-win64/build/build/release/CMakeFiles/CMakeTmp'
make[1]: *** [Makefile:121: cmTC_d86de/fast] Error 2
make[1]: Leaving directory '/home/vagrant/slave/monero-static-win64/build/build/release/CMakeFiles/CMakeTmp'

C:/msys64/home/vagrant/slave/monero-static-win64/build/build/release/CMakeFiles/CheckTypeSize/gid_t.c:
#include <sys/types.h>
#include <stdint.h>
#include <stddef.h>
#include "sys/types.h"


#undef KEY
#if defined(__i386)
# define KEY '_','_','i','3','8','6'
#elif defined(__x86_64)
# define KEY '_','_','x','8','6','_','6','4'
#elif defined(__ppc__)
# define KEY '_','_','p','p','c','_','_'
#elif defined(__ppc64__)
# define KEY '_','_','p','p','c','6','4','_','_'
#elif defined(__aarch64__)
# define KEY '_','_','a','a','r','c','h','6','4','_','_'
#elif defined(__ARM_ARCH_7A__)
# define KEY '_','_','A','R','M','_','A','R','C','H','_','7','A','_','_'
#elif defined(__ARM_ARCH_7S__)
# define KEY '_','_','A','R','M','_','A','R','C','H','_','7','S','_','_'
#endif

#define SIZE (sizeof(gid_t))
char info_size[] =  {'I', 'N', 'F', 'O', ':', 's','i','z','e','[',
  ('0' + ((SIZE / 10000)%10)),
  ('0' + ((SIZE / 1000)%10)),
  ('0' + ((SIZE / 100)%10)),
  ('0' + ((SIZE / 10)%10)),
  ('0' +  (SIZE    % 10)),
  ']',
#ifdef KEY
  ' ','k','e','y','[', KEY, ']',
#endif
  '\0'};

#ifdef __CLASSIC_C__
int main(argc, argv) int argc; char *argv[];
#else
int main(int argc, char *argv[])
#endif
{
  int require = 0;
  require += info_size[argc];
  (void)argv;
  return require;
}


Determining size of in_addr_t failed with the following output:
Change Dir: C:/msys64/home/vagrant/slave/monero-static-win64/build/build/release/CMakeFiles/CMakeTmp

Run Build Command:"C:/msys64/usr/bin/make.exe" "cmTC_f29c1/fast"
make[1]: Entering directory '/home/vagrant/slave/monero-static-win64/build/build/release/CMakeFiles/CMakeTmp'
/usr/bin/make -f CMakeFiles/cmTC_f29c1.dir/build.make CMakeFiles/cmTC_f29c1.dir/build
make[2]: Entering directory '/home/vagrant/slave/monero-static-win64/build/build/release/CMakeFiles/CMakeTmp'
Building C object CMakeFiles/cmTC_f29c1.dir/in_addr_t.c.obj

/C/msys64/mingw64/bin/x86_64-w64-mingw32-gcc.exe    -o CMakeFiles/cmTC_f29c1.dir/in_addr_t.c.obj   -c /C/msys64/home/vagrant/slave/monero-static-win64/build/build/release/CMakeFiles/CheckTypeSize/in_addr_t.c
C:/msys64/home/vagrant/slave/monero-static-win64/build/build/release/CMakeFiles/CheckTypeSize/in_addr_t.c:4:10: fatal error: netinet/in.h: No such file or directory
 #include "netinet/in.h"
          ^~~~~~~~~~~~~~
compilation terminated.

make[2]: *** [CMakeFiles/cmTC_f29c1.dir/build.make:66: CMakeFiles/cmTC_f29c1.dir/in_addr_t.c.obj] Error 1
make[2]: Leaving directory '/home/vagrant/slave/monero-static-win64/build/build/release/CMakeFiles/CMakeTmp'
make[1]: *** [Makefile:121: cmTC_f29c1/fast] Error 2
make[1]: Leaving directory '/home/vagrant/slave/monero-static-win64/build/build/release/CMakeFiles/CMakeTmp'

C:/msys64/home/vagrant/slave/monero-static-win64/build/build/release/CMakeFiles/CheckTypeSize/in_addr_t.c:
#include <sys/types.h>
#include <stdint.h>
#include <stddef.h>
#include "netinet/in.h"


#undef KEY
#if defined(__i386)
# define KEY '_','_','i','3','8','6'
#elif defined(__x86_64)
# define KEY '_','_','x','8','6','_','6','4'
#elif defined(__ppc__)
# define KEY '_','_','p','p','c','_','_'
#elif defined(__ppc64__)
# define KEY '_','_','p','p','c','6','4','_','_'
#elif defined(__aarch64__)
# define KEY '_','_','a','a','r','c','h','6','4','_','_'
#elif defined(__ARM_ARCH_7A__)
# define KEY '_','_','A','R','M','_','A','R','C','H','_','7','A','_','_'
#elif defined(__ARM_ARCH_7S__)
# define KEY '_','_','A','R','M','_','A','R','C','H','_','7','S','_','_'
#endif

#define SIZE (sizeof(in_addr_t))
char info_size[] =  {'I', 'N', 'F', 'O', ':', 's','i','z','e','[',
  ('0' + ((SIZE / 10000)%10)),
  ('0' + ((SIZE / 1000)%10)),
  ('0' + ((SIZE / 100)%10)),
  ('0' + ((SIZE / 10)%10)),
  ('0' +  (SIZE    % 10)),
  ']',
#ifdef KEY
  ' ','k','e','y','[', KEY, ']',
#endif
  '\0'};

#ifdef __CLASSIC_C__
int main(argc, argv) int argc; char *argv[];
#else
int main(int argc, char *argv[])
#endif
{
  int require = 0;
  require += info_size[argc];
  (void)argv;
  return require;
}


Determining size of in_port_t failed with the following output:
Change Dir: C:/msys64/home/vagrant/slave/monero-static-win64/build/build/release/CMakeFiles/CMakeTmp

Run Build Command:"C:/msys64/usr/bin/make.exe" "cmTC_1a302/fast"
make[1]: Entering directory '/home/vagrant/slave/monero-static-win64/build/build/release/CMakeFiles/CMakeTmp'
/usr/bin/make -f CMakeFiles/cmTC_1a302.dir/build.make CMakeFiles/cmTC_1a302.dir/build
make[2]: Entering directory '/home/vagrant/slave/monero-static-win64/build/build/release/CMakeFiles/CMakeTmp'
Building C object CMakeFiles/cmTC_1a302.dir/in_port_t.c.obj

/C/msys64/mingw64/bin/x86_64-w64-mingw32-gcc.exe    -o CMakeFiles/cmTC_1a302.dir/in_port_t.c.obj   -c /C/msys64/home/vagrant/slave/monero-static-win64/build/build/release/CMakeFiles/CheckTypeSize/in_port_t.c
C:/msys64/home/vagrant/slave/monero-static-win64/build/build/release/CMakeFiles/CheckTypeSize/in_port_t.c:4:10: fatal error: netinet/in.h: No such file or directory
 #include "netinet/in.h"
          ^~~~~~~~~~~~~~
compilation terminated.

make[2]: *** [CMakeFiles/cmTC_1a302.dir/build.make:66: CMakeFiles/cmTC_1a302.dir/in_port_t.c.obj] Error 1
make[2]: Leaving directory '/home/vagrant/slave/monero-static-win64/build/build/release/CMakeFiles/CMakeTmp'
make[1]: *** [Makefile:121: cmTC_1a302/fast] Error 2
make[1]: Leaving directory '/home/vagrant/slave/monero-static-win64/build/build/release/CMakeFiles/CMakeTmp'

C:/msys64/home/vagrant/slave/monero-static-win64/build/build/release/CMakeFiles/CheckTypeSize/in_port_t.c:
#include <sys/types.h>
#include <stdint.h>
#include <stddef.h>
#include "netinet/in.h"


#undef KEY
#if defined(__i386)
# define KEY '_','_','i','3','8','6'
#elif defined(__x86_64)
# define KEY '_','_','x','8','6','_','6','4'
#elif defined(__ppc__)
# define KEY '_','_','p','p','c','_','_'
#elif defined(__ppc64__)
# define KEY '_','_','p','p','c','6','4','_','_'
#elif defined(__aarch64__)
# define KEY '_','_','a','a','r','c','h','6','4','_','_'
#elif defined(__ARM_ARCH_7A__)
# define KEY '_','_','A','R','M','_','A','R','C','H','_','7','A','_','_'
#elif defined(__ARM_ARCH_7S__)
# define KEY '_','_','A','R','M','_','A','R','C','H','_','7','S','_','_'
#endif

#define SIZE (sizeof(in_port_t))
char info_size[] =  {'I', 'N', 'F', 'O', ':', 's','i','z','e','[',
  ('0' + ((SIZE / 10000)%10)),
  ('0' + ((SIZE / 1000)%10)),
  ('0' + ((SIZE / 100)%10)),
  ('0' + ((SIZE / 10)%10)),
  ('0' +  (SIZE    % 10)),
  ']',
#ifdef KEY
  ' ','k','e','y','[', KEY, ']',
#endif
  '\0'};

#ifdef __CLASSIC_C__
int main(argc, argv) int argc; char *argv[];
#else
int main(int argc, char *argv[])
#endif
{
  int require = 0;
  require += info_size[argc];
  (void)argv;
  return require;
}


Determining size of rlim_t failed with the following output:
Change Dir: C:/msys64/home/vagrant/slave/monero-static-win64/build/build/release/CMakeFiles/CMakeTmp

Run Build Command:"C:/msys64/usr/bin/make.exe" "cmTC_eae9c/fast"
make[1]: Entering directory '/home/vagrant/slave/monero-static-win64/build/build/release/CMakeFiles/CMakeTmp'
/usr/bin/make -f CMakeFiles/cmTC_eae9c.dir/build.make CMakeFiles/cmTC_eae9c.dir/build
make[2]: Entering directory '/home/vagrant/slave/monero-static-win64/build/build/release/CMakeFiles/CMakeTmp'
Building C object CMakeFiles/cmTC_eae9c.dir/rlim_t.c.obj

/C/msys64/mingw64/bin/x86_64-w64-mingw32-gcc.exe    -o CMakeFiles/cmTC_eae9c.dir/rlim_t.c.obj   -c /C/msys64/home/vagrant/slave/monero-static-win64/build/build/release/CMakeFiles/CheckTypeSize/rlim_t.c
C:/msys64/home/vagrant/slave/monero-static-win64/build/build/release/CMakeFiles/CheckTypeSize/rlim_t.c:4:10: fatal error: sys/resource.h: No such file or directory
 #include "sys/resource.h"
          ^~~~~~~~~~~~~~~~
compilation terminated.

make[2]: *** [CMakeFiles/cmTC_eae9c.dir/build.make:66: CMakeFiles/cmTC_eae9c.dir/rlim_t.c.obj] Error 1
make[2]: Leaving directory '/home/vagrant/slave/monero-static-win64/build/build/release/CMakeFiles/CMakeTmp'
make[1]: *** [Makefile:121: cmTC_eae9c/fast] Error 2
make[1]: Leaving directory '/home/vagrant/slave/monero-static-win64/build/build/release/CMakeFiles/CMakeTmp'

C:/msys64/home/vagrant/slave/monero-static-win64/build/build/release/CMakeFiles/CheckTypeSize/rlim_t.c:
#include <sys/types.h>
#include <stdint.h>
#include <stddef.h>
#include "sys/resource.h"


#undef KEY
#if defined(__i386)
# define KEY '_','_','i','3','8','6'
#elif defined(__x86_64)
# define KEY '_','_','x','8','6','_','6','4'
#elif defined(__ppc__)
# define KEY '_','_','p','p','c','_','_'
#elif defined(__ppc64__)
# define KEY '_','_','p','p','c','6','4','_','_'
#elif defined(__aarch64__)
# define KEY '_','_','a','a','r','c','h','6','4','_','_'
#elif defined(__ARM_ARCH_7A__)
# define KEY '_','_','A','R','M','_','A','R','C','H','_','7','A','_','_'
#elif defined(__ARM_ARCH_7S__)
# define KEY '_','_','A','R','M','_','A','R','C','H','_','7','S','_','_'
#endif

#define SIZE (sizeof(rlim_t))
char info_size[] =  {'I', 'N', 'F', 'O', ':', 's','i','z','e','[',
  ('0' + ((SIZE / 10000)%10)),
  ('0' + ((SIZE / 1000)%10)),
  ('0' + ((SIZE / 100)%10)),
  ('0' + ((SIZE / 10)%10)),
  ('0' +  (SIZE    % 10)),
  ']',
#ifdef KEY
  ' ','k','e','y','[', KEY, ']',
#endif
  '\0'};

#ifdef __CLASSIC_C__
int main(argc, argv) int argc; char *argv[];
#else
int main(int argc, char *argv[])
#endif
{
  int require = 0;
  require += info_size[argc];
  (void)argv;
  return require;
}


Determining size of uid_t failed with the following output:
Change Dir: C:/msys64/home/vagrant/slave/monero-static-win64/build/build/release/CMakeFiles/CMakeTmp

Run Build Command:"C:/msys64/usr/bin/make.exe" "cmTC_60173/fast"
make[1]: Entering directory '/home/vagrant/slave/monero-static-win64/build/build/release/CMakeFiles/CMakeTmp'
/usr/bin/make -f CMakeFiles/cmTC_60173.dir/build.make CMakeFiles/cmTC_60173.dir/build
make[2]: Entering directory '/home/vagrant/slave/monero-static-win64/build/build/release/CMakeFiles/CMakeTmp'
Building C object CMakeFiles/cmTC_60173.dir/uid_t.c.obj

/C/msys64/mingw64/bin/x86_64-w64-mingw32-gcc.exe    -o CMakeFiles/cmTC_60173.dir/uid_t.c.obj   -c /C/msys64/home/vagrant/slave/monero-static-win64/build/build/release/CMakeFiles/CheckTypeSize/uid_t.c
C:/msys64/home/vagrant/slave/monero-static-win64/build/build/release/CMakeFiles/CheckTypeSize/uid_t.c:24:22: error: 'uid_t' undeclared here (not in a function); did you mean 'pid_t'?
 #define SIZE (sizeof(uid_t))
                      ^~~~~
C:/msys64/home/vagrant/slave/monero-static-win64/build/build/release/CMakeFiles/CheckTypeSize/uid_t.c:26:12: note: in expansion of macro 'SIZE'
   ('0' + ((SIZE / 10000)%10)),
            ^~~~
make[2]: *** [CMakeFiles/cmTC_60173.dir/build.make:66: CMakeFiles/cmTC_60173.dir/uid_t.c.obj] Error 1
make[2]: Leaving directory '/home/vagrant/slave/monero-static-win64/build/build/release/CMakeFiles/CMakeTmp'
make[1]: *** [Makefile:121: cmTC_60173/fast] Error 2
make[1]: Leaving directory '/home/vagrant/slave/monero-static-win64/build/build/release/CMakeFiles/CMakeTmp'

C:/msys64/home/vagrant/slave/monero-static-win64/build/build/release/CMakeFiles/CheckTypeSize/uid_t.c:
#include <sys/types.h>
#include <stdint.h>
#include <stddef.h>
#include "sys/types.h"


#undef KEY
#if defined(__i386)
# define KEY '_','_','i','3','8','6'
#elif defined(__x86_64)
# define KEY '_','_','x','8','6','_','6','4'
#elif defined(__ppc__)
# define KEY '_','_','p','p','c','_','_'
#elif defined(__ppc64__)
# define KEY '_','_','p','p','c','6','4','_','_'
#elif defined(__aarch64__)
# define KEY '_','_','a','a','r','c','h','6','4','_','_'
#elif defined(__ARM_ARCH_7A__)
# define KEY '_','_','A','R','M','_','A','R','C','H','_','7','A','_','_'
#elif defined(__ARM_ARCH_7S__)
# define KEY '_','_','A','R','M','_','A','R','C','H','_','7','S','_','_'
#endif

#define SIZE (sizeof(uid_t))
char info_size[] =  {'I', 'N', 'F', 'O', ':', 's','i','z','e','[',
  ('0' + ((SIZE / 10000)%10)),
  ('0' + ((SIZE / 1000)%10)),
  ('0' + ((SIZE / 100)%10)),
  ('0' + ((SIZE / 10)%10)),
  ('0' +  (SIZE    % 10)),
  ']',
#ifdef KEY
  ' ','k','e','y','[', KEY, ']',
#endif
  '\0'};

#ifdef __CLASSIC_C__
int main(argc, argv) int argc; char *argv[];
#else
int main(int argc, char *argv[])
#endif
{
  int require = 0;
  require += info_size[argc];
  (void)argv;
  return require;
}


Determining if the pthread_rwlock_t exist failed with the following output:
Change Dir: C:/msys64/home/vagrant/slave/monero-static-win64/build/build/release/CMakeFiles/CMakeTmp

Run Build Command:"C:/msys64/usr/bin/make.exe" "cmTC_527f1/fast"
make[1]: Entering directory '/home/vagrant/slave/monero-static-win64/build/build/release/CMakeFiles/CMakeTmp'
/usr/bin/make -f CMakeFiles/cmTC_527f1.dir/build.make CMakeFiles/cmTC_527f1.dir/build
make[2]: Entering directory '/home/vagrant/slave/monero-static-win64/build/build/release/CMakeFiles/CMakeTmp'
Building C object CMakeFiles/cmTC_527f1.dir/CheckSymbolExists.c.obj

/C/msys64/mingw64/bin/x86_64-w64-mingw32-gcc.exe    -o CMakeFiles/cmTC_527f1.dir/CheckSymbolExists.c.obj   -c /C/msys64/home/vagrant/slave/monero-static-win64/build/build/release/CMakeFiles/CMakeTmp/CheckSymbolExists.c
C:/msys64/home/vagrant/slave/monero-static-win64/build/build/release/CMakeFiles/CMakeTmp/CheckSymbolExists.c: In function 'main':
C:/msys64/home/vagrant/slave/monero-static-win64/build/build/release/CMakeFiles/CMakeTmp/CheckSymbolExists.c:8:19: error: expected expression before 'pthread_rwlock_t'
   return ((int*)(&pthread_rwlock_t))[argc];
                   ^~~~~~~~~~~~~~~~
make[2]: *** [CMakeFiles/cmTC_527f1.dir/build.make:66: CMakeFiles/cmTC_527f1.dir/CheckSymbolExists.c.obj] Error 1
make[2]: Leaving directory '/home/vagrant/slave/monero-static-win64/build/build/release/CMakeFiles/CMakeTmp'
make[1]: *** [Makefile:121: cmTC_527f1/fast] Error 2
make[1]: Leaving directory '/home/vagrant/slave/monero-static-win64/build/build/release/CMakeFiles/CMakeTmp'

File C:/msys64/home/vagrant/slave/monero-static-win64/build/build/release/CMakeFiles/CMakeTmp/CheckSymbolExists.c:
/* */
#include <pthread.h>

int main(int argc, char** argv)
{
  (void)argv;
#ifndef pthread_rwlock_t
  return ((int*)(&pthread_rwlock_t))[argc];
#else
  (void)argc;
  return 0;
#endif
}

Determining if the pthread_spinlock_t exist failed with the following output:
Change Dir: C:/msys64/home/vagrant/slave/monero-static-win64/build/build/release/CMakeFiles/CMakeTmp

Run Build Command:"C:/msys64/usr/bin/make.exe" "cmTC_afdef/fast"
make[1]: Entering directory '/home/vagrant/slave/monero-static-win64/build/build/release/CMakeFiles/CMakeTmp'
/usr/bin/make -f CMakeFiles/cmTC_afdef.dir/build.make CMakeFiles/cmTC_afdef.dir/build
make[2]: Entering directory '/home/vagrant/slave/monero-static-win64/build/build/release/CMakeFiles/CMakeTmp'
Building C object CMakeFiles/cmTC_afdef.dir/CheckSymbolExists.c.obj

/C/msys64/mingw64/bin/x86_64-w64-mingw32-gcc.exe    -o CMakeFiles/cmTC_afdef.dir/CheckSymbolExists.c.obj   -c /C/msys64/home/vagrant/slave/monero-static-win64/build/build/release/CMakeFiles/CMakeTmp/CheckSymbolExists.c
C:/msys64/home/vagrant/slave/monero-static-win64/build/build/release/CMakeFiles/CMakeTmp/CheckSymbolExists.c: In function 'main':
C:/msys64/home/vagrant/slave/monero-static-win64/build/build/release/CMakeFiles/CMakeTmp/CheckSymbolExists.c:8:19: error: expected expression before 'pthread_spinlock_t'
   return ((int*)(&pthread_spinlock_t))[argc];
                   ^~~~~~~~~~~~~~~~~~
make[2]: *** [CMakeFiles/cmTC_afdef.dir/build.make:66: CMakeFiles/cmTC_afdef.dir/CheckSymbolExists.c.obj] Error 1
make[2]: Leaving directory '/home/vagrant/slave/monero-static-win64/build/build/release/CMakeFiles/CMakeTmp'
make[1]: *** [Makefile:121: cmTC_afdef/fast] Error 2
make[1]: Leaving directory '/home/vagrant/slave/monero-static-win64/build/build/release/CMakeFiles/CMakeTmp'

File C:/msys64/home/vagrant/slave/monero-static-win64/build/build/release/CMakeFiles/CMakeTmp/CheckSymbolExists.c:
/* */
#include <pthread.h>

int main(int argc, char** argv)
{
  (void)argv;
#ifndef pthread_spinlock_t
  return ((int*)(&pthread_spinlock_t))[argc];
#else
  (void)argc;
  return 0;
#endif
}

Determining if the LIBRESSL_VERSION_TEXT exist failed with the following output:
Change Dir: C:/msys64/home/vagrant/slave/monero-static-win64/build/build/release/CMakeFiles/CMakeTmp

Run Build Command:"C:/msys64/usr/bin/make.exe" "cmTC_1c80c/fast"
make[1]: Entering directory '/home/vagrant/slave/monero-static-win64/build/build/release/CMakeFiles/CMakeTmp'
/usr/bin/make -f CMakeFiles/cmTC_1c80c.dir/build.make CMakeFiles/cmTC_1c80c.dir/build
make[2]: Entering directory '/home/vagrant/slave/monero-static-win64/build/build/release/CMakeFiles/CMakeTmp'
Building C object CMakeFiles/cmTC_1c80c.dir/CheckSymbolExists.c.obj

/C/msys64/mingw64/bin/x86_64-w64-mingw32-gcc.exe    -o CMakeFiles/cmTC_1c80c.dir/CheckSymbolExists.c.obj   -c /C/msys64/home/vagrant/slave/monero-static-win64/build/build/release/CMakeFiles/CMakeTmp/CheckSymbolExists.c
C:/msys64/home/vagrant/slave/monero-static-win64/build/build/release/CMakeFiles/CMakeTmp/CheckSymbolExists.c: In function 'main':
C:/msys64/home/vagrant/slave/monero-static-win64/build/build/release/CMakeFiles/CMakeTmp/CheckSymbolExists.c:8:19: error: 'LIBRESSL_VERSION_TEXT' undeclared (first use in this function); did you mean 'OPENSSL_VERSION_TEXT'?
   return ((int*)(&LIBRESSL_VERSION_TEXT))[argc];
                   ^~~~~~~~~~~~~~~~~~~~~
                   OPENSSL_VERSION_TEXT
C:/msys64/home/vagrant/slave/monero-static-win64/build/build/release/CMakeFiles/CMakeTmp/CheckSymbolExists.c:8:19: note: each undeclared identifier is reported only once for each function it appears in
make[2]: *** [CMakeFiles/cmTC_1c80c.dir/build.make:66: CMakeFiles/cmTC_1c80c.dir/CheckSymbolExists.c.obj] Error 1
make[2]: Leaving directory '/home/vagrant/slave/monero-static-win64/build/build/release/CMakeFiles/CMakeTmp'
make[1]: *** [Makefile:121: cmTC_1c80c/fast] Error 2
make[1]: Leaving directory '/home/vagrant/slave/monero-static-win64/build/build/release/CMakeFiles/CMakeTmp'

File C:/msys64/home/vagrant/slave/monero-static-win64/build/build/release/CMakeFiles/CMakeTmp/CheckSymbolExists.c:
/* */
#include <openssl/opensslv.h>

int main(int argc, char** argv)
{
  (void)argv;
#ifndef LIBRESSL_VERSION_TEXT
  return ((int*)(&LIBRESSL_VERSION_TEXT))[argc];
#else
  (void)argc;
  return 0;
#endif
}

Determining if the -Wl,-z,relro linker flag is supported failed with the following output:
Change Dir: C:/msys64/home/vagrant/slave/monero-static-win64/build/build/release/CMakeFiles/CMakeTmp

Run Build Command:"C:/msys64/usr/bin/make.exe" "cmTC_0a28c/fast"
make[1]: Entering directory '/home/vagrant/slave/monero-static-win64/build/build/release/CMakeFiles/CMakeTmp'
/usr/bin/make -f CMakeFiles/cmTC_0a28c.dir/build.make CMakeFiles/cmTC_0a28c.dir/build
make[2]: Entering directory '/home/vagrant/slave/monero-static-win64/build/build/release/CMakeFiles/CMakeTmp'
Building C object CMakeFiles/cmTC_0a28c.dir/CheckLinkerFlag.c.obj

/C/msys64/mingw64/bin/x86_64-w64-mingw32-gcc.exe   -Wl,-z,relro    -Wl,-z,relro -o CMakeFiles/cmTC_0a28c.dir/CheckLinkerFlag.c.obj   -c /C/msys64/home/vagrant/slave/monero-static-win64/build/cmake/CheckLinkerFlag.c
Linking C executable cmTC_0a28c.exe

/C/msys64/mingw64/bin/cmake.exe -E remove -f CMakeFiles/cmTC_0a28c.dir/objects.a
ar cr CMakeFiles/cmTC_0a28c.dir/objects.a "CMakeFiles/cmTC_0a28c.dir/CheckLinkerFlag.c.obj" 
/C/msys64/mingw64/bin/x86_64-w64-mingw32-gcc.exe -Wl,-z,relro     -Wl,--whole-archive CMakeFiles/cmTC_0a28c.dir/objects.a -Wl,--no-whole-archive  -o cmTC_0a28c.exe -Wl,--major-image-version,0,--minor-image-version,0 -lkernel32 -luser32 -lgdi32 -lwinspool -lshell32 -lole32 -loleaut32 -luuid -lcomdlg32 -ladvapi32 
C:/msys64/mingw64/bin/../lib/gcc/x86_64-w64-mingw32/8.2.1/../../../../x86_64-w64-mingw32/bin/ld.exe: unrecognized option '-z'

C:/msys64/mingw64/bin/../lib/gcc/x86_64-w64-mingw32/8.2.1/../../../../x86_64-w64-mingw32/bin/ld.exe: use the --help option for usage information

collect2.exe: error: ld returned 1 exit status
make[2]: *** [CMakeFiles/cmTC_0a28c.dir/build.make:88: cmTC_0a28c.exe] Error 1
make[2]: Leaving directory '/home/vagrant/slave/monero-static-win64/build/build/release/CMakeFiles/CMakeTmp'
make[1]: *** [Makefile:121: cmTC_0a28c/fast] Error 2
make[1]: Leaving directory '/home/vagrant/slave/monero-static-win64/build/build/release/CMakeFiles/CMakeTmp'


Determining if the -Wl,-z,now linker flag is supported failed with the following output:
Change Dir: C:/msys64/home/vagrant/slave/monero-static-win64/build/build/release/CMakeFiles/CMakeTmp

Run Build Command:"C:/msys64/usr/bin/make.exe" "cmTC_d93da/fast"
make[1]: Entering directory '/home/vagrant/slave/monero-static-win64/build/build/release/CMakeFiles/CMakeTmp'
/usr/bin/make -f CMakeFiles/cmTC_d93da.dir/build.make CMakeFiles/cmTC_d93da.dir/build
make[2]: Entering directory '/home/vagrant/slave/monero-static-win64/build/build/release/CMakeFiles/CMakeTmp'
Building C object CMakeFiles/cmTC_d93da.dir/CheckLinkerFlag.c.obj

/C/msys64/mingw64/bin/x86_64-w64-mingw32-gcc.exe   -Wl,-z,now    -Wl,-z,now -o CMakeFiles/cmTC_d93da.dir/CheckLinkerFlag.c.obj   -c /C/msys64/home/vagrant/slave/monero-static-win64/build/cmake/CheckLinkerFlag.c
Linking C executable cmTC_d93da.exe

/C/msys64/mingw64/bin/cmake.exe -E remove -f CMakeFiles/cmTC_d93da.dir/objects.a
ar cr CMakeFiles/cmTC_d93da.dir/objects.a "CMakeFiles/cmTC_d93da.dir/CheckLinkerFlag.c.obj" 
/C/msys64/mingw64/bin/x86_64-w64-mingw32-gcc.exe -Wl,-z,now     -Wl,--whole-archive CMakeFiles/cmTC_d93da.dir/objects.a -Wl,--no-whole-archive  -o cmTC_d93da.exe -Wl,--major-image-version,0,--minor-image-version,0 -lkernel32 -luser32 -lgdi32 -lwinspool -lshell32 -lole32 -loleaut32 -luuid -lcomdlg32 -ladvapi32 
C:/msys64/mingw64/bin/../lib/gcc/x86_64-w64-mingw32/8.2.1/../../../../x86_64-w64-mingw32/bin/ld.exe: unrecognized option '-z'

C:/msys64/mingw64/bin/../lib/gcc/x86_64-w64-mingw32/8.2.1/../../../../x86_64-w64-mingw32/bin/ld.exe: use the --help option for usage information

collect2.exe: error: ld returned 1 exit status
make[2]: *** [CMakeFiles/cmTC_d93da.dir/build.make:88: cmTC_d93da.exe] Error 1
make[2]: Leaving directory '/home/vagrant/slave/monero-static-win64/build/build/release/CMakeFiles/CMakeTmp'
make[1]: *** [Makefile:121: cmTC_d93da/fast] Error 2
make[1]: Leaving directory '/home/vagrant/slave/monero-static-win64/build/build/release/CMakeFiles/CMakeTmp'


Determining if the -Wl,-z,noexecstack linker flag is supported failed with the following output:
Change Dir: C:/msys64/home/vagrant/slave/monero-static-win64/build/build/release/CMakeFiles/CMakeTmp

Run Build Command:"C:/msys64/usr/bin/make.exe" "cmTC_82cbf/fast"
make[1]: Entering directory '/home/vagrant/slave/monero-static-win64/build/build/release/CMakeFiles/CMakeTmp'
/usr/bin/make -f CMakeFiles/cmTC_82cbf.dir/build.make CMakeFiles/cmTC_82cbf.dir/build
make[2]: Entering directory '/home/vagrant/slave/monero-static-win64/build/build/release/CMakeFiles/CMakeTmp'
Building C object CMakeFiles/cmTC_82cbf.dir/CheckLinkerFlag.c.obj

/C/msys64/mingw64/bin/x86_64-w64-mingw32-gcc.exe   -Wl,-z,noexecstack    -Wl,-z,noexecstack -o CMakeFiles/cmTC_82cbf.dir/CheckLinkerFlag.c.obj   -c /C/msys64/home/vagrant/slave/monero-static-win64/build/cmake/CheckLinkerFlag.c
Linking C executable cmTC_82cbf.exe

/C/msys64/mingw64/bin/cmake.exe -E remove -f CMakeFiles/cmTC_82cbf.dir/objects.a
ar cr CMakeFiles/cmTC_82cbf.dir/objects.a "CMakeFiles/cmTC_82cbf.dir/CheckLinkerFlag.c.obj" 
/C/msys64/mingw64/bin/x86_64-w64-mingw32-gcc.exe -Wl,-z,noexecstack     -Wl,--whole-archive CMakeFiles/cmTC_82cbf.dir/objects.a -Wl,--no-whole-archive  -o cmTC_82cbf.exe -Wl,--major-image-version,0,--minor-image-version,0 -lkernel32 -luser32 -lgdi32 -lwinspool -lshell32 -lole32 -loleaut32 -luuid -lcomdlg32 -ladvapi32 
C:/msys64/mingw64/bin/../lib/gcc/x86_64-w64-mingw32/8.2.1/../../../../x86_64-w64-mingw32/bin/ld.exe: unrecognized option '-z'

C:/msys64/mingw64/bin/../lib/gcc/x86_64-w64-mingw32/8.2.1/../../../../x86_64-w64-mingw32/bin/ld.exe: use the --help option for usage information

collect2.exe: error: ld returned 1 exit status
make[2]: *** [CMakeFiles/cmTC_82cbf.dir/build.make:88: cmTC_82cbf.exe] Error 1
make[2]: Leaving directory '/home/vagrant/slave/monero-static-win64/build/build/release/CMakeFiles/CMakeTmp'
make[1]: *** [Makefile:121: cmTC_82cbf/fast] Error 2
make[1]: Leaving directory '/home/vagrant/slave/monero-static-win64/build/build/release/CMakeFiles/CMakeTmp'


Determining if the -Wl,-z,noexecheap linker flag is supported failed with the following output:
Change Dir: C:/msys64/home/vagrant/slave/monero-static-win64/build/build/release/CMakeFiles/CMakeTmp

Run Build Command:"C:/msys64/usr/bin/make.exe" "cmTC_4e2c5/fast"
make[1]: Entering directory '/home/vagrant/slave/monero-static-win64/build/build/release/CMakeFiles/CMakeTmp'
/usr/bin/make -f CMakeFiles/cmTC_4e2c5.dir/build.make CMakeFiles/cmTC_4e2c5.dir/build
make[2]: Entering directory '/home/vagrant/slave/monero-static-win64/build/build/release/CMakeFiles/CMakeTmp'
Building C object CMakeFiles/cmTC_4e2c5.dir/CheckLinkerFlag.c.obj

/C/msys64/mingw64/bin/x86_64-w64-mingw32-gcc.exe   -Wl,-z,noexecheap    -Wl,-z,noexecheap -o CMakeFiles/cmTC_4e2c5.dir/CheckLinkerFlag.c.obj   -c /C/msys64/home/vagrant/slave/monero-static-win64/build/cmake/CheckLinkerFlag.c
Linking C executable cmTC_4e2c5.exe

/C/msys64/mingw64/bin/cmake.exe -E remove -f CMakeFiles/cmTC_4e2c5.dir/objects.a
ar cr CMakeFiles/cmTC_4e2c5.dir/objects.a "CMakeFiles/cmTC_4e2c5.dir/CheckLinkerFlag.c.obj" 
/C/msys64/mingw64/bin/x86_64-w64-mingw32-gcc.exe -Wl,-z,noexecheap     -Wl,--whole-archive CMakeFiles/cmTC_4e2c5.dir/objects.a -Wl,--no-whole-archive  -o cmTC_4e2c5.exe -Wl,--major-image-version,0,--minor-image-version,0 -lkernel32 -luser32 -lgdi32 -lwinspool -lshell32 -lole32 -loleaut32 -luuid -lcomdlg32 -ladvapi32 
C:/msys64/mingw64/bin/../lib/gcc/x86_64-w64-mingw32/8.2.1/../../../../x86_64-w64-mingw32/bin/ld.exe: unrecognized option '-z'

C:/msys64/mingw64/bin/../lib/gcc/x86_64-w64-mingw32/8.2.1/../../../../x86_64-w64-mingw32/bin/ld.exe: use the --help option for usage information

collect2.exe: error: ld returned 1 exit status
make[2]: *** [CMakeFiles/cmTC_4e2c5.dir/build.make:88: cmTC_4e2c5.exe] Error 1
make[2]: Leaving directory '/home/vagrant/slave/monero-static-win64/build/build/release/CMakeFiles/CMakeTmp'
make[1]: *** [Makefile:121: cmTC_4e2c5/fast] Error 2
make[1]: Leaving directory '/home/vagrant/slave/monero-static-win64/build/build/release/CMakeFiles/CMakeTmp'


Determining if the function rl_copy_text exists failed with the following output:
Change Dir: C:/msys64/home/vagrant/slave/monero-static-win64/build/build/release/CMakeFiles/CMakeTmp

Run Build Command:"C:/msys64/usr/bin/make.exe" "cmTC_e3837/fast"
make[1]: Entering directory '/home/vagrant/slave/monero-static-win64/build/build/release/CMakeFiles/CMakeTmp'
/usr/bin/make -f CMakeFiles/cmTC_e3837.dir/build.make CMakeFiles/cmTC_e3837.dir/build
make[2]: Entering directory '/home/vagrant/slave/monero-static-win64/build/build/release/CMakeFiles/CMakeTmp'
Building C object CMakeFiles/cmTC_e3837.dir/CheckFunctionExists.c.obj

/C/msys64/mingw64/bin/x86_64-w64-mingw32-gcc.exe   -maes -march=x86-64 -fno-strict-aliasing -std=c11 -D_GNU_SOURCE -m64 -DWIN32_LEAN_AND_MEAN  -Wall -Wextra -Wpointer-arith -Wundef -Wvla -Wwrite-strings -Wno-error=extra -Wno-error=deprecated-declarations -Wno-unused-parameter -Wno-unused-variable -Wno-error=unused-variable -Wno-error=undef -Wno-error=uninitialized -Wlogical-op -Wno-error=maybe-uninitialized -Wno-error=cpp -Wno-error=unused-value -Wno-error=unused-but-set-variable -Waggregate-return -Wnested-externs -Wold-style-definition -Wstrict-prototypes  -fPIC  -U_FORTIFY_SOURCE -D_FORTIFY_SOURCE=1 -Wformat -Wformat-security -mmitigate-rop -fno-strict-aliasing -DCHECK_FUNCTION_EXISTS=rl_copy_text   -o CMakeFiles/cmTC_e3837.dir/CheckFunctionExists.c.obj   -c /C/msys64/mingw64/share/cmake-3.12/Modules/CheckFunctionExists.c
Linking C executable cmTC_e3837.exe

/C/msys64/mingw64/bin/cmake.exe -E remove -f CMakeFiles/cmTC_e3837.dir/objects.a
ar cr CMakeFiles/cmTC_e3837.dir/objects.a "CMakeFiles/cmTC_e3837.dir/CheckFunctionExists.c.obj" 
/C/msys64/mingw64/bin/x86_64-w64-mingw32-gcc.exe  -maes -march=x86-64 -fno-strict-aliasing -std=c11 -D_GNU_SOURCE -m64 -DWIN32_LEAN_AND_MEAN  -Wall -Wextra -Wpointer-arith -Wundef -Wvla -Wwrite-strings -Wno-error=extra -Wno-error=deprecated-declarations -Wno-unused-parameter -Wno-unused-variable -Wno-error=unused-variable -Wno-error=undef -Wno-error=uninitialized -Wlogical-op -Wno-error=maybe-uninitialized -Wno-error=cpp -Wno-error=unused-value -Wno-error=unused-but-set-variable -Waggregate-return -Wnested-externs -Wold-style-definition -Wstrict-prototypes  -fPIC  -U_FORTIFY_SOURCE -D_FORTIFY_SOURCE=1 -Wformat -Wformat-security -mmitigate-rop -fno-strict-aliasing -DCHECK_FUNCTION_EXISTS=rl_copy_text    -Wl,--whole-archive CMakeFiles/cmTC_e3837.dir/objects.a -Wl,--no-whole-archive  -o cmTC_e3837.exe -Wl,--major-image-version,0,--minor-image-version,0 /C/msys64/mingw64/lib/libreadline.a -lkernel32 -luser32 -lgdi32 -lwinspool -lshell32 -lole32 -loleaut32 -luuid -lcomdlg32 -ladvapi32 
C:/msys64/mingw64/lib/libreadline.a(terminal.o):(.text+0x186): undefined reference to `tgetnum'

C:/msys64/mingw64/lib/libreadline.a(terminal.o):(.text+0x2c9): undefined reference to `tgetnum'

C:/msys64/mingw64/lib/libreadline.a(terminal.o):(.text+0x779): undefined reference to `tgetent'

C:/msys64/mingw64/lib/libreadline.a(terminal.o):(.text+0x7bf): undefined reference to `tgetstr'

C:/msys64/mingw64/lib/libreadline.a(terminal.o):(.text+0x81e): undefined reference to `tgetflag'

C:/msys64/mingw64/lib/libreadline.a(terminal.o):(.text+0x86d): undefined reference to `tgetflag'

C:/msys64/mingw64/lib/libreadline.a(terminal.o):(.text+0x988): undefined reference to `tgetflag'

C:/msys64/mingw64/lib/libreadline.a(terminal.o):(.text+0xb87): undefined reference to `tputs'

C:/msys64/mingw64/lib/libreadline.a(terminal.o):(.text+0xc6d): undefined reference to `tputs'

C:/msys64/mingw64/lib/libreadline.a(terminal.o):(.text+0xcb7): undefined reference to `tputs'

C:/msys64/mingw64/lib/libreadline.a(terminal.o):(.text+0xd0d): undefined reference to `tputs'

C:/msys64/mingw64/lib/libreadline.a(terminal.o):(.text+0xd3d): undefined reference to `tputs'

C:/msys64/mingw64/lib/libreadline.a(terminal.o):(.text+0xd80): more undefined references to `tputs' follow

collect2.exe: error: ld returned 1 exit status
make[2]: *** [CMakeFiles/cmTC_e3837.dir/build.make:89: cmTC_e3837.exe] Error 1
make[2]: Leaving directory '/home/vagrant/slave/monero-static-win64/build/build/release/CMakeFiles/CMakeTmp'
make[1]: *** [Makefile:121: cmTC_e3837/fast] Error 2
make[1]: Leaving directory '/home/vagrant/slave/monero-static-win64/build/build/release/CMakeFiles/CMakeTmp'


Determining if the function rl_filename_completion_function exists failed with the following output:
Change Dir: C:/msys64/home/vagrant/slave/monero-static-win64/build/build/release/CMakeFiles/CMakeTmp

Run Build Command:"C:/msys64/usr/bin/make.exe" "cmTC_cc271/fast"
make[1]: Entering directory '/home/vagrant/slave/monero-static-win64/build/build/release/CMakeFiles/CMakeTmp'
/usr/bin/make -f CMakeFiles/cmTC_cc271.dir/build.make CMakeFiles/cmTC_cc271.dir/build
make[2]: Entering directory '/home/vagrant/slave/monero-static-win64/build/build/release/CMakeFiles/CMakeTmp'
Building C object CMakeFiles/cmTC_cc271.dir/CheckFunctionExists.c.obj

/C/msys64/mingw64/bin/x86_64-w64-mingw32-gcc.exe   -maes -march=x86-64 -fno-strict-aliasing -std=c11 -D_GNU_SOURCE -m64 -DWIN32_LEAN_AND_MEAN  -Wall -Wextra -Wpointer-arith -Wundef -Wvla -Wwrite-strings -Wno-error=extra -Wno-error=deprecated-declarations -Wno-unused-parameter -Wno-unused-variable -Wno-error=unused-variable -Wno-error=undef -Wno-error=uninitialized -Wlogical-op -Wno-error=maybe-uninitialized -Wno-error=cpp -Wno-error=unused-value -Wno-error=unused-but-set-variable -Waggregate-return -Wnested-externs -Wold-style-definition -Wstrict-prototypes  -fPIC  -U_FORTIFY_SOURCE -D_FORTIFY_SOURCE=1 -Wformat -Wformat-security -mmitigate-rop -fno-strict-aliasing -DCHECK_FUNCTION_EXISTS=rl_filename_completion_function   -o CMakeFiles/cmTC_cc271.dir/CheckFunctionExists.c.obj   -c /C/msys64/mingw64/share/cmake-3.12/Modules/CheckFunctionExists.c
Linking C executable cmTC_cc271.exe

/C/msys64/mingw64/bin/cmake.exe -E remove -f CMakeFiles/cmTC_cc271.dir/objects.a
ar cr CMakeFiles/cmTC_cc271.dir/objects.a "CMakeFiles/cmTC_cc271.dir/CheckFunctionExists.c.obj" 
/C/msys64/mingw64/bin/x86_64-w64-mingw32-gcc.exe  -maes -march=x86-64 -fno-strict-aliasing -std=c11 -D_GNU_SOURCE -m64 -DWIN32_LEAN_AND_MEAN  -Wall -Wextra -Wpointer-arith -Wundef -Wvla -Wwrite-strings -Wno-error=extra -Wno-error=deprecated-declarations -Wno-unused-parameter -Wno-unused-variable -Wno-error=unused-variable -Wno-error=undef -Wno-error=uninitialized -Wlogical-op -Wno-error=maybe-uninitialized -Wno-error=cpp -Wno-error=unused-value -Wno-error=unused-but-set-variable -Waggregate-return -Wnested-externs -Wold-style-definition -Wstrict-prototypes  -fPIC  -U_FORTIFY_SOURCE -D_FORTIFY_SOURCE=1 -Wformat -Wformat-security -mmitigate-rop -fno-strict-aliasing -DCHECK_FUNCTION_EXISTS=rl_filename_completion_function    -Wl,--whole-archive CMakeFiles/cmTC_cc271.dir/objects.a -Wl,--no-whole-archive  -o cmTC_cc271.exe -Wl,--major-image-version,0,--minor-image-version,0 /C/msys64/mingw64/lib/libreadline.a -lkernel32 -luser32 -lgdi32 -lwinspool -lshell32 -lole32 -loleaut32 -luuid -lcomdlg32 -ladvapi32 
C:/msys64/mingw64/lib/libreadline.a(display.o):(.text+0xa6c): undefined reference to `tputs'

C:/msys64/mingw64/lib/libreadline.a(display.o):(.text+0xb8e): undefined reference to `tputs'

C:/msys64/mingw64/lib/libreadline.a(display.o):(.text+0xbe2): undefined reference to `tputs'

C:/msys64/mingw64/lib/libreadline.a(display.o):(.text+0x19a5): undefined reference to `tputs'

C:/msys64/mingw64/lib/libreadline.a(display.o):(.text+0x2b47): undefined reference to `tputs'

C:/msys64/mingw64/lib/libreadline.a(display.o):(.text+0x2c4e): more undefined references to `tputs' follow

C:/msys64/mingw64/lib/libreadline.a(terminal.o):(.text+0x186): undefined reference to `tgetnum'

C:/msys64/mingw64/lib/libreadline.a(terminal.o):(.text+0x2c9): undefined reference to `tgetnum'

C:/msys64/mingw64/lib/libreadline.a(terminal.o):(.text+0x779): undefined reference to `tgetent'

C:/msys64/mingw64/lib/libreadline.a(terminal.o):(.text+0x7bf): undefined reference to `tgetstr'

C:/msys64/mingw64/lib/libreadline.a(terminal.o):(.text+0x81e): undefined reference to `tgetflag'

C:/msys64/mingw64/lib/libreadline.a(terminal.o):(.text+0x86d): undefined reference to `tgetflag'

C:/msys64/mingw64/lib/libreadline.a(terminal.o):(.text+0x988): undefined reference to `tgetflag'

C:/msys64/mingw64/lib/libreadline.a(terminal.o):(.text+0xb87): undefined reference to `tputs'

C:/msys64/mingw64/lib/libreadline.a(terminal.o):(.text+0xc6d): undefined reference to `tputs'

C:/msys64/mingw64/lib/libreadline.a(terminal.o):(.text+0xcb7): undefined reference to `tputs'

C:/msys64/mingw64/lib/libreadline.a(terminal.o):(.text+0xd0d): undefined reference to `tputs'

C:/msys64/mingw64/lib/libreadline.a(terminal.o):(.text+0xd3d): undefined reference to `tputs'

C:/msys64/mingw64/lib/libreadline.a(terminal.o):(.text+0xd80): more undefined references to `tputs' follow

collect2.exe: error: ld returned 1 exit status
make[2]: *** [CMakeFiles/cmTC_cc271.dir/build.make:89: cmTC_cc271.exe] Error 1
make[2]: Leaving directory '/home/vagrant/slave/monero-static-win64/build/build/release/CMakeFiles/CMakeTmp'
make[1]: *** [Makefile:121: cmTC_cc271/fast] Error 2
make[1]: Leaving directory '/home/vagrant/slave/monero-static-win64/build/build/release/CMakeFiles/CMakeTmp'