(view as text)
make release-static-win32
 in dir C:\msys32\home\buildbot\slave\monero-static-win32\build (timeout 1200 secs)
 watching logfiles {'CMakeOutput': 'build/release/CMakeFiles/CMakeOutput.log', 'CMakeError': 'build/release/CMakeFiles/CMakeError.log'}
 argv: ['make', 'release-static-win32']
 environment:
  ALLUSERSPROFILE=C:\ProgramData
  APPDATA=C:\WINDOWS\system32\config\systemprofile\AppData\Roaming
  CC=clang
  CHOCOLATEYINSTALL=C:\ProgramData\chocolatey
  COMMONPROGRAMFILES=C:\Program Files\Common Files
  COMPUTERNAME=DESKTOP-7NB6IPI
  COMSPEC=C:\WINDOWS\system32\cmd.exe
  CXX=clang++
  DRIVERDATA=C:\Windows\System32\Drivers\DriverData
  DXSDK_DIR=C:\Program Files\Microsoft DirectX SDK (June 2010)\
  HOME=C:\msys32\home\SYSTEM
  LOCALAPPDATA=C:\WINDOWS\system32\config\systemprofile\AppData\Local
  NUMBER_OF_PROCESSORS=1
  OS=Windows_NT
  PATH=C:\msys32\usr\bin;C:\Python27;C:\Python27\Scripts;C:\WINDOWS\system32;C:\WINDOWS;C:\WINDOWS\System32\Wbem;C:\WINDOWS\System32\WindowsPowerShell\v1.0;C:\ProgramData\chocolatey\bin;C:\msys32\mingw32\bin;C:\WINDOWS\System32\OpenSSH;C:\WINDOWS\system32\config\systemprofile\AppData\Local\Microsoft\WindowsApps;C:\python27\lib\site-packages\pywin32_system32
  PATHEXT=.COM;.EXE;.BAT;.CMD;.VBS;.VBE;.JS;.JSE;.WSF;.WSH;.MSC
  PROCESSOR_ARCHITECTURE=x86
  PROCESSOR_IDENTIFIER=x86 Family 6 Model 60 Stepping 3, GenuineIntel
  PROCESSOR_LEVEL=6
  PROCESSOR_REVISION=3c03
  PROGRAMDATA=C:\ProgramData
  PROGRAMFILES=C:\Program Files
  PSMODULEPATH=C:\Program Files\WindowsPowerShell\Modules;C:\WINDOWS\system32\WindowsPowerShell\v1.0\Modules
  PUBLIC=C:\Users\Public
  PWD=C:\msys32\home\buildbot\slave\monero-static-win32\build
  SYSTEMDRIVE=C:
  SYSTEMROOT=C:\WINDOWS
  TEMP=C:\WINDOWS\TEMP
  TERM=cygwin
  TMP=C:\WINDOWS\TEMP
  USERDOMAIN=WORKGROUP
  USERNAME=DESKTOP-7NB6IPI$
  USERPROFILE=C:\WINDOWS\system32\config\systemprofile
  USE_SINGLE_BUILDDIR=1
  WINDIR=C:\WINDOWS
 using PTY: False
mkdir -p build/release
cd build/release && cmake -G "MSYS Makefiles" -D STATIC=ON -D ARCH="i686" -D BUILD_64=OFF -D CMAKE_BUILD_TYPE=Release -D BUILD_TAG="win-x32" -D CMAKE_TOOLCHAIN_FILE=../../cmake/32-bit-toolchain.cmake -D MSYS2_FOLDER=c:/msys32 ../.. && make
-- Found PythonInterp: C:/Python27/python.exe (found version "2.7.12") 
-- CMake version 3.12.4
-- The C compiler identification is GNU 7.4.0
-- The CXX compiler identification is GNU 7.4.0
-- Check for working C compiler: C:/msys32/mingw32/bin/i686-w64-mingw32-gcc.exe
-- Check for working C compiler: C:/msys32/mingw32/bin/i686-w64-mingw32-gcc.exe -- works
-- Detecting C compiler ABI info
-- Detecting C compiler ABI info - done
-- Detecting C compile features
-- Detecting C compile features - done
-- Check for working CXX compiler: C:/msys32/mingw32/bin/i686-w64-mingw32-g++.exe
-- Check for working CXX compiler: C:/msys32/mingw32/bin/i686-w64-mingw32-g++.exe -- works
-- Detecting CXX compiler ABI info
-- Detecting CXX compiler ABI info - done
-- Detecting CXX compile features
-- Detecting CXX compile features - done
-- The ASM compiler identification is GNU
-- Found assembler: C:/msys32/mingw32/bin/i686-w64-mingw32-gcc.exe
-- Building build tag win-x32
-- Found Git: C:/msys32/usr/bin/git.exe (found version "2.20.1") 
-- Checking submodules
-- Submodule 'external/miniupnp' is up-to-date
-- Submodule 'external/unbound' is up-to-date
-- Submodule 'external/rapidjson' is up-to-date
-- Submodule 'external/trezor-common' is up-to-date
-- Submodule 'external/randomx' is up-to-date
-- Could not find DEVELOPER_LOCAL_TOOLS in env (not required)
-- BOOST_IGNORE_SYSTEM_PATHS defaults to OFF
-- Could not find DEVELOPER_LIBUNBOUND_OLD in env (not required)
-- Building for a 32-bit system
-- Building internal libraries as static
-- MSYS location: C:/msys32
-- Using LMDB as default DB type
-- looking for liblzma
-- liblzma found
-- Could not find libunwind (missing: LIBUNWIND_INCLUDE_DIR) 
-- Stack trace on exception disabled
-- Found OpenSSL: C:/msys32/mingw32/lib/libcrypto.a (found version "1.1.1a")  
-- Using OpenSSL include dir at C:/msys32/mingw32/include
-- Found HIDAPI: C:/msys32/mingw32/lib/libhidapi.a  
-- Looking for memset_s in c
-- Looking for memset_s in c - not found
-- Looking for explicit_bzero in c
-- Looking for explicit_bzero in c - not found
-- Looking for strptime
-- Looking for strptime - not found
-- Could NOT find MiniUPnPc (missing: MINIUPNP_INCLUDE_DIR MINIUPNP_LIBRARY) 
-- Using in-tree miniupnpc
-- Looking for libunbound
-- Looking for pthread.h
-- Looking for pthread.h - found
-- Looking for pthread_create
-- Looking for pthread_create - found
-- Found Threads: TRUE  
-- Looking for arpa/inet.h
-- Looking for arpa/inet.h - not found
-- Looking for endian.h
-- Looking for endian.h - not found
-- Looking for dlfcn.h
-- Looking for dlfcn.h - not found
-- Looking for event.h
-- Looking for event.h - not found
-- Looking for getopt.h
-- Looking for getopt.h - found
-- Looking for glob.h
-- Looking for glob.h - not found
-- Looking for grp.h
-- Looking for grp.h - not found
-- Looking for inttypes.h
-- Looking for inttypes.h - found
-- Looking for iphlpapi.h
-- Looking for iphlpapi.h - found
-- Looking for login_cap.h
-- Looking for login_cap.h - not found
-- Looking for memory.h
-- Looking for memory.h - found
-- Looking for netdb.h
-- Looking for netdb.h - not found
-- Looking for netinet/in.h
-- Looking for netinet/in.h - not found
-- Looking for pthread.h
-- Looking for pthread.h - found
-- Looking for pwd.h
-- Looking for pwd.h - not found
-- Looking for stdarg.h
-- Looking for stdarg.h - found
-- Looking for stdbool.h
-- Looking for stdbool.h - found
-- Looking for stdint.h
-- Looking for stdint.h - found
-- Looking for stdlib.h
-- Looking for stdlib.h - found
-- Looking for strings.h
-- Looking for strings.h - found
-- Looking for string.h
-- Looking for string.h - found
-- Looking for sys/param.h
-- Looking for sys/param.h - found
-- Looking for sys/resource.h
-- Looking for sys/resource.h - not found
-- Looking for sys/sha2.h
-- Looking for sys/sha2.h - not found
-- Looking for sys/socket.h
-- Looking for sys/socket.h - not found
-- Looking for sys/stat.h
-- Looking for sys/stat.h - found
-- Looking for sys/sysctl.h
-- Looking for sys/sysctl.h - not found
-- Looking for sys/types.h
-- Looking for sys/types.h - found
-- Looking for sys/uio.h
-- Looking for sys/uio.h - not found
-- Looking for sys/un.h
-- Looking for sys/un.h - not found
-- Looking for sys/wait.h
-- Looking for sys/wait.h - not found
-- Looking for syslog.h
-- Looking for syslog.h - not found
-- Looking for time.h
-- Looking for time.h - found
-- Looking for unistd.h
-- Looking for unistd.h - found
-- Looking for vfork.h
-- Looking for vfork.h - not found
-- Looking for windows.h
-- Looking for windows.h - found
-- Looking for winsock2.h
-- Looking for winsock2.h - found
-- Looking for ws2tcpip.h
-- Looking for ws2tcpip.h - found
-- Looking for _beginthreadex
-- Looking for _beginthreadex - found
-- Looking for arc4random
-- Looking for arc4random - not found
-- Looking for arc4random_uniform
-- Looking for arc4random_uniform - not found
-- Looking for chown
-- Looking for chown - not found
-- Looking for chroot
-- Looking for chroot - not found
-- Looking for ctime_r
-- Looking for ctime_r - not found
-- Looking for daemon
-- Looking for daemon - not found
-- Looking for endprotoent
-- Looking for endprotoent - not found
-- Looking for endservent
-- Looking for endservent - not found
-- Looking for fork
-- Looking for fork - not found
-- Looking for fseeko
-- Looking for fseeko - found
-- Looking for fsync
-- Looking for fsync - not found
-- Looking for getauxval
-- Looking for getauxval - not found
-- Looking for getentropy
-- Looking for getentropy - not found
-- Looking for getpwnam
-- Looking for getpwnam - not found
-- Looking for getrlimit
-- Looking for getrlimit - not found
-- Looking for glob
-- Looking for glob - not found
-- Looking for gmtime_r
-- Looking for gmtime_r - not found
-- Looking for fcntl
-- Looking for fcntl - not found
-- Looking for inet_aton
-- Looking for inet_aton - not found
-- Looking for inet_ntop
-- Looking for inet_ntop - not found
-- Looking for inet_pton
-- Looking for inet_pton - not found
-- Looking for initgroups
-- Looking for initgroups - not found
-- Looking for ioctlsocket
-- Looking for ioctlsocket - not found
-- Looking for isblank
-- Looking for isblank - found
-- Looking for kill
-- Looking for kill - not found
-- Looking for localtime_r
-- Looking for localtime_r - not found
-- Looking for malloc
-- Looking for malloc - found
-- Looking for memmove
-- Looking for memmove - found
-- Looking for random
-- Looking for random - not found
-- Looking for reallocarray
-- Looking for reallocarray - not found
-- Looking for recvmsg
-- Looking for recvmsg - not found
-- Looking for sbrk
-- Looking for sbrk - not found
-- Looking for sendmsg
-- Looking for sendmsg - not found
-- Looking for setregid
-- Looking for setregid - not found
-- Looking for setresgid
-- Looking for setresgid - not found
-- Looking for setresuid
-- Looking for setresuid - not found
-- Looking for setreuid
-- Looking for setreuid - not found
-- Looking for setrlimit
-- Looking for setrlimit - not found
-- Looking for setsid
-- Looking for setsid - not found
-- Looking for setusercontent
-- Looking for setusercontent - not found
-- Looking for sigprocmask
-- Looking for sigprocmask - not found
-- Looking for sleep
-- Looking for sleep - found
-- Looking for snprintf
-- Looking for snprintf - found
-- Looking for socketpair
-- Looking for socketpair - not found
-- Looking for srandom
-- Looking for srandom - not found
-- Looking for strsep
-- Looking for strsep - not found
-- Looking for strftime
-- Looking for strftime - found
-- Looking for strlcat
-- Looking for strlcat - not found
-- Looking for strlcpy
-- Looking for strlcpy - not found
-- Looking for strptime
-- Looking for strptime - not found
-- Looking for tzset
-- Looking for tzset - found
-- Looking for usleep
-- Looking for usleep - found
-- Looking for writev
-- Looking for writev - not found
-- Looking for getaddrinfo
-- Looking for getaddrinfo - found
-- Looking for stddef.h
CMake Warning (dev) at C:/msys32/mingw32/share/cmake-3.12/Modules/CheckIncludeFile.cmake:70 (message):
  Policy CMP0075 is not set: Include file check macros honor
  CMAKE_REQUIRED_LIBRARIES.  Run "cmake --help-policy CMP0075" for policy
  details.  Use the cmake_policy command to set the policy and suppress this
  warning.

  CMAKE_REQUIRED_LIBRARIES is set to:

    iphlpapi;ws2_32

  For compatibility with CMake 3.11 and below this check is ignoring it.
Call Stack (most recent call first):
  C:/msys32/mingw32/share/cmake-3.12/Modules/CheckTypeSize.cmake:227 (check_include_file)
  external/unbound/configure_checks.cmake:138 (check_type_size)
  external/unbound/CMakeLists.txt:35 (include)
This warning is for project developers.  Use -Wno-dev to suppress it.

-- Looking for stddef.h - found
-- Check size of time_t
-- Check size of time_t - done
-- Check size of gid_t
-- Check size of gid_t - failed
-- Check size of in_addr_t
-- Check size of in_addr_t - failed
-- Check size of in_port_t
-- Check size of in_port_t - failed
-- Check size of int16_t
-- Check size of int16_t - done
-- Check size of int32_t
-- Check size of int32_t - done
-- Check size of int64_t
-- Check size of int64_t - done
-- Check size of int8_t
-- Check size of int8_t - done
-- Check size of pid_t
-- Check size of pid_t - done
-- Check size of rlim_t
-- Check size of rlim_t - failed
-- Check size of ssize_t
-- Check size of ssize_t - done
-- Check size of uid_t
-- Check size of uid_t - failed
-- Check size of uint16_t
-- Check size of uint16_t - done
-- Check size of uint32_t
-- Check size of uint32_t - done
-- Check size of uint64_t
-- Check size of uint64_t - done
-- Check size of uint8_t
-- Check size of uint8_t - done
-- Looking for PTHREAD_PRIO_INHERIT
-- Looking for PTHREAD_PRIO_INHERIT - found
-- Looking for pthread_rwlock_t
-- Looking for pthread_rwlock_t - not found
-- Looking for pthread_spinlock_t
-- Looking for pthread_spinlock_t - not found
-- Looking for openssl/conf.h
-- Looking for openssl/conf.h - found
-- Looking for openssl/engine.h
-- Looking for openssl/engine.h - found
-- Looking for openssl/err.h
-- Looking for openssl/err.h - found
-- Looking for openssl/rand.h
-- Looking for openssl/rand.h - found
-- Looking for openssl/ssl.h
-- Looking for openssl/ssl.h - found
-- Looking for NID_secp384r1
-- Looking for NID_secp384r1 - found
-- Looking for NID_X9_62_prime256v1
-- Looking for NID_X9_62_prime256v1 - found
-- Looking for sk_SSL_COMP_pop_free
-- Looking for sk_SSL_COMP_pop_free - found
-- Looking for SSL_COMP_get_compression_methods
-- Looking for SSL_COMP_get_compression_methods - found
-- Looking for EVP_MD_CTX_new
-- Looking for EVP_MD_CTX_new - found
-- Looking for EVP_sha1
-- Looking for EVP_sha1 - found
-- Looking for EVP_sha256
-- Looking for EVP_sha256 - found
-- Looking for EVP_sha512
-- Looking for EVP_sha512 - found
-- Looking for FIPS_mode
-- Looking for FIPS_mode - found
-- Looking for HMAC_Update
-- Looking for HMAC_Update - found
-- Looking for OPENSSL_config
-- Looking for OPENSSL_config - found
-- Looking for SHA512_Update
-- Looking for SHA512_Update - found
-- Looking for LIBRESSL_VERSION_TEXT
-- Looking for LIBRESSL_VERSION_TEXT - not found
-- Using 32-bit LMDB from source tree
-- Looking for backtrace
-- Looking for backtrace - not found
-- Backtrace_LIBRARY: 
-- Could NOT find Backtrace (missing: Backtrace_LIBRARY Backtrace_INCLUDE_DIR) 
-- Performing Test HAVE_CXX_ATOMICS
-- Performing Test HAVE_CXX_ATOMICS - Success
-- Using HIDAPI include dir at C:/msys32/mingw32/include/hidapi
-- Could NOT find Protobuf (missing: Protobuf_LIBRARIES Protobuf_INCLUDE_DIR) 
-- Could NOT find Protobuf (missing: Protobuf_LIBRARIES Protobuf_INCLUDE_DIR) 
-- Could not find Protobuf
-- Building on x86 for i686
-- AES support enabled
-- Performing Test _Wformat_c
-- Performing Test _Wformat_c - Success
-- Performing Test _Wformat_cxx
-- Performing Test _Wformat_cxx - Success
-- Performing Test _Wformat_security_c
-- Performing Test _Wformat_security_c - Success
-- Performing Test _Wformat_security_cxx
-- Performing Test _Wformat_security_cxx - Success
-- Performing Test _mmitigate_rop_c
-- Performing Test _mmitigate_rop_c - Success
-- Performing Test _mmitigate_rop_cxx
-- Performing Test _mmitigate_rop_cxx - Success
-- Looking for -Wl,-z,relro linker flag
-- Looking for -Wl,-z,relro linker flag - not found
-- Looking for -Wl,-z,now linker flag
-- Looking for -Wl,-z,now linker flag - not found
-- Looking for -Wl,-z,noexecstack linker flag
-- Looking for -Wl,-z,noexecstack linker flag - not found
-- Looking for -Wl,-z,noexecheap linker flag
-- Looking for -Wl,-z,noexecheap linker flag - not found
-- Looking for -Wl,--dynamicbase linker flag
-- Looking for -Wl,--dynamicbase linker flag - found
-- Looking for -Wl,--nxcompat linker flag
-- Looking for -Wl,--nxcompat linker flag - found
-- Looking for -Wl,--high-entropy-va linker flag
-- Looking for -Wl,--high-entropy-va linker flag - not found
-- Using C security hardening flags:  -U_FORTIFY_SOURCE -D_FORTIFY_SOURCE=1 -Wformat -Wformat-security -mmitigate-rop
-- Using C++ security hardening flags:  -U_FORTIFY_SOURCE -D_FORTIFY_SOURCE=1 -Wformat -Wformat-security -mmitigate-rop
-- Using linker security hardening flags:  -Wl,--dynamicbase -Wl,--nxcompat
CMake Warning at C:/msys32/mingw32/share/cmake-3.12/Modules/FindBoost.cmake:847 (message):
  New Boost version may have incorrect or missing dependencies and imported
  targets
Call Stack (most recent call first):
  C:/msys32/mingw32/share/cmake-3.12/Modules/FindBoost.cmake:963 (_Boost_COMPONENT_DEPENDENCIES)
  C:/msys32/mingw32/share/cmake-3.12/Modules/FindBoost.cmake:1622 (_Boost_MISSING_DEPENDENCIES)
  CMakeLists.txt:856 (find_package)


CMake Warning at C:/msys32/mingw32/share/cmake-3.12/Modules/FindBoost.cmake:847 (message):
  New Boost version may have incorrect or missing dependencies and imported
  targets
Call Stack (most recent call first):
  C:/msys32/mingw32/share/cmake-3.12/Modules/FindBoost.cmake:963 (_Boost_COMPONENT_DEPENDENCIES)
  C:/msys32/mingw32/share/cmake-3.12/Modules/FindBoost.cmake:1622 (_Boost_MISSING_DEPENDENCIES)
  CMakeLists.txt:856 (find_package)


CMake Warning at C:/msys32/mingw32/share/cmake-3.12/Modules/FindBoost.cmake:847 (message):
  New Boost version may have incorrect or missing dependencies and imported
  targets
Call Stack (most recent call first):
  C:/msys32/mingw32/share/cmake-3.12/Modules/FindBoost.cmake:963 (_Boost_COMPONENT_DEPENDENCIES)
  C:/msys32/mingw32/share/cmake-3.12/Modules/FindBoost.cmake:1622 (_Boost_MISSING_DEPENDENCIES)
  CMakeLists.txt:856 (find_package)


CMake Warning at C:/msys32/mingw32/share/cmake-3.12/Modules/FindBoost.cmake:847 (message):
  New Boost version may have incorrect or missing dependencies and imported
  targets
Call Stack (most recent call first):
  C:/msys32/mingw32/share/cmake-3.12/Modules/FindBoost.cmake:963 (_Boost_COMPONENT_DEPENDENCIES)
  C:/msys32/mingw32/share/cmake-3.12/Modules/FindBoost.cmake:1622 (_Boost_MISSING_DEPENDENCIES)
  CMakeLists.txt:856 (find_package)


CMake Warning at C:/msys32/mingw32/share/cmake-3.12/Modules/FindBoost.cmake:847 (message):
  New Boost version may have incorrect or missing dependencies and imported
  targets
Call Stack (most recent call first):
  C:/msys32/mingw32/share/cmake-3.12/Modules/FindBoost.cmake:963 (_Boost_COMPONENT_DEPENDENCIES)
  C:/msys32/mingw32/share/cmake-3.12/Modules/FindBoost.cmake:1622 (_Boost_MISSING_DEPENDENCIES)
  CMakeLists.txt:856 (find_package)


CMake Warning at C:/msys32/mingw32/share/cmake-3.12/Modules/FindBoost.cmake:847 (message):
  New Boost version may have incorrect or missing dependencies and imported
  targets
Call Stack (most recent call first):
  C:/msys32/mingw32/share/cmake-3.12/Modules/FindBoost.cmake:963 (_Boost_COMPONENT_DEPENDENCIES)
  C:/msys32/mingw32/share/cmake-3.12/Modules/FindBoost.cmake:1622 (_Boost_MISSING_DEPENDENCIES)
  CMakeLists.txt:856 (find_package)


CMake Warning at C:/msys32/mingw32/share/cmake-3.12/Modules/FindBoost.cmake:847 (message):
  New Boost version may have incorrect or missing dependencies and imported
  targets
Call Stack (most recent call first):
  C:/msys32/mingw32/share/cmake-3.12/Modules/FindBoost.cmake:963 (_Boost_COMPONENT_DEPENDENCIES)
  C:/msys32/mingw32/share/cmake-3.12/Modules/FindBoost.cmake:1622 (_Boost_MISSING_DEPENDENCIES)
  CMakeLists.txt:856 (find_package)


CMake Warning at C:/msys32/mingw32/share/cmake-3.12/Modules/FindBoost.cmake:847 (message):
  New Boost version may have incorrect or missing dependencies and imported
  targets
Call Stack (most recent call first):
  C:/msys32/mingw32/share/cmake-3.12/Modules/FindBoost.cmake:963 (_Boost_COMPONENT_DEPENDENCIES)
  C:/msys32/mingw32/share/cmake-3.12/Modules/FindBoost.cmake:1622 (_Boost_MISSING_DEPENDENCIES)
  CMakeLists.txt:856 (find_package)


CMake Warning at C:/msys32/mingw32/share/cmake-3.12/Modules/FindBoost.cmake:847 (message):
  New Boost version may have incorrect or missing dependencies and imported
  targets
Call Stack (most recent call first):
  C:/msys32/mingw32/share/cmake-3.12/Modules/FindBoost.cmake:963 (_Boost_COMPONENT_DEPENDENCIES)
  C:/msys32/mingw32/share/cmake-3.12/Modules/FindBoost.cmake:1622 (_Boost_MISSING_DEPENDENCIES)
  CMakeLists.txt:856 (find_package)


CMake Warning at C:/msys32/mingw32/share/cmake-3.12/Modules/FindBoost.cmake:847 (message):
  New Boost version may have incorrect or missing dependencies and imported
  targets
Call Stack (most recent call first):
  C:/msys32/mingw32/share/cmake-3.12/Modules/FindBoost.cmake:963 (_Boost_COMPONENT_DEPENDENCIES)
  C:/msys32/mingw32/share/cmake-3.12/Modules/FindBoost.cmake:1622 (_Boost_MISSING_DEPENDENCIES)
  CMakeLists.txt:856 (find_package)


-- Found Boost Version: 106900
-- Could NOT find Readline (missing: Readline_INCLUDE_DIR) 
-- Looking for rl_copy_text
-- Looking for rl_copy_text - not found
-- Looking for rl_filename_completion_function
-- Looking for rl_filename_completion_function - not found
-- Looking for rl_copy_text
-- Looking for rl_copy_text - found
-- Looking for rl_filename_completion_function
-- Looking for rl_filename_completion_function - found
-- Could not find GNU readline library so building without readline support
-- Found Git: C:/msys32/usr/bin/git.exe
-- You are currently on commit 411f1b0ee
-- The most recent tag was at 6def88ad
-- You are ahead of or behind a tagged release
-- Trezor support disabled
-- Not building tests
-- Not building debug utilities
Doxygen: graphviz not found - graphs disabled
-- Found Doxygen: C:/msys32/usr/bin/doxygen.exe (found version "1.8.15") found components:  doxygen missing components:  dot
-- Performing Test HAVE_C11
-- Performing Test HAVE_C11 - Success
-- Configuring done
-- Generating done
-- Build files have been written to: C:/msys32/home/buildbot/slave/monero-static-win32/build/build/release
make[1]: Entering directory '/home/buildbot/slave/monero-static-win32/build/build/release'
make[2]: Entering directory '/home/buildbot/slave/monero-static-win32/build/build/release'
make[3]: Entering directory '/home/buildbot/slave/monero-static-win32/build/build/release'
Scanning dependencies of target generate_translations_header
make[3]: Leaving directory '/home/buildbot/slave/monero-static-win32/build/build/release'
make[3]: Entering directory '/home/buildbot/slave/monero-static-win32/build/build/release'
[  1%] Creating directories for 'generate_translations_header'
[  1%] No download step for 'generate_translations_header'
[  1%] No patch step for 'generate_translations_header'
[  1%] No update step for 'generate_translations_header'
[  2%] Performing configure step for 'generate_translations_header'
-- The C compiler identification is Clang 7.0.1
-- The CXX compiler identification is Clang 7.0.1
-- Check for working C compiler: C:/msys32/mingw32/bin/clang.exe
-- Check for working C compiler: C:/msys32/mingw32/bin/clang.exe -- works
-- Detecting C compiler ABI info
-- Detecting C compiler ABI info - done
-- Detecting C compile features
-- Detecting C compile features - done
-- Check for working CXX compiler: C:/msys32/mingw32/bin/clang++.exe
-- Check for working CXX compiler: C:/msys32/mingw32/bin/clang++.exe -- works
-- Detecting CXX compiler ABI info
-- Detecting CXX compiler ABI info - done
-- Detecting CXX compile features
-- Detecting CXX compile features - done
-- Configuring done
CMake Warning at CMakeLists.txt:53 (message):
  lrelease program not found, translation files not built


-- Generating done
-- Build files have been written to: C:/msys32/home/buildbot/slave/monero-static-win32/build/build/release/translations
[  2%] Performing build step for 'generate_translations_header'
make[4]: Entering directory '/C/msys32/home/buildbot/slave/monero-static-win32/build/build/release/translations'
make[5]: Entering directory '/C/msys32/home/buildbot/slave/monero-static-win32/build/build/release/translations'
make[6]: Entering directory '/C/msys32/home/buildbot/slave/monero-static-win32/build/build/release/translations'
Scanning dependencies of target generate_translations_header
make[6]: Leaving directory '/C/msys32/home/buildbot/slave/monero-static-win32/build/build/release/translations'
make[6]: Entering directory '/C/msys32/home/buildbot/slave/monero-static-win32/build/build/release/translations'
[ 50%] Building C object CMakeFiles/generate_translations_header.dir/generate_translations_header.c.obj
[100%] Linking C executable generate_translations_header.exe
Generating embedded translations header
make[6]: Leaving directory '/C/msys32/home/buildbot/slave/monero-static-win32/build/build/release/translations'
[100%] Built target generate_translations_header
make[5]: Leaving directory '/C/msys32/home/buildbot/slave/monero-static-win32/build/build/release/translations'
make[4]: Leaving directory '/C/msys32/home/buildbot/slave/monero-static-win32/build/build/release/translations'
[  2%] Performing install step for 'generate_translations_header'

[  2%] Completed 'generate_translations_header'
make[3]: Leaving directory '/home/buildbot/slave/monero-static-win32/build/build/release'
[  2%] Built target generate_translations_header
make[3]: Entering directory '/home/buildbot/slave/monero-static-win32/build/build/release'
Scanning dependencies of target libminiupnpc-static
make[3]: Leaving directory '/home/buildbot/slave/monero-static-win32/build/build/release'
make[3]: Entering directory '/home/buildbot/slave/monero-static-win32/build/build/release'
[  3%] Building C object external/miniupnp/miniupnpc/CMakeFiles/libminiupnpc-static.dir/igd_desc_parse.c.obj
[  3%] Building C object external/miniupnp/miniupnpc/CMakeFiles/libminiupnpc-static.dir/miniupnpc.c.obj
[  3%] Building C object external/miniupnp/miniupnpc/CMakeFiles/libminiupnpc-static.dir/minixml.c.obj
[  3%] Building C object external/miniupnp/miniupnpc/CMakeFiles/libminiupnpc-static.dir/minisoap.c.obj
[  4%] Building C object external/miniupnp/miniupnpc/CMakeFiles/libminiupnpc-static.dir/minissdpc.c.obj
[  4%] Building C object external/miniupnp/miniupnpc/CMakeFiles/libminiupnpc-static.dir/miniwget.c.obj
[  4%] Building C object external/miniupnp/miniupnpc/CMakeFiles/libminiupnpc-static.dir/upnpcommands.c.obj
[  5%] Building C object external/miniupnp/miniupnpc/CMakeFiles/libminiupnpc-static.dir/upnpdev.c.obj
[  5%] Building C object external/miniupnp/miniupnpc/CMakeFiles/libminiupnpc-static.dir/upnpreplyparse.c.obj
[  5%] Building C object external/miniupnp/miniupnpc/CMakeFiles/libminiupnpc-static.dir/upnperrors.c.obj
[  5%] Building C object external/miniupnp/miniupnpc/CMakeFiles/libminiupnpc-static.dir/connecthostport.c.obj
[  6%] Building C object external/miniupnp/miniupnpc/CMakeFiles/libminiupnpc-static.dir/portlistingparse.c.obj
[  6%] Building C object external/miniupnp/miniupnpc/CMakeFiles/libminiupnpc-static.dir/receivedata.c.obj
[  6%] Linking C static library libminiupnpc.a
make[3]: Leaving directory '/home/buildbot/slave/monero-static-win32/build/build/release'
[  6%] Built target libminiupnpc-static
make[3]: Entering directory '/home/buildbot/slave/monero-static-win32/build/build/release'
Scanning dependencies of target unbound
make[3]: Leaving directory '/home/buildbot/slave/monero-static-win32/build/build/release'
make[3]: Entering directory '/home/buildbot/slave/monero-static-win32/build/build/release'
[  6%] Building C object external/unbound/CMakeFiles/unbound.dir/services/authzone.c.obj
[  7%] Building C object external/unbound/CMakeFiles/unbound.dir/services/cache/dns.c.obj
[  7%] Building C object external/unbound/CMakeFiles/unbound.dir/services/cache/infra.c.obj
[  7%] Building C object external/unbound/CMakeFiles/unbound.dir/services/cache/rrset.c.obj
[  8%] Building C object external/unbound/CMakeFiles/unbound.dir/util/data/dname.c.obj
[  8%] Building C object external/unbound/CMakeFiles/unbound.dir/util/data/msgencode.c.obj
[  8%] Building C object external/unbound/CMakeFiles/unbound.dir/util/data/msgparse.c.obj
[  8%] Building C object external/unbound/CMakeFiles/unbound.dir/util/data/msgreply.c.obj
[  9%] Building C object external/unbound/CMakeFiles/unbound.dir/util/data/packed_rrset.c.obj
[  9%] Building C object external/unbound/CMakeFiles/unbound.dir/iterator/iterator.c.obj
[  9%] Building C object external/unbound/CMakeFiles/unbound.dir/iterator/iter_delegpt.c.obj
[ 10%] Building C object external/unbound/CMakeFiles/unbound.dir/iterator/iter_donotq.c.obj
[ 10%] Building C object external/unbound/CMakeFiles/unbound.dir/iterator/iter_fwd.c.obj
[ 10%] Building C object external/unbound/CMakeFiles/unbound.dir/iterator/iter_hints.c.obj
[ 10%] Building C object external/unbound/CMakeFiles/unbound.dir/iterator/iter_priv.c.obj
[ 11%] Building C object external/unbound/CMakeFiles/unbound.dir/iterator/iter_resptype.c.obj
[ 11%] Building C object external/unbound/CMakeFiles/unbound.dir/iterator/iter_scrub.c.obj
[ 11%] Building C object external/unbound/CMakeFiles/unbound.dir/iterator/iter_utils.c.obj
[ 11%] Building C object external/unbound/CMakeFiles/unbound.dir/respip/respip.c.obj
[ 12%] Building C object external/unbound/CMakeFiles/unbound.dir/services/listen_dnsport.c.obj
[ 12%] Building C object external/unbound/CMakeFiles/unbound.dir/services/localzone.c.obj
[ 12%] Building C object external/unbound/CMakeFiles/unbound.dir/services/mesh.c.obj
[ 13%] Building C object external/unbound/CMakeFiles/unbound.dir/services/modstack.c.obj
[ 13%] Building C object external/unbound/CMakeFiles/unbound.dir/services/outbound_list.c.obj
[ 13%] Building C object external/unbound/CMakeFiles/unbound.dir/services/outside_network.c.obj
[ 13%] Building C object external/unbound/CMakeFiles/unbound.dir/services/view.c.obj
[ 14%] Building C object external/unbound/CMakeFiles/unbound.dir/util/alloc.c.obj
[ 14%] Building C object external/unbound/CMakeFiles/unbound.dir/util/as112.c.obj
[ 14%] Building C object external/unbound/CMakeFiles/unbound.dir/util/config_file.c.obj
[ 15%] Building C object external/unbound/CMakeFiles/unbound.dir/util/configlexer.c.obj
[ 15%] Building C object external/unbound/CMakeFiles/unbound.dir/util/configparser.c.obj
[ 15%] Building C object external/unbound/CMakeFiles/unbound.dir/util/fptr_wlist.c.obj
[ 15%] Building C object external/unbound/CMakeFiles/unbound.dir/util/locks.c.obj
[ 17%] Building C object external/unbound/CMakeFiles/unbound.dir/util/log.c.obj
[ 17%] Building C object external/unbound/CMakeFiles/unbound.dir/util/mini_event.c.obj
[ 17%] Building C object external/unbound/CMakeFiles/unbound.dir/util/module.c.obj
[ 18%] Building C object external/unbound/CMakeFiles/unbound.dir/util/netevent.c.obj
[ 18%] Building C object external/unbound/CMakeFiles/unbound.dir/util/net_help.c.obj
[ 18%] Building C object external/unbound/CMakeFiles/unbound.dir/util/random.c.obj
[ 18%] Building C object external/unbound/CMakeFiles/unbound.dir/util/rbtree.c.obj
[ 19%] Building C object external/unbound/CMakeFiles/unbound.dir/util/regional.c.obj
[ 19%] Building C object external/unbound/CMakeFiles/unbound.dir/util/rtt.c.obj
[ 19%] Building C object external/unbound/CMakeFiles/unbound.dir/util/storage/dnstree.c.obj
[ 19%] Building C object external/unbound/CMakeFiles/unbound.dir/util/storage/lookup3.c.obj
[ 20%] Building C object external/unbound/CMakeFiles/unbound.dir/util/storage/lruhash.c.obj
[ 20%] Building C object external/unbound/CMakeFiles/unbound.dir/util/storage/slabhash.c.obj
[ 20%] Building C object external/unbound/CMakeFiles/unbound.dir/util/timehist.c.obj
[ 21%] Building C object external/unbound/CMakeFiles/unbound.dir/util/tube.c.obj
[ 21%] Building C object external/unbound/CMakeFiles/unbound.dir/util/ub_event.c.obj
[ 21%] Building C object external/unbound/CMakeFiles/unbound.dir/util/winsock_event.c.obj
[ 21%] Building C object external/unbound/CMakeFiles/unbound.dir/validator/autotrust.c.obj
[ 22%] Building C object external/unbound/CMakeFiles/unbound.dir/validator/val_anchor.c.obj
[ 22%] Building C object external/unbound/CMakeFiles/unbound.dir/validator/validator.c.obj
[ 22%] Building C object external/unbound/CMakeFiles/unbound.dir/validator/val_kcache.c.obj
[ 23%] Building C object external/unbound/CMakeFiles/unbound.dir/validator/val_kentry.c.obj
[ 23%] Building C object external/unbound/CMakeFiles/unbound.dir/validator/val_neg.c.obj
[ 23%] Building C object external/unbound/CMakeFiles/unbound.dir/validator/val_nsec3.c.obj
[ 23%] Building C object external/unbound/CMakeFiles/unbound.dir/validator/val_nsec.c.obj
[ 24%] Building C object external/unbound/CMakeFiles/unbound.dir/validator/val_secalgo.c.obj
[ 24%] Building C object external/unbound/CMakeFiles/unbound.dir/validator/val_sigcrypt.c.obj
[ 24%] Building C object external/unbound/CMakeFiles/unbound.dir/validator/val_utils.c.obj
[ 25%] Building C object external/unbound/CMakeFiles/unbound.dir/dns64/dns64.c.obj
[ 25%] Building C object external/unbound/CMakeFiles/unbound.dir/testcode/checklocks.c.obj
[ 25%] Building C object external/unbound/CMakeFiles/unbound.dir/sldns/keyraw.c.obj
[ 25%] Building C object external/unbound/CMakeFiles/unbound.dir/sldns/sbuffer.c.obj
[ 26%] Building C object external/unbound/CMakeFiles/unbound.dir/sldns/wire2str.c.obj
[ 26%] Building C object external/unbound/CMakeFiles/unbound.dir/sldns/parse.c.obj
[ 26%] Building C object external/unbound/CMakeFiles/unbound.dir/sldns/parseutil.c.obj
[ 26%] Building C object external/unbound/CMakeFiles/unbound.dir/sldns/rrdef.c.obj
[ 27%] Building C object external/unbound/CMakeFiles/unbound.dir/sldns/str2wire.c.obj
[ 27%] Building C object external/unbound/CMakeFiles/unbound.dir/compat/ctime_r.c.obj
[ 27%] Building C object external/unbound/CMakeFiles/unbound.dir/compat/gmtime_r.c.obj
[ 28%] Building C object external/unbound/CMakeFiles/unbound.dir/compat/inet_aton.c.obj
[ 28%] Building C object external/unbound/CMakeFiles/unbound.dir/compat/inet_ntop.c.obj
[ 28%] Building C object external/unbound/CMakeFiles/unbound.dir/compat/inet_pton.c.obj
[ 28%] Building C object external/unbound/CMakeFiles/unbound.dir/compat/strsep.c.obj
[ 29%] Building C object external/unbound/CMakeFiles/unbound.dir/compat/strlcat.c.obj
[ 29%] Building C object external/unbound/CMakeFiles/unbound.dir/compat/strlcpy.c.obj
[ 29%] Building C object external/unbound/CMakeFiles/unbound.dir/compat/strptime.c.obj
[ 30%] Building C object external/unbound/CMakeFiles/unbound.dir/compat/explicit_bzero.c.obj
[ 30%] Building C object external/unbound/CMakeFiles/unbound.dir/compat/arc4random.c.obj
[ 30%] Building C object external/unbound/CMakeFiles/unbound.dir/compat/arc4random_uniform.c.obj
[ 30%] Building C object external/unbound/CMakeFiles/unbound.dir/compat/reallocarray.c.obj
[ 31%] Building C object external/unbound/CMakeFiles/unbound.dir/compat/arc4_lock.c.obj
[ 31%] Building C object external/unbound/CMakeFiles/unbound.dir/compat/getentropy_win.c.obj
[ 31%] Building C object external/unbound/CMakeFiles/unbound.dir/libunbound/context.c.obj
[ 32%] Building C object external/unbound/CMakeFiles/unbound.dir/libunbound/libunbound.c.obj
[ 32%] Building C object external/unbound/CMakeFiles/unbound.dir/libunbound/libworker.c.obj
[ 32%] Linking C static library libunbound.a
make[3]: Leaving directory '/home/buildbot/slave/monero-static-win32/build/build/release'
[ 32%] Built target unbound
make[3]: Entering directory '/home/buildbot/slave/monero-static-win32/build/build/release'
Scanning dependencies of target lmdb
make[3]: Leaving directory '/home/buildbot/slave/monero-static-win32/build/build/release'
make[3]: Entering directory '/home/buildbot/slave/monero-static-win32/build/build/release'
[ 34%] Building C object external/db_drivers/liblmdb/CMakeFiles/lmdb.dir/mdb.c.obj
C:/msys32/home/buildbot/slave/monero-static-win32/build/external/db_drivers/liblmdb/mdb.c: In function 'mdb_strerror':
cc1.exe: warning: function may return address of local variable [-Wreturn-local-addr]
C:/msys32/home/buildbot/slave/monero-static-win32/build/external/db_drivers/liblmdb/mdb.c:1710:7: note: declared here
  char buf[MSGSIZE+PADSIZE], *ptr = buf;
       ^~~
[ 34%] Building C object external/db_drivers/liblmdb/CMakeFiles/lmdb.dir/midl.c.obj
[ 34%] Linking C static library liblmdb.a
make[3]: Leaving directory '/home/buildbot/slave/monero-static-win32/build/build/release'
[ 34%] Built target lmdb
make[3]: Entering directory '/home/buildbot/slave/monero-static-win32/build/build/release'
Scanning dependencies of target easylogging
make[3]: Leaving directory '/home/buildbot/slave/monero-static-win32/build/build/release'
make[3]: Entering directory '/home/buildbot/slave/monero-static-win32/build/build/release'
[ 34%] Building CXX object external/easylogging++/CMakeFiles/easylogging.dir/easylogging++.cc.obj
[ 34%] Linking CXX static library libeasylogging.a
make[3]: Leaving directory '/home/buildbot/slave/monero-static-win32/build/build/release'
[ 34%] Built target easylogging
make[3]: Entering directory '/home/buildbot/slave/monero-static-win32/build/build/release'
Scanning dependencies of target epee_readline
make[3]: Leaving directory '/home/buildbot/slave/monero-static-win32/build/build/release'
make[3]: Entering directory '/home/buildbot/slave/monero-static-win32/build/build/release'
[ 34%] Building CXX object contrib/epee/src/CMakeFiles/epee_readline.dir/readline_buffer.cpp.obj
[ 35%] Linking CXX static library libepee_readline.a
make[3]: Leaving directory '/home/buildbot/slave/monero-static-win32/build/build/release'
[ 35%] Built target epee_readline
make[3]: Entering directory '/home/buildbot/slave/monero-static-win32/build/build/release'
Scanning dependencies of target epee
make[3]: Leaving directory '/home/buildbot/slave/monero-static-win32/build/build/release'
make[3]: Entering directory '/home/buildbot/slave/monero-static-win32/build/build/release'
[ 35%] Building CXX object contrib/epee/src/CMakeFiles/epee.dir/byte_slice.cpp.obj
[ 36%] Building CXX object contrib/epee/src/CMakeFiles/epee.dir/hex.cpp.obj
[ 36%] Building CXX object contrib/epee/src/CMakeFiles/epee.dir/http_auth.cpp.obj
[ 36%] Building CXX object contrib/epee/src/CMakeFiles/epee.dir/mlog.cpp.obj
[ 36%] Building CXX object contrib/epee/src/CMakeFiles/epee.dir/net_helper.cpp.obj
[ 37%] Building CXX object contrib/epee/src/CMakeFiles/epee.dir/net_utils_base.cpp.obj
[ 37%] Building CXX object contrib/epee/src/CMakeFiles/epee.dir/string_tools.cpp.obj
[ 37%] Building CXX object contrib/epee/src/CMakeFiles/epee.dir/wipeable_string.cpp.obj
[ 38%] Building CXX object contrib/epee/src/CMakeFiles/epee.dir/levin_base.cpp.obj
[ 38%] Building C object contrib/epee/src/CMakeFiles/epee.dir/memwipe.c.obj
[ 38%] Building CXX object contrib/epee/src/CMakeFiles/epee.dir/connection_basic.cpp.obj
In file included from C:/msys32/mingw32/include/boost/random/detail/integer_log2.hpp:19:0,
                 from C:/msys32/mingw32/include/boost/random/detail/large_arithmetic.hpp:19,
                 from C:/msys32/mingw32/include/boost/random/detail/const_mod.hpp:23,
                 from C:/msys32/mingw32/include/boost/random/detail/seed_impl.hpp:26,
                 from C:/msys32/mingw32/include/boost/random/mersenne_twister.hpp:30,
                 from C:/msys32/mingw32/include/boost/uuid/random_generator.hpp:17,
                 from C:/msys32/home/buildbot/slave/monero-static-win32/build/contrib/epee/include/net/network_throttle.hpp:61,
                 from C:/msys32/home/buildbot/slave/monero-static-win32/build/contrib/epee/include/net/network_throttle-detail.hpp:40,
                 from C:/msys32/home/buildbot/slave/monero-static-win32/build/contrib/epee/src/connection_basic.cpp:48:
C:/msys32/mingw32/include/boost/pending/integer_log2.hpp:7:59: note: #pragma message: This header is deprecated. Use <boost/integer/integer_log2.hpp> instead.
 BOOST_HEADER_DEPRECATED("<boost/integer/integer_log2.hpp>");
                                                           ^
[ 38%] Building CXX object contrib/epee/src/CMakeFiles/epee.dir/network_throttle.cpp.obj
In file included from C:/msys32/mingw32/include/boost/random/detail/integer_log2.hpp:19:0,
                 from C:/msys32/mingw32/include/boost/random/detail/large_arithmetic.hpp:19,
                 from C:/msys32/mingw32/include/boost/random/detail/const_mod.hpp:23,
                 from C:/msys32/mingw32/include/boost/random/detail/seed_impl.hpp:26,
                 from C:/msys32/mingw32/include/boost/random/mersenne_twister.hpp:30,
                 from C:/msys32/mingw32/include/boost/uuid/random_generator.hpp:17,
                 from C:/msys32/home/buildbot/slave/monero-static-win32/build/contrib/epee/include/net/network_throttle.hpp:61,
                 from C:/msys32/home/buildbot/slave/monero-static-win32/build/contrib/epee/include/net/network_throttle-detail.hpp:40,
                 from C:/msys32/home/buildbot/slave/monero-static-win32/build/contrib/epee/src/network_throttle.cpp:57:
C:/msys32/mingw32/include/boost/pending/integer_log2.hpp:7:59: note: #pragma message: This header is deprecated. Use <boost/integer/integer_log2.hpp> instead.
 BOOST_HEADER_DEPRECATED("<boost/integer/integer_log2.hpp>");
                                                           ^
[ 39%] Building CXX object contrib/epee/src/CMakeFiles/epee.dir/network_throttle-detail.cpp.obj
In file included from C:/msys32/mingw32/include/boost/random/detail/integer_log2.hpp:19:0,
                 from C:/msys32/mingw32/include/boost/random/detail/large_arithmetic.hpp:19,
                 from C:/msys32/mingw32/include/boost/random/detail/const_mod.hpp:23,
                 from C:/msys32/mingw32/include/boost/random/detail/seed_impl.hpp:26,
                 from C:/msys32/mingw32/include/boost/random/mersenne_twister.hpp:30,
                 from C:/msys32/mingw32/include/boost/uuid/random_generator.hpp:17,
                 from C:/msys32/home/buildbot/slave/monero-static-win32/build/contrib/epee/include/net/network_throttle.hpp:61,
                 from C:/msys32/home/buildbot/slave/monero-static-win32/build/contrib/epee/include/net/network_throttle-detail.hpp:40,
                 from C:/msys32/home/buildbot/slave/monero-static-win32/build/contrib/epee/include/net/abstract_tcp_server2.h:61,
                 from C:/msys32/home/buildbot/slave/monero-static-win32/build/contrib/epee/src/network_throttle-detail.cpp:58:
C:/msys32/mingw32/include/boost/pending/integer_log2.hpp:7:59: note: #pragma message: This header is deprecated. Use <boost/integer/integer_log2.hpp> instead.
 BOOST_HEADER_DEPRECATED("<boost/integer/integer_log2.hpp>");
                                                           ^
[ 39%] Building CXX object contrib/epee/src/CMakeFiles/epee.dir/mlocker.cpp.obj
C:/msys32/home/buildbot/slave/monero-static-win32/build/contrib/epee/src/mlocker.cpp:61:2: warning: #warning Missing query_page_size implementation [-Wcpp]
 #warning Missing query_page_size implementation
  ^~~~~~~
C:/msys32/home/buildbot/slave/monero-static-win32/build/contrib/epee/src/mlocker.cpp:73:2: warning: #warning Missing do_lock implementation [-Wcpp]
 #warning Missing do_lock implementation
  ^~~~~~~
C:/msys32/home/buildbot/slave/monero-static-win32/build/contrib/epee/src/mlocker.cpp:87:2: warning: #warning Missing implementation of page size detection [-Wcpp]
 #warning Missing implementation of page size detection
  ^~~~~~~
[ 39%] Building CXX object contrib/epee/src/CMakeFiles/epee.dir/buffer.cpp.obj
[ 40%] Building CXX object contrib/epee/src/CMakeFiles/epee.dir/net_ssl.cpp.obj
[ 40%] Building CXX object contrib/epee/src/CMakeFiles/epee.dir/int-util.cpp.obj
[ 40%] Linking CXX static library libepee.a
make[3]: Leaving directory '/home/buildbot/slave/monero-static-win32/build/build/release'
[ 40%] Built target epee
make[3]: Entering directory '/home/buildbot/slave/monero-static-win32/build/build/release'
Scanning dependencies of target genversion
make[3]: Leaving directory '/home/buildbot/slave/monero-static-win32/build/build/release'
[ 40%] Built target genversion
make[3]: Entering directory '/home/buildbot/slave/monero-static-win32/build/build/release'
Scanning dependencies of target obj_version
make[3]: Leaving directory '/home/buildbot/slave/monero-static-win32/build/build/release'
make[3]: Entering directory '/home/buildbot/slave/monero-static-win32/build/build/release'
[ 40%] Building CXX object src/CMakeFiles/obj_version.dir/__/version.cpp.obj
make[3]: Leaving directory '/home/buildbot/slave/monero-static-win32/build/build/release'
[ 40%] Built target obj_version
make[3]: Entering directory '/home/buildbot/slave/monero-static-win32/build/build/release'
Scanning dependencies of target version
make[3]: Leaving directory '/home/buildbot/slave/monero-static-win32/build/build/release'
make[3]: Entering directory '/home/buildbot/slave/monero-static-win32/build/build/release'
[ 40%] Linking CXX static library libversion.a
make[3]: Leaving directory '/home/buildbot/slave/monero-static-win32/build/build/release'
[ 40%] Built target version
make[3]: Entering directory '/home/buildbot/slave/monero-static-win32/build/build/release'
Scanning dependencies of target obj_cncrypto
make[3]: Leaving directory '/home/buildbot/slave/monero-static-win32/build/build/release'
make[3]: Entering directory '/home/buildbot/slave/monero-static-win32/build/build/release'
[ 40%] Building C object src/crypto/CMakeFiles/obj_cncrypto.dir/aesb.c.obj
[ 41%] Building C object src/crypto/CMakeFiles/obj_cncrypto.dir/blake256.c.obj
[ 41%] Building C object src/crypto/CMakeFiles/obj_cncrypto.dir/chacha.c.obj
[ 41%] Building C object src/crypto/CMakeFiles/obj_cncrypto.dir/crypto-ops-data.c.obj
[ 41%] Building C object src/crypto/CMakeFiles/obj_cncrypto.dir/crypto-ops.c.obj
[ 42%] Building CXX object src/crypto/CMakeFiles/obj_cncrypto.dir/crypto.cpp.obj
[ 42%] Building C object src/crypto/CMakeFiles/obj_cncrypto.dir/groestl.c.obj
[ 42%] Building C object src/crypto/CMakeFiles/obj_cncrypto.dir/hash-extra-blake.c.obj
[ 43%] Building C object src/crypto/CMakeFiles/obj_cncrypto.dir/hash-extra-groestl.c.obj
[ 43%] Building C object src/crypto/CMakeFiles/obj_cncrypto.dir/hash-extra-jh.c.obj
[ 43%] Building C object src/crypto/CMakeFiles/obj_cncrypto.dir/hash-extra-skein.c.obj
[ 43%] Building C object src/crypto/CMakeFiles/obj_cncrypto.dir/hash.c.obj
[ 44%] Building C object src/crypto/CMakeFiles/obj_cncrypto.dir/hmac-keccak.c.obj
[ 44%] Building C object src/crypto/CMakeFiles/obj_cncrypto.dir/jh.c.obj
[ 44%] Building C object src/crypto/CMakeFiles/obj_cncrypto.dir/keccak.c.obj
[ 45%] Building C object src/crypto/CMakeFiles/obj_cncrypto.dir/oaes_lib.c.obj
[ 45%] Building C object src/crypto/CMakeFiles/obj_cncrypto.dir/random.c.obj
[ 45%] Building C object src/crypto/CMakeFiles/obj_cncrypto.dir/skein.c.obj
[ 45%] Building C object src/crypto/CMakeFiles/obj_cncrypto.dir/slow-hash.c.obj
[ 46%] Building C object src/crypto/CMakeFiles/obj_cncrypto.dir/rx-slow-hash.c.obj
[ 46%] Building C object src/crypto/CMakeFiles/obj_cncrypto.dir/CryptonightR_JIT.c.obj
[ 46%] Building C object src/crypto/CMakeFiles/obj_cncrypto.dir/tree-hash.c.obj
make[3]: Leaving directory '/home/buildbot/slave/monero-static-win32/build/build/release'
[ 46%] Built target obj_cncrypto
make[3]: Entering directory '/home/buildbot/slave/monero-static-win32/build/build/release'
Scanning dependencies of target randomx
make[3]: Leaving directory '/home/buildbot/slave/monero-static-win32/build/build/release'
make[3]: Entering directory '/home/buildbot/slave/monero-static-win32/build/build/release'
[ 47%] Building CXX object external/randomx/CMakeFiles/randomx.dir/src/aes_hash.cpp.obj
[ 47%] Building C object external/randomx/CMakeFiles/randomx.dir/src/argon2_ref.c.obj
[ 47%] Building C object external/randomx/CMakeFiles/randomx.dir/src/argon2_ssse3.c.obj
[ 47%] Building C object external/randomx/CMakeFiles/randomx.dir/src/argon2_avx2.c.obj
[ 48%] Building CXX object external/randomx/CMakeFiles/randomx.dir/src/bytecode_machine.cpp.obj
[ 48%] Building CXX object external/randomx/CMakeFiles/randomx.dir/src/cpu.cpp.obj
[ 48%] Building CXX object external/randomx/CMakeFiles/randomx.dir/src/dataset.cpp.obj
[ 48%] Building CXX object external/randomx/CMakeFiles/randomx.dir/src/soft_aes.cpp.obj
[ 50%] Building CXX object external/randomx/CMakeFiles/randomx.dir/src/virtual_memory.cpp.obj
[ 50%] Building CXX object external/randomx/CMakeFiles/randomx.dir/src/vm_interpreted.cpp.obj
[ 50%] Building CXX object external/randomx/CMakeFiles/randomx.dir/src/allocator.cpp.obj
[ 51%] Building CXX object external/randomx/CMakeFiles/randomx.dir/src/assembly_generator_x86.cpp.obj
[ 51%] Building CXX object external/randomx/CMakeFiles/randomx.dir/src/instruction.cpp.obj
[ 51%] Building CXX object external/randomx/CMakeFiles/randomx.dir/src/randomx.cpp.obj
[ 51%] Building CXX object external/randomx/CMakeFiles/randomx.dir/src/superscalar.cpp.obj
[ 52%] Building CXX object external/randomx/CMakeFiles/randomx.dir/src/vm_compiled.cpp.obj
[ 52%] Building CXX object external/randomx/CMakeFiles/randomx.dir/src/vm_interpreted_light.cpp.obj
[ 52%] Building C object external/randomx/CMakeFiles/randomx.dir/src/argon2_core.c.obj
[ 53%] Building CXX object external/randomx/CMakeFiles/randomx.dir/src/blake2_generator.cpp.obj
[ 53%] Building CXX object external/randomx/CMakeFiles/randomx.dir/src/instructions_portable.cpp.obj
[ 53%] Building C object external/randomx/CMakeFiles/randomx.dir/src/reciprocal.c.obj
[ 53%] Building CXX object external/randomx/CMakeFiles/randomx.dir/src/virtual_machine.cpp.obj
[ 54%] Building CXX object external/randomx/CMakeFiles/randomx.dir/src/vm_compiled_light.cpp.obj
[ 54%] Building C object external/randomx/CMakeFiles/randomx.dir/src/blake2/blake2b.c.obj
[ 54%] Linking CXX static library librandomx.a
make[3]: Leaving directory '/home/buildbot/slave/monero-static-win32/build/build/release'
[ 54%] Built target randomx
make[3]: Entering directory '/home/buildbot/slave/monero-static-win32/build/build/release'
Scanning dependencies of target cncrypto
make[3]: Leaving directory '/home/buildbot/slave/monero-static-win32/build/build/release'
make[3]: Entering directory '/home/buildbot/slave/monero-static-win32/build/build/release'
[ 55%] Linking CXX static library libcncrypto.a
make[3]: Leaving directory '/home/buildbot/slave/monero-static-win32/build/build/release'
[ 55%] Built target cncrypto
make[3]: Entering directory '/home/buildbot/slave/monero-static-win32/build/build/release'
Scanning dependencies of target obj_common
make[3]: Leaving directory '/home/buildbot/slave/monero-static-win32/build/build/release'
make[3]: Entering directory '/home/buildbot/slave/monero-static-win32/build/build/release'
[ 55%] Building CXX object src/common/CMakeFiles/obj_common.dir/base58.cpp.obj
[ 56%] Building CXX object src/common/CMakeFiles/obj_common.dir/command_line.cpp.obj
[ 56%] Building CXX object src/common/CMakeFiles/obj_common.dir/dns_utils.cpp.obj
[ 56%] Building CXX object src/common/CMakeFiles/obj_common.dir/download.cpp.obj
[ 57%] Building CXX object src/common/CMakeFiles/obj_common.dir/error.cpp.obj
[ 57%] Building CXX object src/common/CMakeFiles/obj_common.dir/expect.cpp.obj
[ 57%] Building CXX object src/common/CMakeFiles/obj_common.dir/util.cpp.obj
[ 57%] Building CXX object src/common/CMakeFiles/obj_common.dir/i18n.cpp.obj
[ 58%] Building CXX object src/common/CMakeFiles/obj_common.dir/notify.cpp.obj
[ 58%] Building CXX object src/common/CMakeFiles/obj_common.dir/password.cpp.obj
[ 58%] Building CXX object src/common/CMakeFiles/obj_common.dir/perf_timer.cpp.obj
[ 59%] Building CXX object src/common/CMakeFiles/obj_common.dir/pruning.cpp.obj
[ 59%] Building CXX object src/common/CMakeFiles/obj_common.dir/spawn.cpp.obj
[ 59%] Building CXX object src/common/CMakeFiles/obj_common.dir/threadpool.cpp.obj
[ 59%] Building CXX object src/common/CMakeFiles/obj_common.dir/updates.cpp.obj
[ 60%] Building C object src/common/CMakeFiles/obj_common.dir/aligned.c.obj
[ 60%] Building CXX object src/common/CMakeFiles/obj_common.dir/timings.cc.obj
[ 60%] Building CXX object src/common/CMakeFiles/obj_common.dir/combinator.cpp.obj
make[3]: Leaving directory '/home/buildbot/slave/monero-static-win32/build/build/release'
[ 60%] Built target obj_common
make[3]: Entering directory '/home/buildbot/slave/monero-static-win32/build/build/release'
Scanning dependencies of target common
make[3]: Leaving directory '/home/buildbot/slave/monero-static-win32/build/build/release'
make[3]: Entering directory '/home/buildbot/slave/monero-static-win32/build/build/release'
[ 60%] Linking CXX static library libcommon.a
make[3]: Leaving directory '/home/buildbot/slave/monero-static-win32/build/build/release'
[ 60%] Built target common
make[3]: Entering directory '/home/buildbot/slave/monero-static-win32/build/build/release'
Scanning dependencies of target obj_ringct_basic
make[3]: Leaving directory '/home/buildbot/slave/monero-static-win32/build/build/release'
make[3]: Entering directory '/home/buildbot/slave/monero-static-win32/build/build/release'
[ 61%] Building CXX object src/ringct/CMakeFiles/obj_ringct_basic.dir/rctOps.cpp.obj
[ 61%] Building CXX object src/ringct/CMakeFiles/obj_ringct_basic.dir/rctTypes.cpp.obj
[ 61%] Building C object src/ringct/CMakeFiles/obj_ringct_basic.dir/rctCryptoOps.c.obj
[ 61%] Building CXX object src/ringct/CMakeFiles/obj_ringct_basic.dir/multiexp.cc.obj
[ 62%] Building CXX object src/ringct/CMakeFiles/obj_ringct_basic.dir/bulletproofs.cc.obj
make[3]: Leaving directory '/home/buildbot/slave/monero-static-win32/build/build/release'
[ 62%] Built target obj_ringct_basic
make[3]: Entering directory '/home/buildbot/slave/monero-static-win32/build/build/release'
Scanning dependencies of target ringct_basic
make[3]: Leaving directory '/home/buildbot/slave/monero-static-win32/build/build/release'
make[3]: Entering directory '/home/buildbot/slave/monero-static-win32/build/build/release'
[ 63%] Linking CXX static library libringct_basic.a
make[3]: Leaving directory '/home/buildbot/slave/monero-static-win32/build/build/release'
[ 63%] Built target ringct_basic
make[3]: Entering directory '/home/buildbot/slave/monero-static-win32/build/build/release'
Scanning dependencies of target obj_ringct
make[3]: Leaving directory '/home/buildbot/slave/monero-static-win32/build/build/release'
make[3]: Entering directory '/home/buildbot/slave/monero-static-win32/build/build/release'
[ 63%] Building CXX object src/ringct/CMakeFiles/obj_ringct.dir/rctSigs.cpp.obj
make[3]: Leaving directory '/home/buildbot/slave/monero-static-win32/build/build/release'
[ 63%] Built target obj_ringct
make[3]: Entering directory '/home/buildbot/slave/monero-static-win32/build/build/release'
Scanning dependencies of target obj_device
make[3]: Leaving directory '/home/buildbot/slave/monero-static-win32/build/build/release'
make[3]: Entering directory '/home/buildbot/slave/monero-static-win32/build/build/release'
[ 63%] Building CXX object src/device/CMakeFiles/obj_device.dir/device.cpp.obj
[ 63%] Building CXX object src/device/CMakeFiles/obj_device.dir/device_default.cpp.obj
[ 63%] Building CXX object src/device/CMakeFiles/obj_device.dir/log.cpp.obj
[ 64%] Building CXX object src/device/CMakeFiles/obj_device.dir/device_ledger.cpp.obj
[ 64%] Building CXX object src/device/CMakeFiles/obj_device.dir/device_io_hid.cpp.obj
make[3]: Leaving directory '/home/buildbot/slave/monero-static-win32/build/build/release'
[ 64%] Built target obj_device
make[3]: Entering directory '/home/buildbot/slave/monero-static-win32/build/build/release'
[ 64%] Generating generated_stagenet_blocks.c
[ 64%] Generating generated_checkpoints.c
[ 65%] Generating generated_testnet_blocks.c
Scanning dependencies of target blocks
make[3]: Leaving directory '/home/buildbot/slave/monero-static-win32/build/build/release'
make[3]: Entering directory '/home/buildbot/slave/monero-static-win32/build/build/release'
[ 65%] Building CXX object src/blocks/CMakeFiles/blocks.dir/blocks.cpp.obj
[ 65%] Building C object src/blocks/CMakeFiles/blocks.dir/generated_checkpoints.c.obj
[ 67%] Building C object src/blocks/CMakeFiles/blocks.dir/generated_testnet_blocks.c.obj
[ 67%] Building C object src/blocks/CMakeFiles/blocks.dir/generated_stagenet_blocks.c.obj
[ 67%] Linking CXX static library libblocks.a
make[3]: Leaving directory '/home/buildbot/slave/monero-static-win32/build/build/release'
[ 67%] Built target blocks
make[3]: Entering directory '/home/buildbot/slave/monero-static-win32/build/build/release'
Scanning dependencies of target device
make[3]: Leaving directory '/home/buildbot/slave/monero-static-win32/build/build/release'
make[3]: Entering directory '/home/buildbot/slave/monero-static-win32/build/build/release'
[ 67%] Linking CXX static library libdevice.a
make[3]: Leaving directory '/home/buildbot/slave/monero-static-win32/build/build/release'
[ 67%] Built target device
make[3]: Entering directory '/home/buildbot/slave/monero-static-win32/build/build/release'
Scanning dependencies of target obj_checkpoints
make[3]: Leaving directory '/home/buildbot/slave/monero-static-win32/build/build/release'
make[3]: Entering directory '/home/buildbot/slave/monero-static-win32/build/build/release'
[ 67%] Building CXX object src/checkpoints/CMakeFiles/obj_checkpoints.dir/checkpoints.cpp.obj
make[3]: Leaving directory '/home/buildbot/slave/monero-static-win32/build/build/release'
[ 67%] Built target obj_checkpoints
make[3]: Entering directory '/home/buildbot/slave/monero-static-win32/build/build/release'
Scanning dependencies of target checkpoints
make[3]: Leaving directory '/home/buildbot/slave/monero-static-win32/build/build/release'
make[3]: Entering directory '/home/buildbot/slave/monero-static-win32/build/build/release'
[ 67%] Linking CXX static library libcheckpoints.a
make[3]: Leaving directory '/home/buildbot/slave/monero-static-win32/build/build/release'
[ 67%] Built target checkpoints
make[3]: Entering directory '/home/buildbot/slave/monero-static-win32/build/build/release'
Scanning dependencies of target obj_cryptonote_basic
make[3]: Leaving directory '/home/buildbot/slave/monero-static-win32/build/build/release'
make[3]: Entering directory '/home/buildbot/slave/monero-static-win32/build/build/release'
[ 68%] Building CXX object src/cryptonote_basic/CMakeFiles/obj_cryptonote_basic.dir/account.cpp.obj
[ 68%] Building CXX object src/cryptonote_basic/CMakeFiles/obj_cryptonote_basic.dir/cryptonote_basic_impl.cpp.obj
[ 68%] Building CXX object src/cryptonote_basic/CMakeFiles/obj_cryptonote_basic.dir/cryptonote_format_utils.cpp.obj
[ 68%] Building CXX object src/cryptonote_basic/CMakeFiles/obj_cryptonote_basic.dir/difficulty.cpp.obj
[ 69%] Building CXX object src/cryptonote_basic/CMakeFiles/obj_cryptonote_basic.dir/hardfork.cpp.obj
[ 69%] Building CXX object src/cryptonote_basic/CMakeFiles/obj_cryptonote_basic.dir/miner.cpp.obj
In file included from C:/msys32/mingw32/include/boost/random/detail/integer_log2.hpp:19:0,
                 from C:/msys32/mingw32/include/boost/random/detail/large_arithmetic.hpp:19,
                 from C:/msys32/mingw32/include/boost/random/detail/const_mod.hpp:23,
                 from C:/msys32/mingw32/include/boost/random/detail/seed_impl.hpp:26,
                 from C:/msys32/mingw32/include/boost/random/mersenne_twister.hpp:30,
                 from C:/msys32/mingw32/include/boost/uuid/random_generator.hpp:17,
                 from C:/msys32/home/buildbot/slave/monero-static-win32/build/contrib/epee/include/math_helper.h:38,
                 from C:/msys32/home/buildbot/slave/monero-static-win32/build/src/cryptonote_basic/miner.h:39,
                 from C:/msys32/home/buildbot/slave/monero-static-win32/build/src/cryptonote_basic/miner.cpp:84:
C:/msys32/mingw32/include/boost/pending/integer_log2.hpp:7:59: note: #pragma message: This header is deprecated. Use <boost/integer/integer_log2.hpp> instead.
 BOOST_HEADER_DEPRECATED("<boost/integer/integer_log2.hpp>");
                                                           ^
make[3]: Leaving directory '/home/buildbot/slave/monero-static-win32/build/build/release'
[ 69%] Built target obj_cryptonote_basic
make[3]: Entering directory '/home/buildbot/slave/monero-static-win32/build/build/release'
Scanning dependencies of target cryptonote_basic
make[3]: Leaving directory '/home/buildbot/slave/monero-static-win32/build/build/release'
make[3]: Entering directory '/home/buildbot/slave/monero-static-win32/build/build/release'
[ 69%] Linking CXX static library libcryptonote_basic.a
make[3]: Leaving directory '/home/buildbot/slave/monero-static-win32/build/build/release'
[ 69%] Built target cryptonote_basic
make[3]: Entering directory '/home/buildbot/slave/monero-static-win32/build/build/release'
Scanning dependencies of target ringct
make[3]: Leaving directory '/home/buildbot/slave/monero-static-win32/build/build/release'
make[3]: Entering directory '/home/buildbot/slave/monero-static-win32/build/build/release'
[ 69%] Linking CXX static library libringct.a
make[3]: Leaving directory '/home/buildbot/slave/monero-static-win32/build/build/release'
[ 69%] Built target ringct
make[3]: Entering directory '/home/buildbot/slave/monero-static-win32/build/build/release'
Scanning dependencies of target obj_cryptonote_core
make[3]: Leaving directory '/home/buildbot/slave/monero-static-win32/build/build/release'
make[3]: Entering directory '/home/buildbot/slave/monero-static-win32/build/build/release'
[ 69%] Building CXX object src/cryptonote_core/CMakeFiles/obj_cryptonote_core.dir/blockchain.cpp.obj
In file included from C:/msys32/mingw32/include/boost/random/detail/integer_log2.hpp:19:0,
                 from C:/msys32/mingw32/include/boost/random/detail/large_arithmetic.hpp:19,
                 from C:/msys32/mingw32/include/boost/random/detail/const_mod.hpp:23,
                 from C:/msys32/mingw32/include/boost/random/detail/seed_impl.hpp:26,
                 from C:/msys32/mingw32/include/boost/random/mersenne_twister.hpp:30,
                 from C:/msys32/mingw32/include/boost/uuid/random_generator.hpp:17,
                 from C:/msys32/home/buildbot/slave/monero-static-win32/build/contrib/epee/include/math_helper.h:38,
                 from C:/msys32/home/buildbot/slave/monero-static-win32/build/src/cryptonote_core/tx_pool.h:43,
                 from C:/msys32/home/buildbot/slave/monero-static-win32/build/src/cryptonote_core/blockchain.cpp:38:
C:/msys32/mingw32/include/boost/pending/integer_log2.hpp:7:59: note: #pragma message: This header is deprecated. Use <boost/integer/integer_log2.hpp> instead.
 BOOST_HEADER_DEPRECATED("<boost/integer/integer_log2.hpp>");
                                                           ^
[ 69%] Building CXX object src/cryptonote_core/CMakeFiles/obj_cryptonote_core.dir/cryptonote_core.cpp.obj
In file included from C:/msys32/mingw32/include/boost/random/detail/integer_log2.hpp:19:0,
                 from C:/msys32/mingw32/include/boost/random/detail/large_arithmetic.hpp:19,
                 from C:/msys32/mingw32/include/boost/random/detail/const_mod.hpp:23,
                 from C:/msys32/mingw32/include/boost/random/detail/seed_impl.hpp:26,
                 from C:/msys32/mingw32/include/boost/random/mersenne_twister.hpp:30,
                 from C:/msys32/mingw32/include/boost/uuid/random_generator.hpp:17,
                 from C:/msys32/home/buildbot/slave/monero-static-win32/build/contrib/epee/include/math_helper.h:38,
                 from C:/msys32/home/buildbot/slave/monero-static-win32/build/src/cryptonote_core/tx_pool.h:43,
                 from C:/msys32/home/buildbot/slave/monero-static-win32/build/src/cryptonote_core/cryptonote_core.h:42,
                 from C:/msys32/home/buildbot/slave/monero-static-win32/build/src/cryptonote_core/cryptonote_core.cpp:37:
C:/msys32/mingw32/include/boost/pending/integer_log2.hpp:7:59: note: #pragma message: This header is deprecated. Use <boost/integer/integer_log2.hpp> instead.
 BOOST_HEADER_DEPRECATED("<boost/integer/integer_log2.hpp>");
                                                           ^
[ 70%] Building CXX object src/cryptonote_core/CMakeFiles/obj_cryptonote_core.dir/tx_pool.cpp.obj
In file included from C:/msys32/mingw32/include/boost/random/detail/integer_log2.hpp:19:0,
                 from C:/msys32/mingw32/include/boost/random/detail/large_arithmetic.hpp:19,
                 from C:/msys32/mingw32/include/boost/random/detail/const_mod.hpp:23,
                 from C:/msys32/mingw32/include/boost/random/detail/seed_impl.hpp:26,
                 from C:/msys32/mingw32/include/boost/random/mersenne_twister.hpp:30,
                 from C:/msys32/mingw32/include/boost/uuid/random_generator.hpp:17,
                 from C:/msys32/home/buildbot/slave/monero-static-win32/build/contrib/epee/include/math_helper.h:38,
                 from C:/msys32/home/buildbot/slave/monero-static-win32/build/src/cryptonote_core/tx_pool.h:43,
                 from C:/msys32/home/buildbot/slave/monero-static-win32/build/src/cryptonote_core/tx_pool.cpp:36:
C:/msys32/mingw32/include/boost/pending/integer_log2.hpp:7:59: note: #pragma message: This header is deprecated. Use <boost/integer/integer_log2.hpp> instead.
 BOOST_HEADER_DEPRECATED("<boost/integer/integer_log2.hpp>");
                                                           ^
[ 70%] Building CXX object src/cryptonote_core/CMakeFiles/obj_cryptonote_core.dir/tx_sanity_check.cpp.obj
[ 70%] Building CXX object src/cryptonote_core/CMakeFiles/obj_cryptonote_core.dir/cryptonote_tx_utils.cpp.obj
In file included from C:/msys32/mingw32/include/boost/random/detail/integer_log2.hpp:19:0,
                 from C:/msys32/mingw32/include/boost/random/detail/large_arithmetic.hpp:19,
                 from C:/msys32/mingw32/include/boost/random/detail/const_mod.hpp:23,
                 from C:/msys32/mingw32/include/boost/random/detail/seed_impl.hpp:26,
                 from C:/msys32/mingw32/include/boost/random/mersenne_twister.hpp:30,
                 from C:/msys32/mingw32/include/boost/uuid/random_generator.hpp:17,
                 from C:/msys32/home/buildbot/slave/monero-static-win32/build/contrib/epee/include/math_helper.h:38,
                 from C:/msys32/home/buildbot/slave/monero-static-win32/build/src/cryptonote_basic/miner.h:39,
                 from C:/msys32/home/buildbot/slave/monero-static-win32/build/src/cryptonote_core/cryptonote_tx_utils.cpp:41:
C:/msys32/mingw32/include/boost/pending/integer_log2.hpp:7:59: note: #pragma message: This header is deprecated. Use <boost/integer/integer_log2.hpp> instead.
 BOOST_HEADER_DEPRECATED("<boost/integer/integer_log2.hpp>");
                                                           ^
make[3]: Leaving directory '/home/buildbot/slave/monero-static-win32/build/build/release'
[ 70%] Built target obj_cryptonote_core
make[3]: Entering directory '/home/buildbot/slave/monero-static-win32/build/build/release'
Scanning dependencies of target obj_hardforks
make[3]: Leaving directory '/home/buildbot/slave/monero-static-win32/build/build/release'
make[3]: Entering directory '/home/buildbot/slave/monero-static-win32/build/build/release'
[ 71%] Building CXX object src/hardforks/CMakeFiles/obj_hardforks.dir/hardforks.cpp.obj
make[3]: Leaving directory '/home/buildbot/slave/monero-static-win32/build/build/release'
[ 71%] Built target obj_hardforks
make[3]: Entering directory '/home/buildbot/slave/monero-static-win32/build/build/release'
Scanning dependencies of target hardforks
make[3]: Leaving directory '/home/buildbot/slave/monero-static-win32/build/build/release'
make[3]: Entering directory '/home/buildbot/slave/monero-static-win32/build/build/release'
[ 71%] Linking CXX static library libhardforks.a
make[3]: Leaving directory '/home/buildbot/slave/monero-static-win32/build/build/release'
[ 71%] Built target hardforks
make[3]: Entering directory '/home/buildbot/slave/monero-static-win32/build/build/release'
Scanning dependencies of target obj_multisig
make[3]: Leaving directory '/home/buildbot/slave/monero-static-win32/build/build/release'
make[3]: Entering directory '/home/buildbot/slave/monero-static-win32/build/build/release'
[ 71%] Building CXX object src/multisig/CMakeFiles/obj_multisig.dir/multisig.cpp.obj
make[3]: Leaving directory '/home/buildbot/slave/monero-static-win32/build/build/release'
[ 71%] Built target obj_multisig
make[3]: Entering directory '/home/buildbot/slave/monero-static-win32/build/build/release'
Scanning dependencies of target multisig
make[3]: Leaving directory '/home/buildbot/slave/monero-static-win32/build/build/release'
make[3]: Entering directory '/home/buildbot/slave/monero-static-win32/build/build/release'
[ 71%] Linking CXX static library libmultisig.a
make[3]: Leaving directory '/home/buildbot/slave/monero-static-win32/build/build/release'
[ 71%] Built target multisig
make[3]: Entering directory '/home/buildbot/slave/monero-static-win32/build/build/release'
Scanning dependencies of target obj_blockchain_db
make[3]: Leaving directory '/home/buildbot/slave/monero-static-win32/build/build/release'
make[3]: Entering directory '/home/buildbot/slave/monero-static-win32/build/build/release'
[ 71%] Building CXX object src/blockchain_db/CMakeFiles/obj_blockchain_db.dir/blockchain_db.cpp.obj
[ 72%] Building CXX object src/blockchain_db/CMakeFiles/obj_blockchain_db.dir/lmdb/db_lmdb.cpp.obj
make[3]: Leaving directory '/home/buildbot/slave/monero-static-win32/build/build/release'
[ 72%] Built target obj_blockchain_db
make[3]: Entering directory '/home/buildbot/slave/monero-static-win32/build/build/release'
Scanning dependencies of target blockchain_db
make[3]: Leaving directory '/home/buildbot/slave/monero-static-win32/build/build/release'
make[3]: Entering directory '/home/buildbot/slave/monero-static-win32/build/build/release'
[ 72%] Linking CXX static library libblockchain_db.a
make[3]: Leaving directory '/home/buildbot/slave/monero-static-win32/build/build/release'
[ 72%] Built target blockchain_db
make[3]: Entering directory '/home/buildbot/slave/monero-static-win32/build/build/release'
Scanning dependencies of target cryptonote_core
make[3]: Leaving directory '/home/buildbot/slave/monero-static-win32/build/build/release'
make[3]: Entering directory '/home/buildbot/slave/monero-static-win32/build/build/release'
[ 73%] Linking CXX static library libcryptonote_core.a
make[3]: Leaving directory '/home/buildbot/slave/monero-static-win32/build/build/release'
[ 73%] Built target cryptonote_core
make[3]: Entering directory '/home/buildbot/slave/monero-static-win32/build/build/release'
Scanning dependencies of target obj_lmdb_lib
make[3]: Leaving directory '/home/buildbot/slave/monero-static-win32/build/build/release'
make[3]: Entering directory '/home/buildbot/slave/monero-static-win32/build/build/release'
[ 73%] Building CXX object src/lmdb/CMakeFiles/obj_lmdb_lib.dir/database.cpp.obj
[ 73%] Building CXX object src/lmdb/CMakeFiles/obj_lmdb_lib.dir/error.cpp.obj
[ 73%] Building CXX object src/lmdb/CMakeFiles/obj_lmdb_lib.dir/table.cpp.obj
[ 74%] Building CXX object src/lmdb/CMakeFiles/obj_lmdb_lib.dir/value_stream.cpp.obj
make[3]: Leaving directory '/home/buildbot/slave/monero-static-win32/build/build/release'
[ 74%] Built target obj_lmdb_lib
make[3]: Entering directory '/home/buildbot/slave/monero-static-win32/build/build/release'
Scanning dependencies of target lmdb_lib
make[3]: Leaving directory '/home/buildbot/slave/monero-static-win32/build/build/release'
make[3]: Entering directory '/home/buildbot/slave/monero-static-win32/build/build/release'
[ 74%] Linking CXX static library liblmdb_lib.a
make[3]: Leaving directory '/home/buildbot/slave/monero-static-win32/build/build/release'
[ 74%] Built target lmdb_lib
make[3]: Entering directory '/home/buildbot/slave/monero-static-win32/build/build/release'
Scanning dependencies of target obj_net
make[3]: Leaving directory '/home/buildbot/slave/monero-static-win32/build/build/release'
make[3]: Entering directory '/home/buildbot/slave/monero-static-win32/build/build/release'
[ 74%] Building CXX object src/net/CMakeFiles/obj_net.dir/dandelionpp.cpp.obj
[ 75%] Building CXX object src/net/CMakeFiles/obj_net.dir/error.cpp.obj
[ 75%] Building CXX object src/net/CMakeFiles/obj_net.dir/i2p_address.cpp.obj
[ 75%] Building CXX object src/net/CMakeFiles/obj_net.dir/parse.cpp.obj
[ 76%] Building CXX object src/net/CMakeFiles/obj_net.dir/socks.cpp.obj
[ 76%] Building CXX object src/net/CMakeFiles/obj_net.dir/socks_connect.cpp.obj
[ 76%] Building CXX object src/net/CMakeFiles/obj_net.dir/tor_address.cpp.obj
[ 76%] Building CXX object src/net/CMakeFiles/obj_net.dir/zmq.cpp.obj
make[3]: Leaving directory '/home/buildbot/slave/monero-static-win32/build/build/release'
[ 76%] Built target obj_net
make[3]: Entering directory '/home/buildbot/slave/monero-static-win32/build/build/release'
Scanning dependencies of target net
make[3]: Leaving directory '/home/buildbot/slave/monero-static-win32/build/build/release'
make[3]: Entering directory '/home/buildbot/slave/monero-static-win32/build/build/release'
[ 76%] Linking CXX static library libnet.a
make[3]: Leaving directory '/home/buildbot/slave/monero-static-win32/build/build/release'
[ 76%] Built target net
make[3]: Entering directory '/home/buildbot/slave/monero-static-win32/build/build/release'
Scanning dependencies of target obj_mnemonics
make[3]: Leaving directory '/home/buildbot/slave/monero-static-win32/build/build/release'
make[3]: Entering directory '/home/buildbot/slave/monero-static-win32/build/build/release'
[ 76%] Building CXX object src/mnemonics/CMakeFiles/obj_mnemonics.dir/electrum-words.cpp.obj
make[3]: Leaving directory '/home/buildbot/slave/monero-static-win32/build/build/release'
[ 76%] Built target obj_mnemonics
make[3]: Entering directory '/home/buildbot/slave/monero-static-win32/build/build/release'
Scanning dependencies of target mnemonics
make[3]: Leaving directory '/home/buildbot/slave/monero-static-win32/build/build/release'
make[3]: Entering directory '/home/buildbot/slave/monero-static-win32/build/build/release'
[ 77%] Linking CXX static library libmnemonics.a
make[3]: Leaving directory '/home/buildbot/slave/monero-static-win32/build/build/release'
[ 77%] Built target mnemonics
make[3]: Entering directory '/home/buildbot/slave/monero-static-win32/build/build/release'
Scanning dependencies of target obj_rpc_base
make[3]: Leaving directory '/home/buildbot/slave/monero-static-win32/build/build/release'
make[3]: Entering directory '/home/buildbot/slave/monero-static-win32/build/build/release'
[ 77%] Building CXX object src/rpc/CMakeFiles/obj_rpc_base.dir/rpc_args.cpp.obj
[ 77%] Building CXX object src/rpc/CMakeFiles/obj_rpc_base.dir/rpc_payment_signature.cpp.obj
[ 78%] Building CXX object src/rpc/CMakeFiles/obj_rpc_base.dir/rpc_handler.cpp.obj
In file included from C:/msys32/mingw32/include/boost/random/detail/integer_log2.hpp:19:0,
                 from C:/msys32/mingw32/include/boost/random/detail/large_arithmetic.hpp:19,
                 from C:/msys32/mingw32/include/boost/random/detail/const_mod.hpp:23,
                 from C:/msys32/mingw32/include/boost/random/detail/seed_impl.hpp:26,
                 from C:/msys32/mingw32/include/boost/random/mersenne_twister.hpp:30,
                 from C:/msys32/mingw32/include/boost/uuid/random_generator.hpp:17,
                 from C:/msys32/home/buildbot/slave/monero-static-win32/build/contrib/epee/include/math_helper.h:38,
                 from C:/msys32/home/buildbot/slave/monero-static-win32/build/src/cryptonote_core/tx_pool.h:43,
                 from C:/msys32/home/buildbot/slave/monero-static-win32/build/src/cryptonote_core/cryptonote_core.h:42,
                 from C:/msys32/home/buildbot/slave/monero-static-win32/build/src/rpc/rpc_handler.cpp:6:
C:/msys32/mingw32/include/boost/pending/integer_log2.hpp:7:59: note: #pragma message: This header is deprecated. Use <boost/integer/integer_log2.hpp> instead.
 BOOST_HEADER_DEPRECATED("<boost/integer/integer_log2.hpp>");
                                                           ^
make[3]: Leaving directory '/home/buildbot/slave/monero-static-win32/build/build/release'
[ 78%] Built target obj_rpc_base
make[3]: Entering directory '/home/buildbot/slave/monero-static-win32/build/build/release'
Scanning dependencies of target rpc_base
make[3]: Leaving directory '/home/buildbot/slave/monero-static-win32/build/build/release'
make[3]: Entering directory '/home/buildbot/slave/monero-static-win32/build/build/release'
[ 78%] Linking CXX static library librpc_base.a
make[3]: Leaving directory '/home/buildbot/slave/monero-static-win32/build/build/release'
[ 78%] Built target rpc_base
make[3]: Entering directory '/home/buildbot/slave/monero-static-win32/build/build/release'
Scanning dependencies of target obj_rpc
make[3]: Leaving directory '/home/buildbot/slave/monero-static-win32/build/build/release'
make[3]: Entering directory '/home/buildbot/slave/monero-static-win32/build/build/release'
[ 78%] Building CXX object src/rpc/CMakeFiles/obj_rpc.dir/bootstrap_daemon.cpp.obj
In file included from C:/msys32/mingw32/include/boost/random/detail/integer_log2.hpp:19:0,
                 from C:/msys32/mingw32/include/boost/random/detail/large_arithmetic.hpp:19,
                 from C:/msys32/mingw32/include/boost/random/detail/const_mod.hpp:23,
                 from C:/msys32/mingw32/include/boost/random/detail/seed_impl.hpp:26,
                 from C:/msys32/mingw32/include/boost/random/mersenne_twister.hpp:30,
                 from C:/msys32/mingw32/include/boost/uuid/random_generator.hpp:17,
                 from C:/msys32/home/buildbot/slave/monero-static-win32/build/contrib/epee/include/math_helper.h:38,
                 from C:/msys32/home/buildbot/slave/monero-static-win32/build/src/cryptonote_core/tx_pool.h:43,
                 from C:/msys32/home/buildbot/slave/monero-static-win32/build/src/cryptonote_core/cryptonote_core.h:42,
                 from C:/msys32/home/buildbot/slave/monero-static-win32/build/src/rpc/bootstrap_daemon.cpp:6:
C:/msys32/mingw32/include/boost/pending/integer_log2.hpp:7:59: note: #pragma message: This header is deprecated. Use <boost/integer/integer_log2.hpp> instead.
 BOOST_HEADER_DEPRECATED("<boost/integer/integer_log2.hpp>");
                                                           ^
[ 78%] Building CXX object src/rpc/CMakeFiles/obj_rpc.dir/core_rpc_server.cpp.obj
In file included from C:/msys32/mingw32/include/boost/random/detail/integer_log2.hpp:19:0,
                 from C:/msys32/mingw32/include/boost/random/detail/large_arithmetic.hpp:19,
                 from C:/msys32/mingw32/include/boost/random/detail/const_mod.hpp:23,
                 from C:/msys32/mingw32/include/boost/random/detail/seed_impl.hpp:26,
                 from C:/msys32/mingw32/include/boost/random/mersenne_twister.hpp:30,
                 from C:/msys32/mingw32/include/boost/uuid/random_generator.hpp:17,
                 from C:/msys32/home/buildbot/slave/monero-static-win32/build/contrib/epee/include/net/network_throttle.hpp:61,
                 from C:/msys32/home/buildbot/slave/monero-static-win32/build/contrib/epee/include/net/network_throttle-detail.hpp:40,
                 from C:/msys32/home/buildbot/slave/monero-static-win32/build/contrib/epee/include/net/abstract_tcp_server2.h:61,
                 from C:/msys32/home/buildbot/slave/monero-static-win32/build/contrib/epee/include/net/http_server_impl_base.h:36,
                 from C:/msys32/home/buildbot/slave/monero-static-win32/build/src/rpc/core_rpc_server.h:39,
                 from C:/msys32/home/buildbot/slave/monero-static-win32/build/src/rpc/core_rpc_server.cpp:36:
C:/msys32/mingw32/include/boost/pending/integer_log2.hpp:7:59: note: #pragma message: This header is deprecated. Use <boost/integer/integer_log2.hpp> instead.
 BOOST_HEADER_DEPRECATED("<boost/integer/integer_log2.hpp>");
                                                           ^
[ 79%] Building CXX object src/rpc/CMakeFiles/obj_rpc.dir/rpc_payment.cpp.obj
[ 79%] Building CXX object src/rpc/CMakeFiles/obj_rpc.dir/instanciations.cpp.obj
In file included from C:/msys32/mingw32/include/boost/random/detail/integer_log2.hpp:19:0,
                 from C:/msys32/mingw32/include/boost/random/detail/large_arithmetic.hpp:19,
                 from C:/msys32/mingw32/include/boost/random/detail/const_mod.hpp:23,
                 from C:/msys32/mingw32/include/boost/random/detail/seed_impl.hpp:26,
                 from C:/msys32/mingw32/include/boost/random/mersenne_twister.hpp:30,
                 from C:/msys32/mingw32/include/boost/uuid/random_generator.hpp:17,
                 from C:/msys32/home/buildbot/slave/monero-static-win32/build/contrib/epee/include/net/network_throttle.hpp:61,
                 from C:/msys32/home/buildbot/slave/monero-static-win32/build/contrib/epee/include/net/network_throttle-detail.hpp:40,
                 from C:/msys32/home/buildbot/slave/monero-static-win32/build/contrib/epee/include/net/abstract_tcp_server2.h:61,
                 from C:/msys32/home/buildbot/slave/monero-static-win32/build/src/p2p/net_node.h:48,
                 from C:/msys32/home/buildbot/slave/monero-static-win32/build/src/rpc/instanciations.cpp:31:
C:/msys32/mingw32/include/boost/pending/integer_log2.hpp:7:59: note: #pragma message: This header is deprecated. Use <boost/integer/integer_log2.hpp> instead.
 BOOST_HEADER_DEPRECATED("<boost/integer/integer_log2.hpp>");
                                                           ^
make[3]: Leaving directory '/home/buildbot/slave/monero-static-win32/build/build/release'
[ 79%] Built target obj_rpc
make[3]: Entering directory '/home/buildbot/slave/monero-static-win32/build/build/release'
Scanning dependencies of target obj_cryptonote_protocol
make[3]: Leaving directory '/home/buildbot/slave/monero-static-win32/build/build/release'
make[3]: Entering directory '/home/buildbot/slave/monero-static-win32/build/build/release'
[ 80%] Building CXX object src/cryptonote_protocol/CMakeFiles/obj_cryptonote_protocol.dir/block_queue.cpp.obj
[ 80%] Building CXX object src/cryptonote_protocol/CMakeFiles/obj_cryptonote_protocol.dir/cryptonote_protocol_handler-base.cpp.obj
In file included from C:/msys32/mingw32/include/boost/random/detail/integer_log2.hpp:19:0,
                 from C:/msys32/mingw32/include/boost/random/detail/large_arithmetic.hpp:19,
                 from C:/msys32/mingw32/include/boost/random/detail/const_mod.hpp:23,
                 from C:/msys32/mingw32/include/boost/random/detail/seed_impl.hpp:26,
                 from C:/msys32/mingw32/include/boost/random/mersenne_twister.hpp:30,
                 from C:/msys32/mingw32/include/boost/uuid/random_generator.hpp:17,
                 from C:/msys32/home/buildbot/slave/monero-static-win32/build/contrib/epee/include/math_helper.h:38,
                 from C:/msys32/home/buildbot/slave/monero-static-win32/build/src/cryptonote_protocol/cryptonote_protocol_handler.h:40,
                 from C:/msys32/home/buildbot/slave/monero-static-win32/build/src/cryptonote_protocol/cryptonote_protocol_handler-base.cpp:50:
C:/msys32/mingw32/include/boost/pending/integer_log2.hpp:7:59: note: #pragma message: This header is deprecated. Use <boost/integer/integer_log2.hpp> instead.
 BOOST_HEADER_DEPRECATED("<boost/integer/integer_log2.hpp>");
                                                           ^
[ 80%] Building CXX object src/cryptonote_protocol/CMakeFiles/obj_cryptonote_protocol.dir/levin_notify.cpp.obj
In file included from C:/msys32/mingw32/include/boost/random/detail/integer_log2.hpp:19:0,
                 from C:/msys32/mingw32/include/boost/random/detail/large_arithmetic.hpp:19,
                 from C:/msys32/mingw32/include/boost/random/detail/const_mod.hpp:23,
                 from C:/msys32/mingw32/include/boost/random/detail/seed_impl.hpp:26,
                 from C:/msys32/mingw32/include/boost/random/mersenne_twister.hpp:30,
                 from C:/msys32/mingw32/include/boost/uuid/random_generator.hpp:17,
                 from C:/msys32/home/buildbot/slave/monero-static-win32/build/contrib/epee/include/net/network_throttle.hpp:61,
                 from C:/msys32/home/buildbot/slave/monero-static-win32/build/contrib/epee/include/net/network_throttle-detail.hpp:40,
                 from C:/msys32/home/buildbot/slave/monero-static-win32/build/contrib/epee/include/net/abstract_tcp_server2.h:61,
                 from C:/msys32/home/buildbot/slave/monero-static-win32/build/src/p2p/net_node.h:48,
                 from C:/msys32/home/buildbot/slave/monero-static-win32/build/src/cryptonote_protocol/levin_notify.cpp:44:
C:/msys32/mingw32/include/boost/pending/integer_log2.hpp:7:59: note: #pragma message: This header is deprecated. Use <boost/integer/integer_log2.hpp> instead.
 BOOST_HEADER_DEPRECATED("<boost/integer/integer_log2.hpp>");
                                                           ^
make[3]: Leaving directory '/home/buildbot/slave/monero-static-win32/build/build/release'
[ 80%] Built target obj_cryptonote_protocol
make[3]: Entering directory '/home/buildbot/slave/monero-static-win32/build/build/release'
Scanning dependencies of target obj_p2p
make[3]: Leaving directory '/home/buildbot/slave/monero-static-win32/build/build/release'
make[3]: Entering directory '/home/buildbot/slave/monero-static-win32/build/build/release'
[ 81%] Building CXX object src/p2p/CMakeFiles/obj_p2p.dir/net_node.cpp.obj
In file included from C:/msys32/mingw32/include/boost/random/detail/integer_log2.hpp:19:0,
                 from C:/msys32/mingw32/include/boost/random/detail/large_arithmetic.hpp:19,
                 from C:/msys32/mingw32/include/boost/random/detail/const_mod.hpp:23,
                 from C:/msys32/mingw32/include/boost/random/detail/seed_impl.hpp:26,
                 from C:/msys32/mingw32/include/boost/random/mersenne_twister.hpp:30,
                 from C:/msys32/mingw32/include/boost/uuid/random_generator.hpp:17,
                 from C:/msys32/home/buildbot/slave/monero-static-win32/build/contrib/epee/include/math_helper.h:38,
                 from C:/msys32/home/buildbot/slave/monero-static-win32/build/src/cryptonote_core/tx_pool.h:43,
                 from C:/msys32/home/buildbot/slave/monero-static-win32/build/src/cryptonote_core/cryptonote_core.h:42,
                 from C:/msys32/home/buildbot/slave/monero-static-win32/build/src/p2p/net_node.cpp:42:
C:/msys32/mingw32/include/boost/pending/integer_log2.hpp:7:59: note: #pragma message: This header is deprecated. Use <boost/integer/integer_log2.hpp> instead.
 BOOST_HEADER_DEPRECATED("<boost/integer/integer_log2.hpp>");
                                                           ^
[ 81%] Building CXX object src/p2p/CMakeFiles/obj_p2p.dir/net_peerlist.cpp.obj
make[3]: Leaving directory '/home/buildbot/slave/monero-static-win32/build/build/release'
[ 81%] Built target obj_p2p
make[3]: Entering directory '/home/buildbot/slave/monero-static-win32/build/build/release'
Scanning dependencies of target p2p
make[3]: Leaving directory '/home/buildbot/slave/monero-static-win32/build/build/release'
make[3]: Entering directory '/home/buildbot/slave/monero-static-win32/build/build/release'
[ 81%] Linking CXX static library libp2p.a
make[3]: Leaving directory '/home/buildbot/slave/monero-static-win32/build/build/release'
[ 81%] Built target p2p
make[3]: Entering directory '/home/buildbot/slave/monero-static-win32/build/build/release'
Scanning dependencies of target cryptonote_protocol
make[3]: Leaving directory '/home/buildbot/slave/monero-static-win32/build/build/release'
make[3]: Entering directory '/home/buildbot/slave/monero-static-win32/build/build/release'
[ 81%] Linking CXX static library libcryptonote_protocol.a
make[3]: Leaving directory '/home/buildbot/slave/monero-static-win32/build/build/release'
[ 81%] Built target cryptonote_protocol
make[3]: Entering directory '/home/buildbot/slave/monero-static-win32/build/build/release'
Scanning dependencies of target rpc
make[3]: Leaving directory '/home/buildbot/slave/monero-static-win32/build/build/release'
make[3]: Entering directory '/home/buildbot/slave/monero-static-win32/build/build/release'
[ 81%] Linking CXX static library librpc.a
make[3]: Leaving directory '/home/buildbot/slave/monero-static-win32/build/build/release'
[ 81%] Built target rpc
make[3]: Entering directory '/home/buildbot/slave/monero-static-win32/build/build/release'
Scanning dependencies of target obj_serialization
make[3]: Leaving directory '/home/buildbot/slave/monero-static-win32/build/build/release'
make[3]: Entering directory '/home/buildbot/slave/monero-static-win32/build/build/release'
[ 81%] Building CXX object src/serialization/CMakeFiles/obj_serialization.dir/json_object.cpp.obj
make[3]: Leaving directory '/home/buildbot/slave/monero-static-win32/build/build/release'
[ 81%] Built target obj_serialization
make[3]: Entering directory '/home/buildbot/slave/monero-static-win32/build/build/release'
Scanning dependencies of target serialization
make[3]: Leaving directory '/home/buildbot/slave/monero-static-win32/build/build/release'
make[3]: Entering directory '/home/buildbot/slave/monero-static-win32/build/build/release'
[ 82%] Linking CXX static library libserialization.a
make[3]: Leaving directory '/home/buildbot/slave/monero-static-win32/build/build/release'
[ 82%] Built target serialization
make[3]: Entering directory '/home/buildbot/slave/monero-static-win32/build/build/release'
Scanning dependencies of target obj_daemon_messages
make[3]: Leaving directory '/home/buildbot/slave/monero-static-win32/build/build/release'
make[3]: Entering directory '/home/buildbot/slave/monero-static-win32/build/build/release'
[ 82%] Building CXX object src/rpc/CMakeFiles/obj_daemon_messages.dir/message.cpp.obj
[ 84%] Building CXX object src/rpc/CMakeFiles/obj_daemon_messages.dir/daemon_messages.cpp.obj
make[3]: Leaving directory '/home/buildbot/slave/monero-static-win32/build/build/release'
[ 84%] Built target obj_daemon_messages
make[3]: Entering directory '/home/buildbot/slave/monero-static-win32/build/build/release'
Scanning dependencies of target daemon_messages
make[3]: Leaving directory '/home/buildbot/slave/monero-static-win32/build/build/release'
make[3]: Entering directory '/home/buildbot/slave/monero-static-win32/build/build/release'
[ 84%] Linking CXX static library libdaemon_messages.a
make[3]: Leaving directory '/home/buildbot/slave/monero-static-win32/build/build/release'
[ 84%] Built target daemon_messages
make[3]: Entering directory '/home/buildbot/slave/monero-static-win32/build/build/release'
Scanning dependencies of target obj_daemon_rpc_server
make[3]: Leaving directory '/home/buildbot/slave/monero-static-win32/build/build/release'
make[3]: Entering directory '/home/buildbot/slave/monero-static-win32/build/build/release'
[ 84%] Building CXX object src/rpc/CMakeFiles/obj_daemon_rpc_server.dir/daemon_handler.cpp.obj
In file included from C:/msys32/mingw32/include/boost/random/detail/integer_log2.hpp:19:0,
                 from C:/msys32/mingw32/include/boost/random/detail/large_arithmetic.hpp:19,
                 from C:/msys32/mingw32/include/boost/random/detail/const_mod.hpp:23,
                 from C:/msys32/mingw32/include/boost/random/detail/seed_impl.hpp:26,
                 from C:/msys32/mingw32/include/boost/random/mersenne_twister.hpp:30,
                 from C:/msys32/mingw32/include/boost/uuid/random_generator.hpp:17,
                 from C:/msys32/home/buildbot/slave/monero-static-win32/build/contrib/epee/include/math_helper.h:38,
                 from C:/msys32/home/buildbot/slave/monero-static-win32/build/src/cryptonote_core/tx_pool.h:43,
                 from C:/msys32/home/buildbot/slave/monero-static-win32/build/src/cryptonote_core/cryptonote_core.h:42,
                 from C:/msys32/home/buildbot/slave/monero-static-win32/build/src/rpc/daemon_handler.h:34,
                 from C:/msys32/home/buildbot/slave/monero-static-win32/build/src/rpc/daemon_handler.cpp:29:
C:/msys32/mingw32/include/boost/pending/integer_log2.hpp:7:59: note: #pragma message: This header is deprecated. Use <boost/integer/integer_log2.hpp> instead.
 BOOST_HEADER_DEPRECATED("<boost/integer/integer_log2.hpp>");
                                                           ^
[ 84%] Building CXX object src/rpc/CMakeFiles/obj_daemon_rpc_server.dir/zmq_server.cpp.obj
make[3]: Leaving directory '/home/buildbot/slave/monero-static-win32/build/build/release'
[ 84%] Built target obj_daemon_rpc_server
make[3]: Entering directory '/home/buildbot/slave/monero-static-win32/build/build/release'
Scanning dependencies of target daemon_rpc_server
make[3]: Leaving directory '/home/buildbot/slave/monero-static-win32/build/build/release'
make[3]: Entering directory '/home/buildbot/slave/monero-static-win32/build/build/release'
[ 84%] Linking CXX static library libdaemon_rpc_server.a
make[3]: Leaving directory '/home/buildbot/slave/monero-static-win32/build/build/release'
[ 84%] Built target daemon_rpc_server
make[3]: Entering directory '/home/buildbot/slave/monero-static-win32/build/build/release'
Scanning dependencies of target obj_wallet
make[3]: Leaving directory '/home/buildbot/slave/monero-static-win32/build/build/release'
make[3]: Entering directory '/home/buildbot/slave/monero-static-win32/build/build/release'
[ 84%] Building CXX object src/wallet/CMakeFiles/obj_wallet.dir/wallet2.cpp.obj
In file included from C:/msys32/mingw32/include/boost/random/detail/integer_log2.hpp:19:0,
                 from C:/msys32/mingw32/include/boost/random/detail/large_arithmetic.hpp:19,
                 from C:/msys32/mingw32/include/boost/random/detail/const_mod.hpp:23,
                 from C:/msys32/mingw32/include/boost/random/detail/seed_impl.hpp:26,
                 from C:/msys32/mingw32/include/boost/random/mersenne_twister.hpp:30,
                 from C:/msys32/mingw32/include/boost/uuid/random_generator.hpp:17,
                 from C:/msys32/home/buildbot/slave/monero-static-win32/build/contrib/epee/include/net/network_throttle.hpp:61,
                 from C:/msys32/home/buildbot/slave/monero-static-win32/build/contrib/epee/include/net/network_throttle-detail.hpp:40,
                 from C:/msys32/home/buildbot/slave/monero-static-win32/build/contrib/epee/include/net/abstract_tcp_server2.h:61,
                 from C:/msys32/home/buildbot/slave/monero-static-win32/build/contrib/epee/include/net/http_server_impl_base.h:36,
                 from C:/msys32/home/buildbot/slave/monero-static-win32/build/src/wallet/message_transporter.h:35,
                 from C:/msys32/home/buildbot/slave/monero-static-win32/build/src/wallet/message_store.h:46,
                 from C:/msys32/home/buildbot/slave/monero-static-win32/build/src/wallet/wallet2.h:65,
                 from C:/msys32/home/buildbot/slave/monero-static-win32/build/src/wallet/wallet2.cpp:48:
C:/msys32/mingw32/include/boost/pending/integer_log2.hpp:7:59: note: #pragma message: This header is deprecated. Use <boost/integer/integer_log2.hpp> instead.
 BOOST_HEADER_DEPRECATED("<boost/integer/integer_log2.hpp>");
                                                           ^
C:/msys32/home/buildbot/slave/monero-static-win32/build/src/wallet/wallet2.cpp: In member function 'void tools::wallet2::refresh(bool, uint64_t, uint64_t&, bool&, bool)':
C:/msys32/home/buildbot/slave/monero-static-win32/build/src/wallet/wallet2.cpp:3239:8: warning: variable 'refreshed' set but not used [-Wunused-but-set-variable]
   bool refreshed = false;
        ^~~~~~~~~
C:/msys32/home/buildbot/slave/monero-static-win32/build/src/wallet/wallet2.cpp: In function 'std::unique_ptr<tools::wallet2> {anonymous}::make_basic(const boost::program_options::variables_map&, bool, const {anonymous}::options&, const std::function<boost::optional<tools::password_container>(const char*, bool)>&)':
C:/msys32/home/buildbot/slave/monero-static-win32/build/src/wallet/wallet2.cpp:483:82: warning: '*((void*)& trusted_daemon +1)' may be used uninitialized in this function [-Wmaybe-uninitialized]
   wallet->init(std::move(daemon_address), std::move(login), std::move(proxy), 0, *trusted_daemon, std::move(ssl_options));
                                                                                  ^~~~~~~~~~~~~~~
[ 85%] Building CXX object src/wallet/CMakeFiles/obj_wallet.dir/wallet_args.cpp.obj
[ 85%] Building CXX object src/wallet/CMakeFiles/obj_wallet.dir/ringdb.cpp.obj
[ 85%] Building CXX object src/wallet/CMakeFiles/obj_wallet.dir/node_rpc_proxy.cpp.obj
[ 86%] Building CXX object src/wallet/CMakeFiles/obj_wallet.dir/message_store.cpp.obj
In file included from C:/msys32/mingw32/include/boost/random/detail/integer_log2.hpp:19:0,
                 from C:/msys32/mingw32/include/boost/random/detail/large_arithmetic.hpp:19,
                 from C:/msys32/mingw32/include/boost/random/detail/const_mod.hpp:23,
                 from C:/msys32/mingw32/include/boost/random/detail/seed_impl.hpp:26,
                 from C:/msys32/mingw32/include/boost/random/mersenne_twister.hpp:30,
                 from C:/msys32/mingw32/include/boost/uuid/random_generator.hpp:17,
                 from C:/msys32/home/buildbot/slave/monero-static-win32/build/contrib/epee/include/net/network_throttle.hpp:61,
                 from C:/msys32/home/buildbot/slave/monero-static-win32/build/contrib/epee/include/net/network_throttle-detail.hpp:40,
                 from C:/msys32/home/buildbot/slave/monero-static-win32/build/contrib/epee/include/net/abstract_tcp_server2.h:61,
                 from C:/msys32/home/buildbot/slave/monero-static-win32/build/contrib/epee/include/net/http_server_impl_base.h:36,
                 from C:/msys32/home/buildbot/slave/monero-static-win32/build/src/wallet/message_transporter.h:35,
                 from C:/msys32/home/buildbot/slave/monero-static-win32/build/src/wallet/message_store.h:46,
                 from C:/msys32/home/buildbot/slave/monero-static-win32/build/src/wallet/message_store.cpp:29:
C:/msys32/mingw32/include/boost/pending/integer_log2.hpp:7:59: note: #pragma message: This header is deprecated. Use <boost/integer/integer_log2.hpp> instead.
 BOOST_HEADER_DEPRECATED("<boost/integer/integer_log2.hpp>");
                                                           ^
[ 86%] Building CXX object src/wallet/CMakeFiles/obj_wallet.dir/message_transporter.cpp.obj
In file included from C:/msys32/mingw32/include/boost/random/detail/integer_log2.hpp:19:0,
                 from C:/msys32/mingw32/include/boost/random/detail/large_arithmetic.hpp:19,
                 from C:/msys32/mingw32/include/boost/random/detail/const_mod.hpp:23,
                 from C:/msys32/mingw32/include/boost/random/detail/seed_impl.hpp:26,
                 from C:/msys32/mingw32/include/boost/random/mersenne_twister.hpp:30,
                 from C:/msys32/mingw32/include/boost/uuid/random_generator.hpp:17,
                 from C:/msys32/home/buildbot/slave/monero-static-win32/build/contrib/epee/include/net/network_throttle.hpp:61,
                 from C:/msys32/home/buildbot/slave/monero-static-win32/build/contrib/epee/include/net/network_throttle-detail.hpp:40,
                 from C:/msys32/home/buildbot/slave/monero-static-win32/build/contrib/epee/include/net/abstract_tcp_server2.h:61,
                 from C:/msys32/home/buildbot/slave/monero-static-win32/build/contrib/epee/include/net/http_server_impl_base.h:36,
                 from C:/msys32/home/buildbot/slave/monero-static-win32/build/src/wallet/message_transporter.h:35,
                 from C:/msys32/home/buildbot/slave/monero-static-win32/build/src/wallet/message_transporter.cpp:29:
C:/msys32/mingw32/include/boost/pending/integer_log2.hpp:7:59: note: #pragma message: This header is deprecated. Use <boost/integer/integer_log2.hpp> instead.
 BOOST_HEADER_DEPRECATED("<boost/integer/integer_log2.hpp>");
                                                           ^
[ 86%] Building CXX object src/wallet/CMakeFiles/obj_wallet.dir/wallet_rpc_payments.cpp.obj
In file included from C:/msys32/mingw32/include/boost/multiprecision/detail/generic_interconvert.hpp:9:0,
                 from C:/msys32/mingw32/include/boost/multiprecision/number.hpp:24,
                 from C:/msys32/mingw32/include/boost/multiprecision/cpp_int.hpp:12,
                 from C:/msys32/home/buildbot/slave/monero-static-win32/build/src/cryptonote_basic/difficulty.h:36,
                 from C:/msys32/home/buildbot/slave/monero-static-win32/build/src/cryptonote_basic/cryptonote_boost_serialization.h:43,
                 from C:/msys32/home/buildbot/slave/monero-static-win32/build/src/cryptonote_basic/account_boost_serialization.h:34,
                 from C:/msys32/home/buildbot/slave/monero-static-win32/build/src/wallet/wallet2.h:46,
                 from C:/msys32/home/buildbot/slave/monero-static-win32/build/src/wallet/wallet_rpc_payments.cpp:34:
C:/msys32/mingw32/include/boost/multiprecision/detail/default_ops.hpp:3815:10: error: C:/msys32/mingw32/include/boost/multiprecision/detail/no_et_ops.hpp: Not enough space
C:/msys32/mingw32/include/boost/multiprecision/detail/default_ops.hpp:3816:10: error: C:/msys32/mingw32/include/boost/multiprecision/detail/et_ops.hpp: Not enough space
C:/msys32/mingw32/include/boost/multiprecision/detail/default_ops.hpp:3820:10: error: C:/msys32/mingw32/include/boost/multiprecision/detail/min_max.hpp: Not enough space
In file included from C:/msys32/mingw32/include/boost/multiprecision/cpp_int.hpp:12:0,
                 from C:/msys32/home/buildbot/slave/monero-static-win32/build/src/cryptonote_basic/difficulty.h:36,
                 from C:/msys32/home/buildbot/slave/monero-static-win32/build/src/cryptonote_basic/cryptonote_boost_serialization.h:43,
                 from C:/msys32/home/buildbot/slave/monero-static-win32/build/src/cryptonote_basic/account_boost_serialization.h:34,
                 from C:/msys32/home/buildbot/slave/monero-static-win32/build/src/wallet/wallet2.h:46,
                 from C:/msys32/home/buildbot/slave/monero-static-win32/build/src/wallet/wallet_rpc_payments.cpp:34:
C:/msys32/mingw32/include/boost/multiprecision/number.hpp:25:10: error: C:/msys32/mingw32/include/boost/multiprecision/detail/number_compare.hpp: Not enough space
C:/msys32/mingw32/include/boost/multiprecision/number.hpp:26:10: error: C:/msys32/mingw32/include/boost/multiprecision/traits/is_restricted_conversion.hpp: Not enough space
C:/msys32/mingw32/include/boost/multiprecision/number.hpp:27:10: error: C:/msys32/mingw32/include/boost/container_hash/hash.hpp: Not enough space
C:/msys32/mingw32/include/boost/multiprecision/number.hpp:29:10: error: C:/msys32/mingw32/include/c++/7.4.0/cstdio: Not enough space
C:/msys32/mingw32/include/boost/multiprecision/number.hpp:30:10: error: C:/msys32/mingw32/include/c++/7.4.0/cctype: Not enough space
In file included from C:/msys32/mingw32/include/boost/multiprecision/cpp_int.hpp:12:0,
                 from C:/msys32/home/buildbot/slave/monero-static-win32/build/src/cryptonote_basic/difficulty.h:36,
                 from C:/msys32/home/buildbot/slave/monero-static-win32/build/src/cryptonote_basic/cryptonote_boost_serialization.h:43,
                 from C:/msys32/home/buildbot/slave/monero-static-win32/build/src/cryptonote_basic/account_boost_serialization.h:34,
                 from C:/msys32/home/buildbot/slave/monero-static-win32/build/src/wallet/wallet2.h:46,
                 from C:/msys32/home/buildbot/slave/monero-static-win32/build/src/wallet/wallet_rpc_payments.cpp:34:
C:/msys32/mingw32/include/boost/multiprecision/number.hpp:2276:10: error: C:/msys32/mingw32/include/boost/multiprecision/detail/ublas_interop.hpp: Not enough space
In file included from C:/msys32/home/buildbot/slave/monero-static-win32/build/src/cryptonote_basic/difficulty.h:36:0,
                 from C:/msys32/home/buildbot/slave/monero-static-win32/build/src/cryptonote_basic/cryptonote_boost_serialization.h:43,
                 from C:/msys32/home/buildbot/slave/monero-static-win32/build/src/cryptonote_basic/account_boost_serialization.h:34,
                 from C:/msys32/home/buildbot/slave/monero-static-win32/build/src/wallet/wallet2.h:46,
                 from C:/msys32/home/buildbot/slave/monero-static-win32/build/src/wallet/wallet_rpc_payments.cpp:34:
C:/msys32/mingw32/include/boost/multiprecision/cpp_int.hpp:13:10: error: C:/msys32/mingw32/include/boost/multiprecision/detail/integer_ops.hpp: Not enough space
In file included from C:/msys32/mingw32/include/boost/multiprecision/cpp_int.hpp:12:0,
                 from C:/msys32/home/buildbot/slave/monero-static-win32/build/src/cryptonote_basic/difficulty.h:36,
                 from C:/msys32/home/buildbot/slave/monero-static-win32/build/src/cryptonote_basic/cryptonote_boost_serialization.h:43,
                 from C:/msys32/home/buildbot/slave/monero-static-win32/build/src/cryptonote_basic/account_boost_serialization.h:34,
                 from C:/msys32/home/buildbot/slave/monero-static-win32/build/src/wallet/wallet2.h:46,
                 from C:/msys32/home/buildbot/slave/monero-static-win32/build/src/wallet/wallet_rpc_payments.cpp:34:
C:/msys32/mingw32/include/boost/multiprecision/number.hpp:57:25: error: 'is_restricted_conversion' is not a member of 'boost::multiprecision::detail'
             && !detail::is_restricted_conversion<typename detail::canonical<V, Backend>::type, Backend>::value
                         ^~~~~~~~~~~~~~~~~~~~~~~~
C:/msys32/mingw32/include/boost/multiprecision/number.hpp:57:25: error: 'is_restricted_conversion' is not a member of 'boost::multiprecision::detail'
C:/msys32/mingw32/include/boost/multiprecision/number.hpp:54:60: error: invalid use of template-name 'boost::enable_if_c' without an argument list
    BOOST_MP_FORCEINLINE number(const V& v, typename boost::enable_if_c<
                                                            ^~~~~~~~~~~
C:/msys32/mingw32/include/boost/multiprecision/number.hpp:54:60: note: class template argument deduction is only available with -std=c++1z or -std=gnu++1z
In file included from C:/msys32/mingw32/include/boost/optional/optional.hpp:29:0,
                 from C:/msys32/home/buildbot/slave/monero-static-win32/build/src/wallet/wallet_rpc_payments.cpp:29:
C:/msys32/mingw32/include/boost/core/enable_if.hpp:33:10: note: 'template<bool B, class T> struct boost::enable_if_c' declared here
   struct enable_if_c {
          ^~~~~~~~~~~
In file included from C:/msys32/mingw32/include/boost/multiprecision/cpp_int.hpp:12:0,
                 from C:/msys32/home/buildbot/slave/monero-static-win32/build/src/cryptonote_basic/difficulty.h:36,
                 from C:/msys32/home/buildbot/slave/monero-static-win32/build/src/cryptonote_basic/cryptonote_boost_serialization.h:43,
                 from C:/msys32/home/buildbot/slave/monero-static-win32/build/src/cryptonote_basic/account_boost_serialization.h:34,
                 from C:/msys32/home/buildbot/slave/monero-static-win32/build/src/wallet/wallet2.h:46,
                 from C:/msys32/home/buildbot/slave/monero-static-win32/build/src/wallet/wallet_rpc_payments.cpp:34:
C:/msys32/mingw32/include/boost/multiprecision/number.hpp:54:71: error: expected ',' or '...' before '<' token
    BOOST_MP_FORCEINLINE number(const V& v, typename boost::enable_if_c<
                                                                       ^
C:/msys32/mingw32/include/boost/multiprecision/number.hpp:68:25: error: 'is_restricted_conversion' is not a member of 'boost::multiprecision::detail'
             && !detail::is_restricted_conversion<typename detail::canonical<V, Backend>::type, Backend>::value
                         ^~~~~~~~~~~~~~~~~~~~~~~~
C:/msys32/mingw32/include/boost/multiprecision/number.hpp:68:25: error: 'is_restricted_conversion' is not a member of 'boost::multiprecision::detail'
C:/msys32/mingw32/include/boost/multiprecision/number.hpp:66:76: error: invalid use of template-name 'boost::enable_if_c' without an argument list
    BOOST_MP_FORCEINLINE BOOST_CONSTEXPR number(const V& v, typename boost::enable_if_c<
                                                                            ^~~~~~~~~~~
C:/msys32/mingw32/include/boost/multiprecision/number.hpp:66:76: note: class template argument deduction is only available with -std=c++1z or -std=gnu++1z
In file included from C:/msys32/mingw32/include/boost/optional/optional.hpp:29:0,
                 from C:/msys32/home/buildbot/slave/monero-static-win32/build/src/wallet/wallet_rpc_payments.cpp:29:
C:/msys32/mingw32/include/boost/core/enable_if.hpp:33:10: note: 'template<bool B, class T> struct boost::enable_if_c' declared here
   struct enable_if_c {
          ^~~~~~~~~~~
In file included from C:/msys32/mingw32/include/boost/multiprecision/cpp_int.hpp:12:0,
                 from C:/msys32/home/buildbot/slave/monero-static-win32/build/src/cryptonote_basic/difficulty.h:36,
                 from C:/msys32/home/buildbot/slave/monero-static-win32/build/src/cryptonote_basic/cryptonote_boost_serialization.h:43,
                 from C:/msys32/home/buildbot/slave/monero-static-win32/build/src/cryptonote_basic/account_boost_serialization.h:34,
                 from C:/msys32/home/buildbot/slave/monero-static-win32/build/src/wallet/wallet2.h:46,
                 from C:/msys32/home/buildbot/slave/monero-static-win32/build/src/wallet/wallet_rpc_payments.cpp:34:
C:/msys32/mingw32/include/boost/multiprecision/number.hpp:66:87: error: expected ',' or '...' before '<' token
    BOOST_MP_FORCEINLINE BOOST_CONSTEXPR number(const V& v, typename boost::enable_if_c<
                                                                                       ^
C:/msys32/mingw32/include/boost/multiprecision/number.hpp:66:41: error: 'template<class Backend, boost::multiprecision::expression_template_option ExpressionTemplates> template<class V> constexpr boost::multiprecision::number<Backend, ExpressionTemplates>::number(const V&, int)' cannot be overloaded
    BOOST_MP_FORCEINLINE BOOST_CONSTEXPR number(const V& v, typename boost::enable_if_c<
                                         ^~~~~~
C:/msys32/mingw32/include/boost/multiprecision/number.hpp:54:25: error: with 'template<class Backend, boost::multiprecision::expression_template_option ExpressionTemplates> template<class V> boost::multiprecision::number<Backend, ExpressionTemplates>::number(const V&, int)'
    BOOST_MP_FORCEINLINE number(const V& v, typename boost::enable_if_c<
                         ^~~~~~
C:/msys32/mingw32/include/boost/multiprecision/number.hpp:77:19: error: 'is_restricted_conversion' is not a member of 'boost::multiprecision::detail'
       && !detail::is_restricted_conversion<typename detail::canonical<V, Backend>::type, Backend>::value
                   ^~~~~~~~~~~~~~~~~~~~~~~~
C:/msys32/mingw32/include/boost/multiprecision/number.hpp:77:19: error: 'is_restricted_conversion' is not a member of 'boost::multiprecision::detail'
C:/msys32/mingw32/include/boost/multiprecision/number.hpp:75:95: error: invalid use of template-name 'boost::enable_if_c' without an argument list
    BOOST_MP_FORCEINLINE BOOST_CONSTEXPR number(const V& v, unsigned digits10, typename boost::enable_if_c<
                                                                                               ^~~~~~~~~~~
C:/msys32/mingw32/include/boost/multiprecision/number.hpp:75:95: note: class template argument deduction is only available with -std=c++1z or -std=gnu++1z
In file included from C:/msys32/mingw32/include/boost/optional/optional.hpp:29:0,
                 from C:/msys32/home/buildbot/slave/monero-static-win32/build/src/wallet/wallet_rpc_payments.cpp:29:
C:/msys32/mingw32/include/boost/core/enable_if.hpp:33:10: note: 'template<bool B, class T> struct boost::enable_if_c' declared here
   struct enable_if_c {
          ^~~~~~~~~~~
In file included from C:/msys32/mingw32/include/boost/multiprecision/cpp_int.hpp:12:0,
                 from C:/msys32/home/buildbot/slave/monero-static-win32/build/src/cryptonote_basic/difficulty.h:36,
                 from C:/msys32/home/buildbot/slave/monero-static-win32/build/src/cryptonote_basic/cryptonote_boost_serialization.h:43,
                 from C:/msys32/home/buildbot/slave/monero-static-win32/build/src/cryptonote_basic/account_boost_serialization.h:34,
                 from C:/msys32/home/buildbot/slave/monero-static-win32/build/src/wallet/wallet2.h:46,
                 from C:/msys32/home/buildbot/slave/monero-static-win32/build/src/wallet/wallet_rpc_payments.cpp:34:
C:/msys32/mingw32/include/boost/multiprecision/number.hpp:75:106: error: expected ',' or '...' before '<' token
    BOOST_MP_FORCEINLINE BOOST_CONSTEXPR number(const V& v, unsigned digits10, typename boost::enable_if_c<
                                                                                                          ^
C:/msys32/mingw32/include/boost/multiprecision/number.hpp:91:25: error: 'is_explicitly_convertible' is not a member of 'boost::multiprecision::detail'
             && !detail::is_explicitly_convertible<typename detail::canonical<V, Backend>::type, Backend>::value
                         ^~~~~~~~~~~~~~~~~~~~~~~~~
C:/msys32/mingw32/include/boost/multiprecision/number.hpp:91:25: error: 'is_explicitly_convertible' is not a member of 'boost::multiprecision::detail'
C:/msys32/mingw32/include/boost/multiprecision/number.hpp:89:69: error: invalid use of template-name 'boost::enable_if_c' without an argument list
    explicit BOOST_MP_FORCEINLINE number(const V& v, typename boost::enable_if_c<
                                                                     ^~~~~~~~~~~
C:/msys32/mingw32/include/boost/multiprecision/number.hpp:89:69: note: class template argument deduction is only available with -std=c++1z or -std=gnu++1z
In file included from C:/msys32/mingw32/include/boost/optional/optional.hpp:29:0,
                 from C:/msys32/home/buildbot/slave/monero-static-win32/build/src/wallet/wallet_rpc_payments.cpp:29:
C:/msys32/mingw32/include/boost/core/enable_if.hpp:33:10: note: 'template<bool B, class T> struct boost::enable_if_c' declared here
   struct enable_if_c {
          ^~~~~~~~~~~
In file included from C:/msys32/mingw32/include/boost/multiprecision/cpp_int.hpp:12:0,
                 from C:/msys32/home/buildbot/slave/monero-static-win32/build/src/cryptonote_basic/difficulty.h:36,
                 from C:/msys32/home/buildbot/slave/monero-static-win32/build/src/cryptonote_basic/cryptonote_boost_serialization.h:43,
                 from C:/msys32/home/buildbot/slave/monero-static-win32/build/src/cryptonote_basic/account_boost_serialization.h:34,
                 from C:/msys32/home/buildbot/slave/monero-static-win32/build/src/wallet/wallet2.h:46,
                 from C:/msys32/home/buildbot/slave/monero-static-win32/build/src/wallet/wallet_rpc_payments.cpp:34:
C:/msys32/mingw32/include/boost/multiprecision/number.hpp:89:80: error: expected ',' or '...' before '<' token
    explicit BOOST_MP_FORCEINLINE number(const V& v, typename boost::enable_if_c<
                                                                                ^
C:/msys32/mingw32/include/boost/multiprecision/number.hpp:89:34: error: 'template<class Backend, boost::multiprecision::expression_template_option ExpressionTemplates> template<class V> boost::multiprecision::number<Backend, ExpressionTemplates>::number(const V&, int)' cannot be overloaded
    explicit BOOST_MP_FORCEINLINE number(const V& v, typename boost::enable_if_c<
                                  ^~~~~~
C:/msys32/mingw32/include/boost/multiprecision/number.hpp:54:25: error: with 'template<class Backend, boost::multiprecision::expression_template_option ExpressionTemplates> template<class V> boost::multiprecision::number<Backend, ExpressionTemplates>::number(const V&, int)'
    BOOST_MP_FORCEINLINE number(const V& v, typename boost::enable_if_c<
                         ^~~~~~
C:/msys32/mingw32/include/boost/multiprecision/number.hpp:100:21: error: 'is_explicitly_convertible' is not a member of 'boost::multiprecision::detail'
             detail::is_explicitly_convertible<typename detail::canonical<V, Backend>::type, Backend>::value
                     ^~~~~~~~~~~~~~~~~~~~~~~~~
C:/msys32/mingw32/include/boost/multiprecision/number.hpp:100:21: error: 'is_explicitly_convertible' is not a member of 'boost::multiprecision::detail'
C:/msys32/mingw32/include/boost/multiprecision/number.hpp:100:100: error: template argument 1 is invalid
             detail::is_explicitly_convertible<typename detail::canonical<V, Backend>::type, Backend>::value
                                                                                                    ^
C:/msys32/mingw32/include/boost/multiprecision/number.hpp:100:21: error: 'is_explicitly_convertible' is not a member of 'boost::multiprecision::detail'
             detail::is_explicitly_convertible<typename detail::canonical<V, Backend>::type, Backend>::value
                     ^~~~~~~~~~~~~~~~~~~~~~~~~
C:/msys32/mingw32/include/boost/multiprecision/number.hpp:100:21: error: 'is_explicitly_convertible' is not a member of 'boost::multiprecision::detail'
C:/msys32/mingw32/include/boost/multiprecision/number.hpp:100:100: error: template argument 1 is invalid
             detail::is_explicitly_convertible<typename detail::canonical<V, Backend>::type, Backend>::value
                                                                                                    ^
C:/msys32/mingw32/include/boost/multiprecision/number.hpp:99:85: error: invalid use of template-name 'boost::enable_if_c' without an argument list
    explicit BOOST_MP_FORCEINLINE BOOST_CONSTEXPR number(const V& v, typename boost::enable_if_c<
                                                                                     ^~~~~~~~~~~
C:/msys32/mingw32/include/boost/multiprecision/number.hpp:99:85: note: class template argument deduction is only available with -std=c++1z or -std=gnu++1z
In file included from C:/msys32/mingw32/include/boost/optional/optional.hpp:29:0,
                 from C:/msys32/home/buildbot/slave/monero-static-win32/build/src/wallet/wallet_rpc_payments.cpp:29:
C:/msys32/mingw32/include/boost/core/enable_if.hpp:33:10: note: 'template<bool B, class T> struct boost::enable_if_c' declared here
   struct enable_if_c {
          ^~~~~~~~~~~
In file included from C:/msys32/mingw32/include/boost/multiprecision/cpp_int.hpp:12:0,
                 from C:/msys32/home/buildbot/slave/monero-static-win32/build/src/cryptonote_basic/difficulty.h:36,
                 from C:/msys32/home/buildbot/slave/monero-static-win32/build/src/cryptonote_basic/cryptonote_boost_serialization.h:43,
                 from C:/msys32/home/buildbot/slave/monero-static-win32/build/src/cryptonote_basic/account_boost_serialization.h:34,
                 from C:/msys32/home/buildbot/slave/monero-static-win32/build/src/wallet/wallet2.h:46,
                 from C:/msys32/home/buildbot/slave/monero-static-win32/build/src/wallet/wallet_rpc_payments.cpp:34:
C:/msys32/mingw32/include/boost/multiprecision/number.hpp:99:96: error: expected ',' or '...' before '<' token
    explicit BOOST_MP_FORCEINLINE BOOST_CONSTEXPR number(const V& v, typename boost::enable_if_c<
                                                                                                ^
C:/msys32/mingw32/include/boost/multiprecision/number.hpp:99:50: error: 'template<class Backend, boost::multiprecision::expression_template_option ExpressionTemplates> template<class V> constexpr boost::multiprecision::number<Backend, ExpressionTemplates>::number(const V&, int)' cannot be overloaded
    explicit BOOST_MP_FORCEINLINE BOOST_CONSTEXPR number(const V& v, typename boost::enable_if_c<
                                                  ^~~~~~
C:/msys32/mingw32/include/boost/multiprecision/number.hpp:54:25: error: with 'template<class Backend, boost::multiprecision::expression_template_option ExpressionTemplates> template<class V> boost::multiprecision::number<Backend, ExpressionTemplates>::number(const V&, int)'
    BOOST_MP_FORCEINLINE number(const V& v, typename boost::enable_if_c<
                         ^~~~~~
C:/msys32/mingw32/include/boost/multiprecision/number.hpp:109:18: error: 'is_restricted_conversion' is not a member of 'boost::multiprecision::detail'
       && detail::is_restricted_conversion<typename detail::canonical<V, Backend>::type, Backend>::value
                  ^~~~~~~~~~~~~~~~~~~~~~~~
C:/msys32/mingw32/include/boost/multiprecision/number.hpp:109:18: error: 'is_restricted_conversion' is not a member of 'boost::multiprecision::detail'
C:/msys32/mingw32/include/boost/multiprecision/number.hpp:107:104: error: invalid use of template-name 'boost::enable_if_c' without an argument list
    explicit BOOST_MP_FORCEINLINE BOOST_CONSTEXPR number(const V& v, unsigned digits10, typename boost::enable_if_c<
                                                                                                        ^~~~~~~~~~~
C:/msys32/mingw32/include/boost/multiprecision/number.hpp:107:104: note: class template argument deduction is only available with -std=c++1z or -std=gnu++1z
In file included from C:/msys32/mingw32/include/boost/optional/optional.hpp:29:0,
                 from C:/msys32/home/buildbot/slave/monero-static-win32/build/src/wallet/wallet_rpc_payments.cpp:29:
C:/msys32/mingw32/include/boost/core/enable_if.hpp:33:10: note: 'template<bool B, class T> struct boost::enable_if_c' declared here
   struct enable_if_c {
          ^~~~~~~~~~~
In file included from C:/msys32/mingw32/include/boost/multiprecision/cpp_int.hpp:12:0,
                 from C:/msys32/home/buildbot/slave/monero-static-win32/build/src/cryptonote_basic/difficulty.h:36,
                 from C:/msys32/home/buildbot/slave/monero-static-win32/build/src/cryptonote_basic/cryptonote_boost_serialization.h:43,
                 from C:/msys32/home/buildbot/slave/monero-static-win32/build/src/cryptonote_basic/account_boost_serialization.h:34,
                 from C:/msys32/home/buildbot/slave/monero-static-win32/build/src/wallet/wallet2.h:46,
                 from C:/msys32/home/buildbot/slave/monero-static-win32/build/src/wallet/wallet_rpc_payments.cpp:34:
C:/msys32/mingw32/include/boost/multiprecision/number.hpp:107:115: error: expected ',' or '...' before '<' token
    explicit BOOST_MP_FORCEINLINE BOOST_CONSTEXPR number(const V& v, unsigned digits10, typename boost::enable_if_c<
                                                                                                                   ^
C:/msys32/mingw32/include/boost/multiprecision/number.hpp:107:50: error: 'template<class Backend, boost::multiprecision::expression_template_option ExpressionTemplates> template<class V> constexpr boost::multiprecision::number<Backend, ExpressionTemplates>::number(const V&, unsigned int, int)' cannot be overloaded
    explicit BOOST_MP_FORCEINLINE BOOST_CONSTEXPR number(const V& v, unsigned digits10, typename boost::enable_if_c<
                                                  ^~~~~~
C:/msys32/mingw32/include/boost/multiprecision/number.hpp:75:41: error: with 'template<class Backend, boost::multiprecision::expression_template_option ExpressionTemplates> template<class V> constexpr boost::multiprecision::number<Backend, ExpressionTemplates>::number(const V&, unsigned int, int)'
    BOOST_MP_FORCEINLINE BOOST_CONSTEXPR number(const V& v, unsigned digits10, typename boost::enable_if_c<
                                         ^~~~~~
C:/msys32/mingw32/include/boost/multiprecision/number.hpp:121:96: error: 'is_restricted_conversion' is not a member of 'boost::multiprecision::detail'
          typename boost::enable_if_c<(boost::is_convertible<Other, Backend>::value && !detail::is_restricted_conversion<Other, Backend>::value)>::type* = 0)
                                                                                                ^~~~~~~~~~~~~~~~~~~~~~~~
C:/msys32/mingw32/include/boost/multiprecision/number.hpp:121:138: error: template argument 1 is invalid
          typename boost::enable_if_c<(boost::is_convertible<Other, Backend>::value && !detail::is_restricted_conversion<Other, Backend>::value)>::type* = 0)
                                                                                                                                          ^~~~~
C:/msys32/mingw32/include/boost/multiprecision/number.hpp:121:96: error: 'is_restricted_conversion' is not a member of 'boost::multiprecision::detail'
          typename boost::enable_if_c<(boost::is_convertible<Other, Backend>::value && !detail::is_restricted_conversion<Other, Backend>::value)>::type* = 0)
                                                                                                ^~~~~~~~~~~~~~~~~~~~~~~~
C:/msys32/mingw32/include/boost/multiprecision/number.hpp:121:138: error: template argument 1 is invalid
          typename boost::enable_if_c<(boost::is_convertible<Other, Backend>::value && !detail::is_restricted_conversion<Other, Backend>::value)>::type* = 0)
                                                                                                                                          ^~~~~
C:/msys32/mingw32/include/boost/multiprecision/number.hpp:121:26: error: invalid use of template-name 'boost::enable_if_c' without an argument list
          typename boost::enable_if_c<(boost::is_convertible<Other, Backend>::value && !detail::is_restricted_conversion<Other, Backend>::value)>::type* = 0)
                          ^~~~~~~~~~~
C:/msys32/mingw32/include/boost/multiprecision/number.hpp:121:26: note: class template argument deduction is only available with -std=c++1z or -std=gnu++1z
In file included from C:/msys32/mingw32/include/boost/optional/optional.hpp:29:0,
                 from C:/msys32/home/buildbot/slave/monero-static-win32/build/src/wallet/wallet_rpc_payments.cpp:29:
C:/msys32/mingw32/include/boost/core/enable_if.hpp:33:10: note: 'template<bool B, class T> struct boost::enable_if_c' declared here
   struct enable_if_c {
          ^~~~~~~~~~~
In file included from C:/msys32/mingw32/include/boost/multiprecision/cpp_int.hpp:12:0,
                 from C:/msys32/home/buildbot/slave/monero-static-win32/build/src/cryptonote_basic/difficulty.h:36,
                 from C:/msys32/home/buildbot/slave/monero-static-win32/build/src/cryptonote_basic/cryptonote_boost_serialization.h:43,
                 from C:/msys32/home/buildbot/slave/monero-static-win32/build/src/cryptonote_basic/account_boost_serialization.h:34,
                 from C:/msys32/home/buildbot/slave/monero-static-win32/build/src/wallet/wallet2.h:46,
                 from C:/msys32/home/buildbot/slave/monero-static-win32/build/src/wallet/wallet_rpc_payments.cpp:34:
C:/msys32/mingw32/include/boost/multiprecision/number.hpp:121:37: error: expected ',' or '...' before '<' token
          typename boost::enable_if_c<(boost::is_convertible<Other, Backend>::value && !detail::is_restricted_conversion<Other, Backend>::value)>::type* = 0)
                                     ^
C:/msys32/mingw32/include/boost/multiprecision/number.hpp:127:20: error: 'is_explicitly_convertible' is not a member of 'boost::multiprecision::detail'
          (!detail::is_explicitly_convertible<Other, Backend>::value)
                    ^~~~~~~~~~~~~~~~~~~~~~~~~
C:/msys32/mingw32/include/boost/multiprecision/number.hpp:127:63: error: template argument 1 is invalid
          (!detail::is_explicitly_convertible<Other, Backend>::value)
                                                               ^~~~~
C:/msys32/mingw32/include/boost/multiprecision/number.hpp:127:20: error: 'is_explicitly_convertible' is not a member of 'boost::multiprecision::detail'
          (!detail::is_explicitly_convertible<Other, Backend>::value)
                    ^~~~~~~~~~~~~~~~~~~~~~~~~
C:/msys32/mingw32/include/boost/multiprecision/number.hpp:127:63: error: template argument 1 is invalid
          (!detail::is_explicitly_convertible<Other, Backend>::value)
                                                               ^~~~~
C:/msys32/mingw32/include/boost/multiprecision/number.hpp:126:66: error: invalid use of template-name 'boost::enable_if_c' without an argument list
    explicit number(const number<Other, ET>& val, typename boost::enable_if_c<
                                                                  ^~~~~~~~~~~
C:/msys32/mingw32/include/boost/multiprecision/number.hpp:126:66: note: class template argument deduction is only available with -std=c++1z or -std=gnu++1z
In file included from C:/msys32/mingw32/include/boost/optional/optional.hpp:29:0,
                 from C:/msys32/home/buildbot/slave/monero-static-win32/build/src/wallet/wallet_rpc_payments.cpp:29:
C:/msys32/mingw32/include/boost/core/enable_if.hpp:33:10: note: 'template<bool B, class T> struct boost::enable_if_c' declared here
   struct enable_if_c {
          ^~~~~~~~~~~
In file included from C:/msys32/mingw32/include/boost/multiprecision/cpp_int.hpp:12:0,
                 from C:/msys32/home/buildbot/slave/monero-static-win32/build/src/cryptonote_basic/difficulty.h:36,
                 from C:/msys32/home/buildbot/slave/monero-static-win32/build/src/cryptonote_basic/cryptonote_boost_serialization.h:43,
                 from C:/msys32/home/buildbot/slave/monero-static-win32/build/src/cryptonote_basic/account_boost_serialization.h:34,
                 from C:/msys32/home/buildbot/slave/monero-static-win32/build/src/wallet/wallet2.h:46,
                 from C:/msys32/home/buildbot/slave/monero-static-win32/build/src/wallet/wallet_rpc_payments.cpp:34:
C:/msys32/mingw32/include/boost/multiprecision/number.hpp:126:77: error: expected ',' or '...' before '<' token
    explicit number(const number<Other, ET>& val, typename boost::enable_if_c<
                                                                             ^
C:/msys32/mingw32/include/boost/multiprecision/number.hpp:126:13: error: 'template<class Backend, boost::multiprecision::expression_template_option ExpressionTemplates> template<class Other, boost::multiprecision::expression_template_option ET> boost::multiprecision::number<Backend, ExpressionTemplates>::number(const boost::multiprecision::number<Other, ET>&, int)' cannot be overloaded
    explicit number(const number<Other, ET>& val, typename boost::enable_if_c<
             ^~~~~~
C:/msys32/mingw32/include/boost/multiprecision/number.hpp:120:25: error: with 'template<class Backend, boost::multiprecision::expression_template_option ExpressionTemplates> template<class Other, boost::multiprecision::expression_template_option ET> boost::multiprecision::number<Backend, ExpressionTemplates>::number(const boost::multiprecision::number<Other, ET>&, int)'
    BOOST_MP_FORCEINLINE number(const number<Other, ET>& val,
                         ^~~~~~
C:/msys32/mingw32/include/boost/multiprecision/number.hpp:139:19: error: 'is_explicitly_convertible' is not a member of 'boost::multiprecision::detail'
          (detail::is_explicitly_convertible<Other, Backend>::value
                   ^~~~~~~~~~~~~~~~~~~~~~~~~
C:/msys32/mingw32/include/boost/multiprecision/number.hpp:140:121: error: template argument 1 is invalid
             && (detail::is_restricted_conversion<Other, Backend>::value || !boost::is_convertible<Other, Backend>::value))
                                                                                                                         ^
C:/msys32/mingw32/include/boost/multiprecision/number.hpp:139:19: error: 'is_explicitly_convertible' is not a member of 'boost::multiprecision::detail'
          (detail::is_explicitly_convertible<Other, Backend>::value
                   ^~~~~~~~~~~~~~~~~~~~~~~~~
C:/msys32/mingw32/include/boost/multiprecision/number.hpp:140:121: error: template argument 1 is invalid
             && (detail::is_restricted_conversion<Other, Backend>::value || !boost::is_convertible<Other, Backend>::value))
                                                                                                                         ^
C:/msys32/mingw32/include/boost/multiprecision/number.hpp:138:87: error: invalid use of template-name 'boost::enable_if_c' without an argument list
    explicit BOOST_MP_FORCEINLINE number(const number<Other, ET>& val, typename boost::enable_if_c<
                                                                                       ^~~~~~~~~~~
C:/msys32/mingw32/include/boost/multiprecision/number.hpp:138:87: note: class template argument deduction is only available with -std=c++1z or -std=gnu++1z
In file included from C:/msys32/mingw32/include/boost/optional/optional.hpp:29:0,
                 from C:/msys32/home/buildbot/slave/monero-static-win32/build/src/wallet/wallet_rpc_payments.cpp:29:
C:/msys32/mingw32/include/boost/core/enable_if.hpp:33:10: note: 'template<bool B, class T> struct boost::enable_if_c' declared here
   struct enable_if_c {
          ^~~~~~~~~~~
In file included from C:/msys32/mingw32/include/boost/multiprecision/cpp_int.hpp:12:0,
                 from C:/msys32/home/buildbot/slave/monero-static-win32/build/src/cryptonote_basic/difficulty.h:36,
                 from C:/msys32/home/buildbot/slave/monero-static-win32/build/src/cryptonote_basic/cryptonote_boost_serialization.h:43,
                 from C:/msys32/home/buildbot/slave/monero-static-win32/build/src/cryptonote_basic/account_boost_serialization.h:34,
                 from C:/msys32/home/buildbot/slave/monero-static-win32/build/src/wallet/wallet2.h:46,
                 from C:/msys32/home/buildbot/slave/monero-static-win32/build/src/wallet/wallet_rpc_payments.cpp:34:
C:/msys32/mingw32/include/boost/multiprecision/number.hpp:138:98: error: expected ',' or '...' before '<' token
    explicit BOOST_MP_FORCEINLINE number(const number<Other, ET>& val, typename boost::enable_if_c<
                                                                                                  ^
C:/msys32/mingw32/include/boost/multiprecision/number.hpp:138:34: error: 'template<class Backend, boost::multiprecision::expression_template_option ExpressionTemplates> template<class Other, boost::multiprecision::expression_template_option ET> boost::multiprecision::number<Backend, ExpressionTemplates>::number(const boost::multiprecision::number<Other, ET>&, int)' cannot be overloaded
    explicit BOOST_MP_FORCEINLINE number(const number<Other, ET>& val, typename boost::enable_if_c<
                                  ^~~~~~
C:/msys32/mingw32/include/boost/multiprecision/number.hpp:120:25: error: with 'template<class Backend, boost::multiprecision::expression_template_option ExpressionTemplates> template<class Other, boost::multiprecision::expression_template_option ET> boost::multiprecision::number<Backend, ExpressionTemplates>::number(const boost::multiprecision::number<Other, ET>&, int)'
    BOOST_MP_FORCEINLINE number(const number<Other, ET>& val,
                         ^~~~~~
In file included from C:/msys32/mingw32/include/boost/multiprecision/cpp_int.hpp:12:0,
                 from C:/msys32/home/buildbot/slave/monero-static-win32/build/src/cryptonote_basic/difficulty.h:36,
                 from C:/msys32/home/buildbot/slave/monero-static-win32/build/src/cryptonote_basic/cryptonote_boost_serialization.h:43,
                 from C:/msys32/home/buildbot/slave/monero-static-win32/build/src/cryptonote_basic/account_boost_serialization.h:34,
                 from C:/msys32/home/buildbot/slave/monero-static-win32/build/src/wallet/wallet2.h:46,
                 from C:/msys32/home/buildbot/slave/monero-static-win32/build/src/wallet/wallet_rpc_payments.cpp:34:
C:/msys32/mingw32/include/boost/multiprecision/number.hpp:290:62: error: 'is_explicitly_convertible' is not a member of 'boost::multiprecision::detail'
    typename boost::disable_if<boost::multiprecision::detail::is_explicitly_convertible<Other, Backend>, number<Backend, ExpressionTemplates>& >::type
                                                              ^~~~~~~~~~~~~~~~~~~~~~~~~
C:/msys32/mingw32/include/boost/multiprecision/number.hpp:290:62: error: 'is_explicitly_convertible' is not a member of 'boost::multiprecision::detail'
C:/msys32/mingw32/include/boost/multiprecision/number.hpp:290:102: error: template argument 1 is invalid
    typename boost::disable_if<boost::multiprecision::detail::is_explicitly_convertible<Other, Backend>, number<Backend, ExpressionTemplates>& >::type
                                                                                                      ^
C:/msys32/mingw32/include/boost/multiprecision/number.hpp:290:103: error: expected identifier before ',' token
    typename boost::disable_if<boost::multiprecision::detail::is_explicitly_convertible<Other, Backend>, number<Backend, ExpressionTemplates>& >::type
                                                                                                       ^
C:/msys32/mingw32/include/boost/multiprecision/number.hpp:290:103: error: expected unqualified-id before ',' token
C:/msys32/mingw32/include/boost/multiprecision/number.hpp:341:41: error: 'is_explicitly_convertible' is not a member of 'boost::multiprecision::detail'
       && boost::multiprecision::detail::is_explicitly_convertible<typename detail::expression<tag, Arg1, Arg2, Arg3, Arg4>::result_type, self_type>::value>::type* = 0)
                                         ^~~~~~~~~~~~~~~~~~~~~~~~~
C:/msys32/mingw32/include/boost/multiprecision/number.hpp:341:41: error: 'is_explicitly_convertible' is not a member of 'boost::multiprecision::detail'
C:/msys32/mingw32/include/boost/multiprecision/number.hpp:340:23: error: invalid use of template-name 'boost::enable_if_c' without an argument list
       typename boost::enable_if_c<!is_convertible<typename detail::expression<tag, Arg1, Arg2, Arg3, Arg4>::result_type, self_type>::value
                       ^~~~~~~~~~~
C:/msys32/mingw32/include/boost/multiprecision/number.hpp:340:23: note: class template argument deduction is only available with -std=c++1z or -std=gnu++1z
In file included from C:/msys32/mingw32/include/boost/optional/optional.hpp:29:0,
                 from C:/msys32/home/buildbot/slave/monero-static-win32/build/src/wallet/wallet_rpc_payments.cpp:29:
C:/msys32/mingw32/include/boost/core/enable_if.hpp:33:10: note: 'template<bool B, class T> struct boost::enable_if_c' declared here
   struct enable_if_c {
          ^~~~~~~~~~~
In file included from C:/msys32/mingw32/include/boost/multiprecision/cpp_int.hpp:12:0,
                 from C:/msys32/home/buildbot/slave/monero-static-win32/build/src/cryptonote_basic/difficulty.h:36,
                 from C:/msys32/home/buildbot/slave/monero-static-win32/build/src/cryptonote_basic/cryptonote_boost_serialization.h:43,
                 from C:/msys32/home/buildbot/slave/monero-static-win32/build/src/cryptonote_basic/account_boost_serialization.h:34,
                 from C:/msys32/home/buildbot/slave/monero-static-win32/build/src/wallet/wallet2.h:46,
                 from C:/msys32/home/buildbot/slave/monero-static-win32/build/src/wallet/wallet_rpc_payments.cpp:34:
C:/msys32/mingw32/include/boost/multiprecision/number.hpp:340:34: error: expected ',' or '...' before '<' token
       typename boost::enable_if_c<!is_convertible<typename detail::expression<tag, Arg1, Arg2, Arg3, Arg4>::result_type, self_type>::value
                                  ^
In file included from C:/msys32/mingw32/include/boost/multiprecision/cpp_int.hpp:20:0,
                 from C:/msys32/home/buildbot/slave/monero-static-win32/build/src/cryptonote_basic/difficulty.h:36,
                 from C:/msys32/home/buildbot/slave/monero-static-win32/build/src/cryptonote_basic/cryptonote_boost_serialization.h:43,
                 from C:/msys32/home/buildbot/slave/monero-static-win32/build/src/cryptonote_basic/account_boost_serialization.h:34,
                 from C:/msys32/home/buildbot/slave/monero-static-win32/build/src/wallet/wallet2.h:46,
                 from C:/msys32/home/buildbot/slave/monero-static-win32/build/src/wallet/wallet_rpc_payments.cpp:34:
C:/msys32/mingw32/include/boost/multiprecision/rational_adaptor.hpp:51:41: error: 'is_explicitly_convertible' is not a member of 'boost::multiprecision::detail'
          boost::multiprecision::detail::is_explicitly_convertible<U, IntBackend>::value && !is_convertible<U, IntBackend>::value
                                         ^~~~~~~~~~~~~~~~~~~~~~~~~
C:/msys32/mingw32/include/boost/multiprecision/rational_adaptor.hpp:51:41: error: 'is_explicitly_convertible' is not a member of 'boost::multiprecision::detail'
C:/msys32/mingw32/include/boost/multiprecision/rational_adaptor.hpp:51:80: error: template argument 1 is invalid
          boost::multiprecision::detail::is_explicitly_convertible<U, IntBackend>::value && !is_convertible<U, IntBackend>::value
                                                                                ^
C:/msys32/mingw32/include/boost/multiprecision/rational_adaptor.hpp:50:16: error: expected nested-name-specifier before 'enable_if_c'
       typename enable_if_c<
                ^~~~~~~~~~~
C:/msys32/mingw32/include/boost/multiprecision/rational_adaptor.hpp:51:41: error: 'is_explicitly_convertible' is not a member of 'boost::multiprecision::detail'
          boost::multiprecision::detail::is_explicitly_convertible<U, IntBackend>::value && !is_convertible<U, IntBackend>::value
                                         ^~~~~~~~~~~~~~~~~~~~~~~~~
C:/msys32/mingw32/include/boost/multiprecision/rational_adaptor.hpp:51:41: error: 'is_explicitly_convertible' is not a member of 'boost::multiprecision::detail'
C:/msys32/mingw32/include/boost/multiprecision/rational_adaptor.hpp:51:80: error: template argument 1 is invalid
          boost::multiprecision::detail::is_explicitly_convertible<U, IntBackend>::value && !is_convertible<U, IntBackend>::value
                                                                                ^
C:/msys32/mingw32/include/boost/multiprecision/rational_adaptor.hpp:51:41: error: 'is_explicitly_convertible' is not a member of 'boost::multiprecision::detail'
          boost::multiprecision::detail::is_explicitly_convertible<U, IntBackend>::value && !is_convertible<U, IntBackend>::value
                                         ^~~~~~~~~~~~~~~~~~~~~~~~~
C:/msys32/mingw32/include/boost/multiprecision/rational_adaptor.hpp:51:41: error: 'is_explicitly_convertible' is not a member of 'boost::multiprecision::detail'
C:/msys32/mingw32/include/boost/multiprecision/rational_adaptor.hpp:51:80: error: template argument 1 is invalid
          boost::multiprecision::detail::is_explicitly_convertible<U, IntBackend>::value && !is_convertible<U, IntBackend>::value
                                                                                ^
C:/msys32/mingw32/include/boost/multiprecision/rational_adaptor.hpp:51:41: error: 'is_explicitly_convertible' is not a member of 'boost::multiprecision::detail'
          boost::multiprecision::detail::is_explicitly_convertible<U, IntBackend>::value && !is_convertible<U, IntBackend>::value
                                         ^~~~~~~~~~~~~~~~~~~~~~~~~
C:/msys32/mingw32/include/boost/multiprecision/rational_adaptor.hpp:51:41: error: 'is_explicitly_convertible' is not a member of 'boost::multiprecision::detail'
C:/msys32/mingw32/include/boost/multiprecision/rational_adaptor.hpp:51:80: error: template argument 1 is invalid
          boost::multiprecision::detail::is_explicitly_convertible<U, IntBackend>::value && !is_convertible<U, IntBackend>::value
                                                                                ^
C:/msys32/mingw32/include/boost/multiprecision/rational_adaptor.hpp:50:27: error: expected ',' or '...' before '<' token
       typename enable_if_c<
                           ^
C:/msys32/mingw32/include/boost/multiprecision/rational_adaptor.hpp:55:57: error: 'is_explicitly_convertible' is not a member of 'boost::multiprecision::detail'
    typename enable_if_c<(boost::multiprecision::detail::is_explicitly_convertible<U, IntBackend>::value && !is_arithmetic<U>::value), rational_adaptor&>::type operator = (const U& u)
                                                         ^~~~~~~~~~~~~~~~~~~~~~~~~
C:/msys32/mingw32/include/boost/multiprecision/rational_adaptor.hpp:55:127: error: template argument 1 is invalid
    typename enable_if_c<(boost::multiprecision::detail::is_explicitly_convertible<U, IntBackend>::value && !is_arithmetic<U>::value), rational_adaptor&>::type operator = (const U& u)
                                                                                                                               ^~~~~
C:/msys32/mingw32/include/boost/multiprecision/rational_adaptor.hpp:55:13: error: expected nested-name-specifier
    typename enable_if_c<(boost::multiprecision::detail::is_explicitly_convertible<U, IntBackend>::value && !is_arithmetic<U>::value), rational_adaptor&>::type operator = (const U& u)
             ^~~~~~~~~~~~~~~~~~~~~~~~~~~~~~~~~~~~~~~~~~~~~~~~~~~~~~~~~~~~~~~~~~~~~~~~~~~~~~~~~~~~~~~~~~~~~~~~~~~~~~~~~~~~~~~~~~~~~~~
In file included from C:/msys32/mingw32/include/boost/multiprecision/cpp_int.hpp:1978:0,
                 from C:/msys32/home/buildbot/slave/monero-static-win32/build/src/cryptonote_basic/difficulty.h:36,
                 from C:/msys32/home/buildbot/slave/monero-static-win32/build/src/cryptonote_basic/cryptonote_boost_serialization.h:43,
                 from C:/msys32/home/buildbot/slave/monero-static-win32/build/src/cryptonote_basic/account_boost_serialization.h:34,
                 from C:/msys32/home/buildbot/slave/monero-static-win32/build/src/wallet/wallet2.h:46,
                 from C:/msys32/home/buildbot/slave/monero-static-win32/build/src/wallet/wallet_rpc_payments.cpp:34:
C:/msys32/mingw32/include/boost/multiprecision/cpp_int/misc.hpp: In function 'typename boost::enable_if_c<boost::is_integral<U>::value>::type boost::multiprecision::backends::eval_qr(const boost::multiprecision::backends::cpp_int_backend<MinBits, MaxBits, SignType, Checked, Allocator>&, U, boost::multiprecision::backends::cpp_int_backend<MinBits, MaxBits, SignType, Checked, Allocator>&, boost::multiprecision::backends::cpp_int_backend<MinBits, MaxBits, SignType, Checked, Allocator>&)':
C:/msys32/mingw32/include/boost/multiprecision/cpp_int/misc.hpp:330:23: error: 'boost::multiprecision::default_ops::eval_qr' has not been declared
    using default_ops::eval_qr;
                       ^~~~~~~
C:/msys32/mingw32/include/boost/multiprecision/cpp_int/misc.hpp: In function 'typename boost::enable_if_c<(boost::is_unsigned<UI>::value && (! boost::multiprecision::backends::is_trivial_cpp_int<boost::multiprecision::backends::cpp_int_backend<MinBits, MaxBits, SignType, Checked, Allocator> >::value)), Integer>::type boost::multiprecision::backends::eval_integer_modulus(const boost::multiprecision::backends::cpp_int_backend<MinBits, MaxBits, SignType, Checked, Allocator>&, Integer)':
C:/msys32/mingw32/include/boost/multiprecision/cpp_int/misc.hpp:348:27: error: 'eval_integer_modulus' is not a member of 'boost::multiprecision::default_ops'
       return default_ops::eval_integer_modulus(x, val);
                           ^~~~~~~~~~~~~~~~~~~~
C:/msys32/mingw32/include/boost/multiprecision/cpp_int/misc.hpp:348:27: note: suggested alternative: 'eval_integer_sqrt'
       return default_ops::eval_integer_modulus(x, val);
                           ^~~~~~~~~~~~~~~~~~~~
                           eval_integer_sqrt
In file included from C:/msys32/home/buildbot/slave/monero-static-win32/build/src/cryptonote_basic/account_boost_serialization.h:34:0,
                 from C:/msys32/home/buildbot/slave/monero-static-win32/build/src/wallet/wallet2.h:46,
                 from C:/msys32/home/buildbot/slave/monero-static-win32/build/src/wallet/wallet_rpc_payments.cpp:34:
C:/msys32/home/buildbot/slave/monero-static-win32/build/src/cryptonote_basic/cryptonote_boost_serialization.h: In function 'void boost::serialization::serialize(Archive&, cryptonote::difficulty_type&, boost::serialization::version_type)':
C:/msys32/home/buildbot/slave/monero-static-win32/build/src/cryptonote_basic/cryptonote_boost_serialization.h:361:13: error: no match for 'operator<<' (operand types are 'cryptonote::difficulty_type {aka boost::multiprecision::number<boost::multiprecision::backends::cpp_int_backend<128, 128, (boost::multiprecision::cpp_integer_type)0, (boost::multiprecision::cpp_int_check_type)0, void> >}' and 'int')
       x = x << 64;
           ~~^~~~~
C:/msys32/home/buildbot/slave/monero-static-win32/build/src/cryptonote_basic/cryptonote_boost_serialization.h:361:13: note: candidate: operator<<(int, int) <built-in>
C:/msys32/home/buildbot/slave/monero-static-win32/build/src/cryptonote_basic/cryptonote_boost_serialization.h:361:13: note:   no known conversion for argument 1 from 'cryptonote::difficulty_type {aka boost::multiprecision::number<boost::multiprecision::backends::cpp_int_backend<128, 128, (boost::multiprecision::cpp_integer_type)0, (boost::multiprecision::cpp_int_check_type)0, void> >}' to 'int'
In file included from C:/msys32/mingw32/include/boost/multiprecision/rational_adaptor.hpp:19:0,
                 from C:/msys32/mingw32/include/boost/multiprecision/cpp_int.hpp:20,
                 from C:/msys32/home/buildbot/slave/monero-static-win32/build/src/cryptonote_basic/difficulty.h:36,
                 from C:/msys32/home/buildbot/slave/monero-static-win32/build/src/cryptonote_basic/cryptonote_boost_serialization.h:43,
                 from C:/msys32/home/buildbot/slave/monero-static-win32/build/src/cryptonote_basic/account_boost_serialization.h:34,
                 from C:/msys32/home/buildbot/slave/monero-static-win32/build/src/wallet/wallet2.h:46,
                 from C:/msys32/home/buildbot/slave/monero-static-win32/build/src/wallet/wallet_rpc_payments.cpp:34:
C:/msys32/mingw32/include/boost/rational.hpp:943:15: note: candidate: template<class IntType> std::ostream& boost::operator<<(std::ostream&, const boost::rational<I>&)
 std::ostream& operator<< (std::ostream& os, const rational<IntType>& r)
               ^~~~~~~~
C:/msys32/mingw32/include/boost/rational.hpp:943:15: note:   template argument deduction/substitution failed:
In file included from C:/msys32/home/buildbot/slave/monero-static-win32/build/src/cryptonote_basic/account_boost_serialization.h:34:0,
                 from C:/msys32/home/buildbot/slave/monero-static-win32/build/src/wallet/wallet2.h:46,
                 from C:/msys32/home/buildbot/slave/monero-static-win32/build/src/wallet/wallet_rpc_payments.cpp:34:
C:/msys32/home/buildbot/slave/monero-static-win32/build/src/cryptonote_basic/cryptonote_boost_serialization.h:361:16: note:   mismatched types 'const boost::rational<I>' and 'int'
       x = x << 64;
                ^~
In file included from C:/msys32/mingw32/include/boost/exception/detail/exception_ptr.hpp:14:0,
                 from C:/msys32/mingw32/include/boost/exception_ptr.hpp:9,
                 from C:/msys32/mingw32/include/boost/thread/exceptional_ptr.hpp:10,
                 from C:/msys32/mingw32/include/boost/thread/future.hpp:34,
                 from C:/msys32/mingw32/include/boost/thread.hpp:24,
                 from C:/msys32/home/buildbot/slave/monero-static-win32/build/contrib/epee/include/misc_language.h:32,
                 from C:/msys32/home/buildbot/slave/monero-static-win32/build/src/cryptonote_basic/cryptonote_basic.h:49,
                 from C:/msys32/home/buildbot/slave/monero-static-win32/build/src/cryptonote_basic/account.h:33,
                 from C:/msys32/home/buildbot/slave/monero-static-win32/build/src/wallet/wallet2.h:45,
                 from C:/msys32/home/buildbot/slave/monero-static-win32/build/src/wallet/wallet_rpc_payments.cpp:34:
C:/msys32/mingw32/include/boost/exception/info.hpp:267:5: note: candidate: template<class E, class Tag, class T> typename boost::enable_if<boost::exception_detail::derives_boost_exception<E>, const E&>::type boost::operator<<(const E&, boost::error_info<Tag, T>&&)
     operator<<( E const & x, error_info<Tag,T> && v )
     ^~~~~~~~
C:/msys32/mingw32/include/boost/exception/info.hpp:267:5: note:   template argument deduction/substitution failed:
In file included from C:/msys32/home/buildbot/slave/monero-static-win32/build/src/cryptonote_basic/account_boost_serialization.h:34:0,
                 from C:/msys32/home/buildbot/slave/monero-static-win32/build/src/wallet/wallet2.h:46,
                 from C:/msys32/home/buildbot/slave/monero-static-win32/build/src/wallet/wallet_rpc_payments.cpp:34:
C:/msys32/home/buildbot/slave/monero-static-win32/build/src/cryptonote_basic/cryptonote_boost_serialization.h:361:16: note:   mismatched types 'boost::error_info<Tag, T>' and 'int'
       x = x << 64;
                ^~
In file included from C:/msys32/mingw32/include/boost/exception/detail/exception_ptr.hpp:14:0,
                 from C:/msys32/mingw32/include/boost/exception_ptr.hpp:9,
                 from C:/msys32/mingw32/include/boost/thread/exceptional_ptr.hpp:10,
                 from C:/msys32/mingw32/include/boost/thread/future.hpp:34,
                 from C:/msys32/mingw32/include/boost/thread.hpp:24,
                 from C:/msys32/home/buildbot/slave/monero-static-win32/build/contrib/epee/include/misc_language.h:32,
                 from C:/msys32/home/buildbot/slave/monero-static-win32/build/src/cryptonote_basic/cryptonote_basic.h:49,
                 from C:/msys32/home/buildbot/slave/monero-static-win32/build/src/cryptonote_basic/account.h:33,
                 from C:/msys32/home/buildbot/slave/monero-static-win32/build/src/wallet/wallet2.h:45,
                 from C:/msys32/home/buildbot/slave/monero-static-win32/build/src/wallet/wallet_rpc_payments.cpp:34:
C:/msys32/mingw32/include/boost/exception/info.hpp:258:5: note: candidate: template<class E, class Tag, class T> typename boost::enable_if<boost::exception_detail::derives_boost_exception<E>, const E&>::type boost::operator<<(const E&, const boost::error_info<Tag, T>&)
     operator<<( E const & x, error_info<Tag,T> const & v )
     ^~~~~~~~
C:/msys32/mingw32/include/boost/exception/info.hpp:258:5: note:   template argument deduction/substitution failed:
In file included from C:/msys32/home/buildbot/slave/monero-static-win32/build/src/cryptonote_basic/account_boost_serialization.h:34:0,
                 from C:/msys32/home/buildbot/slave/monero-static-win32/build/src/wallet/wallet2.h:46,
                 from C:/msys32/home/buildbot/slave/monero-static-win32/build/src/wallet/wallet_rpc_payments.cpp:34:
C:/msys32/home/buildbot/slave/monero-static-win32/build/src/cryptonote_basic/cryptonote_boost_serialization.h:361:16: note:   mismatched types 'const boost::error_info<Tag, T>' and 'int'
       x = x << 64;
                ^~
In file included from C:/msys32/mingw32/include/boost/intrusive_ptr.hpp:16:0,
                 from C:/msys32/mingw32/include/boost/thread/win32/thread_data.hpp:17,
                 from C:/msys32/mingw32/include/boost/thread/thread_only.hpp:15,
                 from C:/msys32/mingw32/include/boost/thread/thread.hpp:12,
                 from C:/msys32/mingw32/include/boost/thread.hpp:13,
                 from C:/msys32/home/buildbot/slave/monero-static-win32/build/contrib/epee/include/misc_language.h:32,
                 from C:/msys32/home/buildbot/slave/monero-static-win32/build/src/cryptonote_basic/cryptonote_basic.h:49,
                 from C:/msys32/home/buildbot/slave/monero-static-win32/build/src/cryptonote_basic/account.h:33,
                 from C:/msys32/home/buildbot/slave/monero-static-win32/build/src/wallet/wallet2.h:45,
                 from C:/msys32/home/buildbot/slave/monero-static-win32/build/src/wallet/wallet_rpc_payments.cpp:34:
C:/msys32/mingw32/include/boost/smart_ptr/intrusive_ptr.hpp:337:64: note: candidate: template<class E, class T, class Y> std::basic_ostream<_CharT, _Traits>& boost::operator<<(std::basic_ostream<_CharT, _Traits>&, const boost::intrusive_ptr<Y>&)
 template<class E, class T, class Y> std::basic_ostream<E, T> & operator<< (std::basic_ostream<E, T> & os, intrusive_ptr<Y> const & p)
                                                                ^~~~~~~~
C:/msys32/mingw32/include/boost/smart_ptr/intrusive_ptr.hpp:337:64: note:   template argument deduction/substitution failed:
In file included from C:/msys32/home/buildbot/slave/monero-static-win32/build/src/cryptonote_basic/account_boost_serialization.h:34:0,
                 from C:/msys32/home/buildbot/slave/monero-static-win32/build/src/wallet/wallet2.h:46,
                 from C:/msys32/home/buildbot/slave/monero-static-win32/build/src/wallet/wallet_rpc_payments.cpp:34:
C:/msys32/home/buildbot/slave/monero-static-win32/build/src/cryptonote_basic/cryptonote_boost_serialization.h:361:16: note:   'cryptonote::difficulty_type {aka boost::multiprecision::number<boost::multiprecision::backends::cpp_int_backend<128, 128, (boost::multiprecision::cpp_integer_type)0, (boost::multiprecision::cpp_int_check_type)0, void> >}' is not derived from 'std::basic_ostream<_CharT, _Traits>'
       x = x << 64;
                ^~
In file included from C:/msys32/home/buildbot/slave/monero-static-win32/build/contrib/epee/include/hex.h:35:0,
                 from C:/msys32/home/buildbot/slave/monero-static-win32/build/src/crypto/hash.h:38,
                 from C:/msys32/home/buildbot/slave/monero-static-win32/build/src/crypto/chacha.h:44,
                 from C:/msys32/home/buildbot/slave/monero-static-win32/build/src/serialization/crypto.h:37,
                 from C:/msys32/home/buildbot/slave/monero-static-win32/build/src/cryptonote_basic/cryptonote_basic.h:44,
                 from C:/msys32/home/buildbot/slave/monero-static-win32/build/src/cryptonote_basic/account.h:33,
                 from C:/msys32/home/buildbot/slave/monero-static-win32/build/src/wallet/wallet2.h:45,
                 from C:/msys32/home/buildbot/slave/monero-static-win32/build/src/wallet/wallet_rpc_payments.cpp:34:
C:/msys32/mingw32/include/boost/utility/string_ref.hpp:459:5: note: candidate: template<class charT, class traits> std::basic_ostream<_CharT, _Traits>& boost::operator<<(std::basic_ostream<_CharT, _Traits>&, const boost::basic_string_ref<charT, traits>&)
     operator<<(std::basic_ostream<charT, traits>& os, const basic_string_ref<charT,traits>& str) {
     ^~~~~~~~
C:/msys32/mingw32/include/boost/utility/string_ref.hpp:459:5: note:   template argument deduction/substitution failed:
In file included from C:/msys32/home/buildbot/slave/monero-static-win32/build/src/cryptonote_basic/account_boost_serialization.h:34:0,
                 from C:/msys32/home/buildbot/slave/monero-static-win32/build/src/wallet/wallet2.h:46,
                 from C:/msys32/home/buildbot/slave/monero-static-win32/build/src/wallet/wallet_rpc_payments.cpp:34:
C:/msys32/home/buildbot/slave/monero-static-win32/build/src/cryptonote_basic/cryptonote_boost_serialization.h:361:16: note:   'cryptonote::difficulty_type {aka boost::multiprecision::number<boost::multiprecision::backends::cpp_int_backend<128, 128, (boost::multiprecision::cpp_integer_type)0, (boost::multiprecision::cpp_int_check_type)0, void> >}' is not derived from 'std::basic_ostream<_CharT, _Traits>'
       x = x << 64;
                ^~
In file included from C:/msys32/mingw32/include/boost/variant/variant.hpp:2580:0,
                 from C:/msys32/mingw32/include/boost/variant.hpp:17,
                 from C:/msys32/home/buildbot/slave/monero-static-win32/build/src/cryptonote_basic/cryptonote_basic.h:33,
                 from C:/msys32/home/buildbot/slave/monero-static-win32/build/src/cryptonote_basic/account.h:33,
                 from C:/msys32/home/buildbot/slave/monero-static-win32/build/src/wallet/wallet2.h:45,
                 from C:/msys32/home/buildbot/slave/monero-static-win32/build/src/wallet/wallet_rpc_payments.cpp:34:
C:/msys32/mingw32/include/boost/variant/detail/variant_io.hpp:79:46: note: candidate: template<class E, class T, class U0, class ... UN> std::basic_ostream<_CharT, _Traits>& boost::operator<<(std::basic_ostream<_CharT, _Traits>&, const boost::variant<U0, UN ...>&)
 inline BOOST_TEMPLATED_STREAM(ostream, E,T)& operator<<(
                                              ^~~~~~~~
C:/msys32/mingw32/include/boost/variant/detail/variant_io.hpp:79:46: note:   template argument deduction/substitution failed:
In file included from C:/msys32/home/buildbot/slave/monero-static-win32/build/src/cryptonote_basic/account_boost_serialization.h:34:0,
                 from C:/msys32/home/buildbot/slave/monero-static-win32/build/src/wallet/wallet2.h:46,
                 from C:/msys32/home/buildbot/slave/monero-static-win32/build/src/wallet/wallet_rpc_payments.cpp:34:
C:/msys32/home/buildbot/slave/monero-static-win32/build/src/cryptonote_basic/cryptonote_boost_serialization.h:361:16: note:   'cryptonote::difficulty_type {aka boost::multiprecision::number<boost::multiprecision::backends::cpp_int_backend<128, 128, (boost::multiprecision::cpp_integer_type)0, (boost::multiprecision::cpp_int_check_type)0, void> >}' is not derived from 'std::basic_ostream<_CharT, _Traits>'
       x = x << 64;
                ^~
In file included from C:/msys32/mingw32/include/boost/variant/variant.hpp:42:0,
                 from C:/msys32/mingw32/include/boost/variant.hpp:17,
                 from C:/msys32/home/buildbot/slave/monero-static-win32/build/src/cryptonote_basic/cryptonote_basic.h:33,
                 from C:/msys32/home/buildbot/slave/monero-static-win32/build/src/cryptonote_basic/account.h:33,
                 from C:/msys32/home/buildbot/slave/monero-static-win32/build/src/wallet/wallet2.h:45,
                 from C:/msys32/home/buildbot/slave/monero-static-win32/build/src/wallet/wallet_rpc_payments.cpp:34:
C:/msys32/mingw32/include/boost/blank.hpp:93:46: note: candidate: template<class E, class T> std::basic_ostream<_CharT, _Traits>& boost::operator<<(std::basic_ostream<_CharT, _Traits>&, const boost::blank&)
 inline BOOST_TEMPLATED_STREAM(ostream, E,T)& operator<<(
                                              ^~~~~~~~
C:/msys32/mingw32/include/boost/blank.hpp:93:46: note:   template argument deduction/substitution failed:
In file included from C:/msys32/home/buildbot/slave/monero-static-win32/build/src/cryptonote_basic/account_boost_serialization.h:34:0,
                 from C:/msys32/home/buildbot/slave/monero-static-win32/build/src/wallet/wallet2.h:46,
                 from C:/msys32/home/buildbot/slave/monero-static-win32/build/src/wallet/wallet_rpc_payments.cpp:34:
C:/msys32/home/buildbot/slave/monero-static-win32/build/src/cryptonote_basic/cryptonote_boost_serialization.h:361:16: note:   'cryptonote::difficulty_type {aka boost::multiprecision::number<boost::multiprecision::backends::cpp_int_backend<128, 128, (boost::multiprecision::cpp_integer_type)0, (boost::multiprecision::cpp_int_check_type)0, void> >}' is not derived from 'std::basic_ostream<_CharT, _Traits>'
       x = x << 64;
                ^~
In file included from C:/msys32/mingw32/include/boost/shared_ptr.hpp:17:0,
                 from C:/msys32/mingw32/include/boost/program_options/options_description.hpp:16,
                 from C:/msys32/home/buildbot/slave/monero-static-win32/build/src/wallet/wallet2.h:35,
                 from C:/msys32/home/buildbot/slave/monero-static-win32/build/src/wallet/wallet_rpc_payments.cpp:34:
C:/msys32/mingw32/include/boost/smart_ptr/shared_ptr.hpp:991:64: note: candidate: template<class E, class T, class Y> std::basic_ostream<_CharT, _Traits>& boost::operator<<(std::basic_ostream<_CharT, _Traits>&, const boost::shared_ptr<Y>&)
 template<class E, class T, class Y> std::basic_ostream<E, T> & operator<< (std::basic_ostream<E, T> & os, shared_ptr<Y> const & p)
                                                                ^~~~~~~~
C:/msys32/mingw32/include/boost/smart_ptr/shared_ptr.hpp:991:64: note:   template argument deduction/substitution failed:
In file included from C:/msys32/home/buildbot/slave/monero-static-win32/build/src/cryptonote_basic/account_boost_serialization.h:34:0,
                 from C:/msys32/home/buildbot/slave/monero-static-win32/build/src/wallet/wallet2.h:46,
                 from C:/msys32/home/buildbot/slave/monero-static-win32/build/src/wallet/wallet_rpc_payments.cpp:34:
C:/msys32/home/buildbot/slave/monero-static-win32/build/src/cryptonote_basic/cryptonote_boost_serialization.h:361:16: note:   'cryptonote::difficulty_type {aka boost::multiprecision::number<boost::multiprecision::backends::cpp_int_backend<128, 128, (boost::multiprecision::cpp_integer_type)0, (boost::multiprecision::cpp_int_check_type)0, void> >}' is not derived from 'std::basic_ostream<_CharT, _Traits>'
       x = x << 64;
                ^~
In file included from C:/msys32/home/buildbot/slave/monero-static-win32/build/src/wallet/wallet_rpc_payments.cpp:29:0:
C:/msys32/mingw32/include/boost/optional/optional.hpp:1589:1: note: candidate: template<class CharType, class CharTrait> std::basic_ostream<_CharT, _Traits>& boost::operator<<(std::basic_ostream<_CharT, _Traits>&, const boost::optional_detail::optional_tag&)
 operator<<(std::basic_ostream<CharType, CharTrait>& os, optional_detail::optional_tag const&)
 ^~~~~~~~
C:/msys32/mingw32/include/boost/optional/optional.hpp:1589:1: note:   template argument deduction/substitution failed:
In file included from C:/msys32/home/buildbot/slave/monero-static-win32/build/src/cryptonote_basic/account_boost_serialization.h:34:0,
                 from C:/msys32/home/buildbot/slave/monero-static-win32/build/src/wallet/wallet2.h:46,
                 from C:/msys32/home/buildbot/slave/monero-static-win32/build/src/wallet/wallet_rpc_payments.cpp:34:
C:/msys32/home/buildbot/slave/monero-static-win32/build/src/cryptonote_basic/cryptonote_boost_serialization.h:361:16: note:   'cryptonote::difficulty_type {aka boost::multiprecision::number<boost::multiprecision::backends::cpp_int_backend<128, 128, (boost::multiprecision::cpp_integer_type)0, (boost::multiprecision::cpp_int_check_type)0, void> >}' is not derived from 'std::basic_ostream<_CharT, _Traits>'
       x = x << 64;
                ^~
In file included from C:/msys32/mingw32/include/boost/multiprecision/cpp_int.hpp:12:0,
                 from C:/msys32/home/buildbot/slave/monero-static-win32/build/src/cryptonote_basic/difficulty.h:36,
                 from C:/msys32/home/buildbot/slave/monero-static-win32/build/src/cryptonote_basic/cryptonote_boost_serialization.h:43,
                 from C:/msys32/home/buildbot/slave/monero-static-win32/build/src/cryptonote_basic/account_boost_serialization.h:34,
                 from C:/msys32/home/buildbot/slave/monero-static-win32/build/src/wallet/wallet2.h:46,
                 from C:/msys32/home/buildbot/slave/monero-static-win32/build/src/wallet/wallet_rpc_payments.cpp:34:
C:/msys32/mingw32/include/boost/multiprecision/number.hpp:2043:22: note: candidate: template<class Backend, boost::multiprecision::expression_template_option ExpressionTemplates> std::ostream& boost::multiprecision::operator<<(std::ostream&, const boost::multiprecision::number<Backend, ExpressionTemplates>&)
 inline std::ostream& operator << (std::ostream& os, const number<Backend, ExpressionTemplates>& r)
                      ^~~~~~~~
C:/msys32/mingw32/include/boost/multiprecision/number.hpp:2043:22: note:   template argument deduction/substitution failed:
In file included from C:/msys32/home/buildbot/slave/monero-static-win32/build/src/cryptonote_basic/account_boost_serialization.h:34:0,
                 from C:/msys32/home/buildbot/slave/monero-static-win32/build/src/wallet/wallet2.h:46,
                 from C:/msys32/home/buildbot/slave/monero-static-win32/build/src/wallet/wallet_rpc_payments.cpp:34:
C:/msys32/home/buildbot/slave/monero-static-win32/build/src/cryptonote_basic/cryptonote_boost_serialization.h:361:16: note:   mismatched types 'const boost::multiprecision::number<Backend, ExpressionTemplates>' and 'int'
       x = x << 64;
                ^~
C:/msys32/home/buildbot/slave/monero-static-win32/build/src/cryptonote_basic/cryptonote_boost_serialization.h:363:9: error: no match for 'operator+=' (operand types are 'cryptonote::difficulty_type {aka boost::multiprecision::number<boost::multiprecision::backends::cpp_int_backend<128, 128, (boost::multiprecision::cpp_integer_type)0, (boost::multiprecision::cpp_int_check_type)0, void> >}' and 'uint64_t {aka long long unsigned int}')
       x += v;
       ~~^~~~
In file included from C:/msys32/mingw32/include/boost/multiprecision/cpp_int.hpp:12:0,
                 from C:/msys32/home/buildbot/slave/monero-static-win32/build/src/cryptonote_basic/difficulty.h:36,
                 from C:/msys32/home/buildbot/slave/monero-static-win32/build/src/cryptonote_basic/cryptonote_boost_serialization.h:43,
                 from C:/msys32/home/buildbot/slave/monero-static-win32/build/src/cryptonote_basic/account_boost_serialization.h:34,
                 from C:/msys32/home/buildbot/slave/monero-static-win32/build/src/wallet/wallet2.h:46,
                 from C:/msys32/home/buildbot/slave/monero-static-win32/build/src/wallet/wallet_rpc_payments.cpp:34:
C:/msys32/mingw32/include/boost/multiprecision/number.hpp:373:12: note: candidate: boost::multiprecision::number<Backend, ExpressionTemplates>& boost::multiprecision::number<Backend, ExpressionTemplates>::operator+=(const self_type&) [with Backend = boost::multiprecision::backends::cpp_int_backend<128, 128, (boost::multiprecision::cpp_integer_type)0, (boost::multiprecision::cpp_int_check_type)0, void>; boost::multiprecision::expression_template_option ExpressionTemplates = (boost::multiprecision::expression_template_option)0; boost::multiprecision::number<Backend, ExpressionTemplates>::self_type = boost::multiprecision::number<boost::multiprecision::backends::cpp_int_backend<128, 128, (boost::multiprecision::cpp_integer_type)0, (boost::multiprecision::cpp_int_check_type)0, void> >]
    number& operator+=(const self_type& val)
            ^~~~~~~~
C:/msys32/mingw32/include/boost/multiprecision/number.hpp:373:12: note:   no known conversion for argument 1 from 'uint64_t {aka long long unsigned int}' to 'const self_type& {aka const boost::multiprecision::number<boost::multiprecision::backends::cpp_int_backend<128, 128, (boost::multiprecision::cpp_integer_type)0, (boost::multiprecision::cpp_int_check_type)0, void> >&}'
C:/msys32/mingw32/include/boost/multiprecision/number.hpp:396:143: note: candidate: template<class tag, class Arg1, class Arg2, class Arg3, class Arg4> typename boost::enable_if<boost::is_convertible<typename boost::multiprecision::detail::expression<tag, Arg1, Arg2, Arg3, Arg4>::result_type, boost::multiprecision::number<Backend, ExpressionTemplates> >, boost::multiprecision::number<Backend, ExpressionTemplates>&>::type boost::multiprecision::number<Backend, ExpressionTemplates>::operator+=(const boost::multiprecision::detail::expression<tag, Arg1, Arg2, Arg3, Arg4>&) [with tag = tag; Arg1 = Arg1; Arg2 = Arg2; Arg3 = Arg3; Arg4 = Arg4; Backend = boost::multiprecision::backends::cpp_int_backend<128, 128, (boost::multiprecision::cpp_integer_type)0, (boost::multiprecision::cpp_int_check_type)0, void>; boost::multiprecision::expression_template_option ExpressionTemplates = (boost::multiprecision::expression_template_option)0]
    typename boost::enable_if<is_convertible<typename detail::expression<tag, Arg1, Arg2, Arg3, Arg4>::result_type, self_type>, number&>::type operator+=(const detail::expression<tag, Arg1, Arg2, Arg3, Arg4>& e)
                                                                                                                                               ^~~~~~~~
C:/msys32/mingw32/include/boost/multiprecision/number.hpp:396:143: note:   template argument deduction/substitution failed:
In file included from C:/msys32/home/buildbot/slave/monero-static-win32/build/src/cryptonote_basic/account_boost_serialization.h:34:0,
                 from C:/msys32/home/buildbot/slave/monero-static-win32/build/src/wallet/wallet2.h:46,
                 from C:/msys32/home/buildbot/slave/monero-static-win32/build/src/wallet/wallet_rpc_payments.cpp:34:
C:/msys32/home/buildbot/slave/monero-static-win32/build/src/cryptonote_basic/cryptonote_boost_serialization.h:363:12: note:   mismatched types 'const boost::multiprecision::detail::expression<tag, Arg1, Arg2, Arg3, Arg4>' and 'uint64_t {aka long long unsigned int}'
       x += v;
            ^
In file included from C:/msys32/mingw32/include/boost/multiprecision/cpp_int.hpp:12:0,
                 from C:/msys32/home/buildbot/slave/monero-static-win32/build/src/cryptonote_basic/difficulty.h:36,
                 from C:/msys32/home/buildbot/slave/monero-static-win32/build/src/cryptonote_basic/cryptonote_boost_serialization.h:43,
                 from C:/msys32/home/buildbot/slave/monero-static-win32/build/src/cryptonote_basic/account_boost_serialization.h:34,
                 from C:/msys32/home/buildbot/slave/monero-static-win32/build/src/wallet/wallet2.h:46,
                 from C:/msys32/home/buildbot/slave/monero-static-win32/build/src/wallet/wallet_rpc_payments.cpp:34:
C:/msys32/mingw32/include/boost/multiprecision/number.hpp:414:12: note: candidate: template<class Arg1, class Arg2, class Arg3, class Arg4> boost::multiprecision::number<Backend, ExpressionTemplates>& boost::multiprecision::number<Backend, ExpressionTemplates>::operator+=(const boost::multiprecision::detail::expression<boost::multiprecision::detail::multiply_immediates, Arg1, Arg2, Arg3, Arg4>&) [with Arg1 = Arg1; Arg2 = Arg2; Arg3 = Arg3; Arg4 = Arg4; Backend = boost::multiprecision::backends::cpp_int_backend<128, 128, (boost::multiprecision::cpp_integer_type)0, (boost::multiprecision::cpp_int_check_type)0, void>; boost::multiprecision::expression_template_option ExpressionTemplates = (boost::multiprecision::expression_template_option)0]
    number& operator+=(const detail::expression<detail::multiply_immediates, Arg1, Arg2, Arg3, Arg4>& e)
            ^~~~~~~~
C:/msys32/mingw32/include/boost/multiprecision/number.hpp:414:12: note:   template argument deduction/substitution failed:
In file included from C:/msys32/home/buildbot/slave/monero-static-win32/build/src/cryptonote_basic/account_boost_serialization.h:34:0,
                 from C:/msys32/home/buildbot/slave/monero-static-win32/build/src/wallet/wallet2.h:46,
                 from C:/msys32/home/buildbot/slave/monero-static-win32/build/src/wallet/wallet_rpc_payments.cpp:34:
C:/msys32/home/buildbot/slave/monero-static-win32/build/src/cryptonote_basic/cryptonote_boost_serialization.h:363:12: note:   mismatched types 'const boost::multiprecision::detail::expression<boost::multiprecision::detail::multiply_immediates, Arg1, Arg2, Arg3, Arg4>' and 'uint64_t {aka long long unsigned int}'
       x += v;
            ^
In file included from C:/msys32/mingw32/include/boost/multiprecision/cpp_int.hpp:12:0,
                 from C:/msys32/home/buildbot/slave/monero-static-win32/build/src/cryptonote_basic/difficulty.h:36,
                 from C:/msys32/home/buildbot/slave/monero-static-win32/build/src/cryptonote_basic/cryptonote_boost_serialization.h:43,
                 from C:/msys32/home/buildbot/slave/monero-static-win32/build/src/cryptonote_basic/account_boost_serialization.h:34,
                 from C:/msys32/home/buildbot/slave/monero-static-win32/build/src/wallet/wallet2.h:46,
                 from C:/msys32/home/buildbot/slave/monero-static-win32/build/src/wallet/wallet_rpc_payments.cpp:34:
C:/msys32/mingw32/include/boost/multiprecision/number.hpp:442:7: note: candidate: template<class V> typename boost::enable_if<boost::is_convertible<V, boost::multiprecision::number<Backend, ExpressionTemplates> >, boost::multiprecision::number<Backend, ExpressionTemplates>&>::type boost::multiprecision::number<Backend, ExpressionTemplates>::operator+=(const V&) [with V = V; Backend = boost::multiprecision::backends::cpp_int_backend<128, 128, (boost::multiprecision::cpp_integer_type)0, (boost::multiprecision::cpp_int_check_type)0, void>; boost::multiprecision::expression_template_option ExpressionTemplates = (boost::multiprecision::expression_template_option)0]
       operator+=(const V& v)
       ^~~~~~~~
C:/msys32/mingw32/include/boost/multiprecision/number.hpp:442:7: note:   template argument deduction/substitution failed:
C:/msys32/mingw32/include/boost/multiprecision/number.hpp: In substitution of 'template<class V> typename boost::enable_if<boost::is_convertible<V, boost::multiprecision::number<boost::multiprecision::backends::cpp_int_backend<128, 128, (boost::multiprecision::cpp_integer_type)0, (boost::multiprecision::cpp_int_check_type)0, void> > >, boost::multiprecision::number<boost::multiprecision::backends::cpp_int_backend<128, 128, (boost::multiprecision::cpp_integer_type)0, (boost::multiprecision::cpp_int_check_type)0, void> >&>::type boost::multiprecision::number<boost::multiprecision::backends::cpp_int_backend<128, 128, (boost::multiprecision::cpp_integer_type)0, (boost::multiprecision::cpp_int_check_type)0, void> >::operator+=<V>(const V&) [with V = long long unsigned int]':
C:/msys32/home/buildbot/slave/monero-static-win32/build/src/cryptonote_basic/cryptonote_boost_serialization.h:363:12:   required from here
C:/msys32/mingw32/include/boost/multiprecision/number.hpp:442:7: error: no type named 'type' in 'struct boost::enable_if<boost::is_convertible<long long unsigned int, boost::multiprecision::number<boost::multiprecision::backends::cpp_int_backend<128, 128, (boost::multiprecision::cpp_integer_type)0, (boost::multiprecision::cpp_int_check_type)0, void> > >, boost::multiprecision::number<boost::multiprecision::backends::cpp_int_backend<128, 128, (boost::multiprecision::cpp_integer_type)0, (boost::multiprecision::cpp_int_check_type)0, void> >&>'
In file included from C:/msys32/home/buildbot/slave/monero-static-win32/build/src/cryptonote_basic/account_boost_serialization.h:34:0,
                 from C:/msys32/home/buildbot/slave/monero-static-win32/build/src/wallet/wallet2.h:46,
                 from C:/msys32/home/buildbot/slave/monero-static-win32/build/src/wallet/wallet_rpc_payments.cpp:34:
C:/msys32/home/buildbot/slave/monero-static-win32/build/src/cryptonote_basic/cryptonote_boost_serialization.h:368:43: error: no match for 'operator>>' (operand types are 'cryptonote::difficulty_type {aka boost::multiprecision::number<boost::multiprecision::backends::cpp_int_backend<128, 128, (boost::multiprecision::cpp_integer_type)0, (boost::multiprecision::cpp_int_check_type)0, void> >}' and 'int')
       cryptonote::difficulty_type x_ = (x >> 64) & 0xffffffffffffffff;
                                         ~~^~~~~
C:/msys32/home/buildbot/slave/monero-static-win32/build/src/cryptonote_basic/cryptonote_boost_serialization.h:368:43: note: candidate: operator>>(int, int) <built-in>
C:/msys32/home/buildbot/slave/monero-static-win32/build/src/cryptonote_basic/cryptonote_boost_serialization.h:368:43: note:   no known conversion for argument 1 from 'cryptonote::difficulty_type {aka boost::multiprecision::number<boost::multiprecision::backends::cpp_int_backend<128, 128, (boost::multiprecision::cpp_integer_type)0, (boost::multiprecision::cpp_int_check_type)0, void> >}' to 'int'
In file included from C:/msys32/mingw32/include/boost/multiprecision/cpp_int.hpp:12:0,
                 from C:/msys32/home/buildbot/slave/monero-static-win32/build/src/cryptonote_basic/difficulty.h:36,
                 from C:/msys32/home/buildbot/slave/monero-static-win32/build/src/cryptonote_basic/cryptonote_boost_serialization.h:43,
                 from C:/msys32/home/buildbot/slave/monero-static-win32/build/src/cryptonote_basic/account_boost_serialization.h:34,
                 from C:/msys32/home/buildbot/slave/monero-static-win32/build/src/wallet/wallet2.h:46,
                 from C:/msys32/home/buildbot/slave/monero-static-win32/build/src/wallet/wallet_rpc_payments.cpp:34:
C:/msys32/mingw32/include/boost/multiprecision/number.hpp:2169:22: note: candidate: template<class Backend, boost::multiprecision::expression_template_option ExpressionTemplates> std::istream& boost::operator>>(std::istream&, boost::rational<boost::multiprecision::number<Backend, ExpressionTemplates> >&)
 inline std::istream& operator >> (std::istream& is, rational<multiprecision::number<Backend, ExpressionTemplates> >& r)
                      ^~~~~~~~
C:/msys32/mingw32/include/boost/multiprecision/number.hpp:2169:22: note:   template argument deduction/substitution failed:
In file included from C:/msys32/home/buildbot/slave/monero-static-win32/build/src/cryptonote_basic/account_boost_serialization.h:34:0,
                 from C:/msys32/home/buildbot/slave/monero-static-win32/build/src/wallet/wallet2.h:46,
                 from C:/msys32/home/buildbot/slave/monero-static-win32/build/src/wallet/wallet_rpc_payments.cpp:34:
C:/msys32/home/buildbot/slave/monero-static-win32/build/src/cryptonote_basic/cryptonote_boost_serialization.h:368:46: note:   mismatched types 'boost::rational<boost::multiprecision::number<Backend, ExpressionTemplates> >' and 'int'
       cryptonote::difficulty_type x_ = (x >> 64) & 0xffffffffffffffff;
                                              ^~
In file included from C:/msys32/mingw32/include/boost/multiprecision/rational_adaptor.hpp:19:0,
                 from C:/msys32/mingw32/include/boost/multiprecision/cpp_int.hpp:20,
                 from C:/msys32/home/buildbot/slave/monero-static-win32/build/src/cryptonote_basic/difficulty.h:36,
                 from C:/msys32/home/buildbot/slave/monero-static-win32/build/src/cryptonote_basic/cryptonote_boost_serialization.h:43,
                 from C:/msys32/home/buildbot/slave/monero-static-win32/build/src/cryptonote_basic/account_boost_serialization.h:34,
                 from C:/msys32/home/buildbot/slave/monero-static-win32/build/src/wallet/wallet2.h:46,
                 from C:/msys32/home/buildbot/slave/monero-static-win32/build/src/wallet/wallet_rpc_payments.cpp:34:
C:/msys32/mingw32/include/boost/rational.hpp:908:15: note: candidate: template<class IntType> std::istream& boost::operator>>(std::istream&, boost::rational<I>&)
 std::istream& operator>> (std::istream& is, rational<IntType>& r)
               ^~~~~~~~
C:/msys32/mingw32/include/boost/rational.hpp:908:15: note:   template argument deduction/substitution failed:
In file included from C:/msys32/home/buildbot/slave/monero-static-win32/build/src/cryptonote_basic/account_boost_serialization.h:34:0,
                 from C:/msys32/home/buildbot/slave/monero-static-win32/build/src/wallet/wallet2.h:46,
                 from C:/msys32/home/buildbot/slave/monero-static-win32/build/src/wallet/wallet_rpc_payments.cpp:34:
C:/msys32/home/buildbot/slave/monero-static-win32/build/src/cryptonote_basic/cryptonote_boost_serialization.h:368:46: note:   mismatched types 'boost::rational<I>' and 'int'
       cryptonote::difficulty_type x_ = (x >> 64) & 0xffffffffffffffff;
                                              ^~
In file included from C:/msys32/mingw32/include/boost/multiprecision/cpp_int.hpp:12:0,
                 from C:/msys32/home/buildbot/slave/monero-static-win32/build/src/cryptonote_basic/difficulty.h:36,
                 from C:/msys32/home/buildbot/slave/monero-static-win32/build/src/cryptonote_basic/cryptonote_boost_serialization.h:43,
                 from C:/msys32/home/buildbot/slave/monero-static-win32/build/src/cryptonote_basic/account_boost_serialization.h:34,
                 from C:/msys32/home/buildbot/slave/monero-static-win32/build/src/wallet/wallet2.h:46,
                 from C:/msys32/home/buildbot/slave/monero-static-win32/build/src/wallet/wallet_rpc_payments.cpp:34:
C:/msys32/mingw32/include/boost/multiprecision/number.hpp:2114:22: note: candidate: template<class Backend, boost::multiprecision::expression_template_option ExpressionTemplates> std::istream& boost::multiprecision::operator>>(std::istream&, boost::multiprecision::number<Backend, ExpressionTemplates>&)
 inline std::istream& operator >> (std::istream& is, number<Backend, ExpressionTemplates>& r)
                      ^~~~~~~~
C:/msys32/mingw32/include/boost/multiprecision/number.hpp:2114:22: note:   template argument deduction/substitution failed:
In file included from C:/msys32/home/buildbot/slave/monero-static-win32/build/src/cryptonote_basic/account_boost_serialization.h:34:0,
                 from C:/msys32/home/buildbot/slave/monero-static-win32/build/src/wallet/wallet2.h:46,
                 from C:/msys32/home/buildbot/slave/monero-static-win32/build/src/wallet/wallet_rpc_payments.cpp:34:
C:/msys32/home/buildbot/slave/monero-static-win32/build/src/cryptonote_basic/cryptonote_boost_serialization.h:368:46: note:   mismatched types 'boost::multiprecision::number<Backend, ExpressionTemplates>' and 'int'
       cryptonote::difficulty_type x_ = (x >> 64) & 0xffffffffffffffff;
                                              ^~
C:/msys32/home/buildbot/slave/monero-static-win32/build/src/cryptonote_basic/cryptonote_boost_serialization.h:372:14: error: no match for 'operator&' (operand types are 'cryptonote::difficulty_type {aka boost::multiprecision::number<boost::multiprecision::backends::cpp_int_backend<128, 128, (boost::multiprecision::cpp_integer_type)0, (boost::multiprecision::cpp_int_check_type)0, void> >}' and 'long long unsigned int')
       x_ = x & 0xffffffffffffffff;
            ~~^~~~~~~~~~~~~~~~~~~~
C:/msys32/home/buildbot/slave/monero-static-win32/build/src/cryptonote_basic/cryptonote_boost_serialization.h:372:14: note: candidate: operator&(int, long long unsigned int) <built-in>
C:/msys32/home/buildbot/slave/monero-static-win32/build/src/cryptonote_basic/cryptonote_boost_serialization.h:372:14: note:   no known conversion for argument 1 from 'cryptonote::difficulty_type {aka boost::multiprecision::number<boost::multiprecision::backends::cpp_int_backend<128, 128, (boost::multiprecision::cpp_integer_type)0, (boost::multiprecision::cpp_int_check_type)0, void> >}' to 'int'
In file included from C:/msys32/mingw32/include/boost/random/detail/integer_log2.hpp:19:0,
                 from C:/msys32/mingw32/include/boost/random/detail/large_arithmetic.hpp:19,
                 from C:/msys32/mingw32/include/boost/random/detail/const_mod.hpp:23,
                 from C:/msys32/mingw32/include/boost/random/detail/seed_impl.hpp:26,
                 from C:/msys32/mingw32/include/boost/random/mersenne_twister.hpp:30,
                 from C:/msys32/mingw32/include/boost/uuid/random_generator.hpp:17,
                 from C:/msys32/home/buildbot/slave/monero-static-win32/build/contrib/epee/include/net/network_throttle.hpp:61,
                 from C:/msys32/home/buildbot/slave/monero-static-win32/build/contrib/epee/include/net/network_throttle-detail.hpp:40,
                 from C:/msys32/home/buildbot/slave/monero-static-win32/build/contrib/epee/include/net/abstract_tcp_server2.h:61,
                 from C:/msys32/home/buildbot/slave/monero-static-win32/build/contrib/epee/include/net/http_server_impl_base.h:36,
                 from C:/msys32/home/buildbot/slave/monero-static-win32/build/src/wallet/message_transporter.h:35,
                 from C:/msys32/home/buildbot/slave/monero-static-win32/build/src/wallet/message_store.h:46,
                 from C:/msys32/home/buildbot/slave/monero-static-win32/build/src/wallet/wallet2.h:65,
                 from C:/msys32/home/buildbot/slave/monero-static-win32/build/src/wallet/wallet_rpc_payments.cpp:34:
C:/msys32/mingw32/include/boost/pending/integer_log2.hpp: At global scope:
C:/msys32/mingw32/include/boost/pending/integer_log2.hpp:7:59: note: #pragma message: This header is deprecated. Use <boost/integer/integer_log2.hpp> instead.
 BOOST_HEADER_DEPRECATED("<boost/integer/integer_log2.hpp>");
                                                           ^
C:/msys32/home/buildbot/slave/monero-static-win32/build/src/wallet/wallet_rpc_payments.cpp: In member function 'bool tools::wallet2::search_for_rpc_payment(uint64_t, const std::function<bool(long long unsigned int, long long unsigned int)>&, const std::function<bool(unsigned int)>&, const std::function<bool(long long unsigned int)>&, const std::function<void(const std::__cxx11::basic_string<char>&)>&)':
C:/msys32/home/buildbot/slave/monero-static-win32/build/src/wallet/wallet_rpc_payments.cpp:157:42: error: could not convert 'diff' from 'uint64_t {aka long long unsigned int}' to 'cryptonote::difficulty_type {aka boost::multiprecision::number<boost::multiprecision::backends::cpp_int_backend<128, 128, (boost::multiprecision::cpp_integer_type)0, (boost::multiprecision::cpp_int_check_type)0, void> >}'
     if (cryptonote::check_hash(hash, diff))
                                          ^
make[3]: Leaving directory '/home/buildbot/slave/monero-static-win32/build/build/release'
make[2]: Leaving directory '/home/buildbot/slave/monero-static-win32/build/build/release'
make[1]: Leaving directory '/home/buildbot/slave/monero-static-win32/build/build/release'
make[3]: *** [src/wallet/CMakeFiles/obj_wallet.dir/build.make:141: src/wallet/CMakeFiles/obj_wallet.dir/wallet_rpc_payments.cpp.obj] Error 1
make[2]: *** [CMakeFiles/Makefile2:2816: src/wallet/CMakeFiles/obj_wallet.dir/all] Error 2
make[1]: *** [Makefile:141: all] Error 2
make: *** [Makefile:159: release-static-win32] Error 2
program finished with exit code 2
elapsedTime=1748.945000