(view as text)
Determining if the function memset_s exists in the c failed with the following output:
Change Dir: C:/msys32/home/buildbot/slave/monero-static-win32/build/build/release/CMakeFiles/CMakeTmp

Run Build Command:"C:/msys32/usr/bin/make.exe" "cmTC_b6b88/fast"
make[1]: Entering directory '/home/buildbot/slave/monero-static-win32/build/build/release/CMakeFiles/CMakeTmp'
/usr/bin/make -f CMakeFiles/cmTC_b6b88.dir/build.make CMakeFiles/cmTC_b6b88.dir/build
make[2]: Entering directory '/home/buildbot/slave/monero-static-win32/build/build/release/CMakeFiles/CMakeTmp'
Building C object CMakeFiles/cmTC_b6b88.dir/CheckFunctionExists.c.obj

/C/msys32/mingw32/bin/i686-w64-mingw32-gcc.exe   -DCHECK_FUNCTION_EXISTS=memset_s   -o CMakeFiles/cmTC_b6b88.dir/CheckFunctionExists.c.obj   -c /C/msys32/mingw32/share/cmake-3.12/Modules/CheckFunctionExists.c
Linking C executable cmTC_b6b88.exe

/C/msys32/mingw32/bin/cmake.exe -E remove -f CMakeFiles/cmTC_b6b88.dir/objects.a
ar cr CMakeFiles/cmTC_b6b88.dir/objects.a "CMakeFiles/cmTC_b6b88.dir/CheckFunctionExists.c.obj" 
/C/msys32/mingw32/bin/i686-w64-mingw32-gcc.exe  -DCHECK_FUNCTION_EXISTS=memset_s    -Wl,--whole-archive CMakeFiles/cmTC_b6b88.dir/objects.a -Wl,--no-whole-archive  -o cmTC_b6b88.exe -Wl,--major-image-version,0,--minor-image-version,0  -L/C/msys32/home/buildbot/slave/monero-static-win32/build/build/release/CMakeFiles/CMakeTmp/string.h -lc -lkernel32 -luser32 -lgdi32 -lwinspool -lshell32 -lole32 -loleaut32 -luuid -lcomdlg32 -ladvapi32 
C:/msys32/mingw32/bin/../lib/gcc/i686-w64-mingw32/7.4.0/../../../../i686-w64-mingw32/bin/ld.exe: cannot find -lc

collect2.exe: error: ld returned 1 exit status

make[2]: *** [CMakeFiles/cmTC_b6b88.dir/build.make:88: cmTC_b6b88.exe] Error 1
make[2]: Leaving directory '/home/buildbot/slave/monero-static-win32/build/build/release/CMakeFiles/CMakeTmp'
make[1]: *** [Makefile:121: cmTC_b6b88/fast] Error 2
make[1]: Leaving directory '/home/buildbot/slave/monero-static-win32/build/build/release/CMakeFiles/CMakeTmp'


Determining if the function explicit_bzero exists in the c failed with the following output:
Change Dir: C:/msys32/home/buildbot/slave/monero-static-win32/build/build/release/CMakeFiles/CMakeTmp

Run Build Command:"C:/msys32/usr/bin/make.exe" "cmTC_944d1/fast"
make[1]: Entering directory '/home/buildbot/slave/monero-static-win32/build/build/release/CMakeFiles/CMakeTmp'
/usr/bin/make -f CMakeFiles/cmTC_944d1.dir/build.make CMakeFiles/cmTC_944d1.dir/build
make[2]: Entering directory '/home/buildbot/slave/monero-static-win32/build/build/release/CMakeFiles/CMakeTmp'
Building C object CMakeFiles/cmTC_944d1.dir/CheckFunctionExists.c.obj

/C/msys32/mingw32/bin/i686-w64-mingw32-gcc.exe   -DCHECK_FUNCTION_EXISTS=explicit_bzero   -o CMakeFiles/cmTC_944d1.dir/CheckFunctionExists.c.obj   -c /C/msys32/mingw32/share/cmake-3.12/Modules/CheckFunctionExists.c
Linking C executable cmTC_944d1.exe

/C/msys32/mingw32/bin/cmake.exe -E remove -f CMakeFiles/cmTC_944d1.dir/objects.a
ar cr CMakeFiles/cmTC_944d1.dir/objects.a "CMakeFiles/cmTC_944d1.dir/CheckFunctionExists.c.obj" 
/C/msys32/mingw32/bin/i686-w64-mingw32-gcc.exe  -DCHECK_FUNCTION_EXISTS=explicit_bzero    -Wl,--whole-archive CMakeFiles/cmTC_944d1.dir/objects.a -Wl,--no-whole-archive  -o cmTC_944d1.exe -Wl,--major-image-version,0,--minor-image-version,0  -L/C/msys32/home/buildbot/slave/monero-static-win32/build/build/release/CMakeFiles/CMakeTmp/strings.h -lc -lkernel32 -luser32 -lgdi32 -lwinspool -lshell32 -lole32 -loleaut32 -luuid -lcomdlg32 -ladvapi32 
C:/msys32/mingw32/bin/../lib/gcc/i686-w64-mingw32/7.4.0/../../../../i686-w64-mingw32/bin/ld.exe: cannot find -lc

collect2.exe: error: ld returned 1 exit status

make[2]: *** [CMakeFiles/cmTC_944d1.dir/build.make:88: cmTC_944d1.exe] Error 1
make[2]: Leaving directory '/home/buildbot/slave/monero-static-win32/build/build/release/CMakeFiles/CMakeTmp'
make[1]: *** [Makefile:121: cmTC_944d1/fast] Error 2
make[1]: Leaving directory '/home/buildbot/slave/monero-static-win32/build/build/release/CMakeFiles/CMakeTmp'


Determining if the function strptime exists failed with the following output:
Change Dir: C:/msys32/home/buildbot/slave/monero-static-win32/build/build/release/CMakeFiles/CMakeTmp

Run Build Command:"C:/msys32/usr/bin/make.exe" "cmTC_aff61/fast"
make[1]: Entering directory '/home/buildbot/slave/monero-static-win32/build/build/release/CMakeFiles/CMakeTmp'
/usr/bin/make -f CMakeFiles/cmTC_aff61.dir/build.make CMakeFiles/cmTC_aff61.dir/build
make[2]: Entering directory '/home/buildbot/slave/monero-static-win32/build/build/release/CMakeFiles/CMakeTmp'
Building C object CMakeFiles/cmTC_aff61.dir/CheckFunctionExists.c.obj

/C/msys32/mingw32/bin/i686-w64-mingw32-gcc.exe   -DCHECK_FUNCTION_EXISTS=strptime   -o CMakeFiles/cmTC_aff61.dir/CheckFunctionExists.c.obj   -c /C/msys32/mingw32/share/cmake-3.12/Modules/CheckFunctionExists.c
Linking C executable cmTC_aff61.exe

/C/msys32/mingw32/bin/cmake.exe -E remove -f CMakeFiles/cmTC_aff61.dir/objects.a
ar cr CMakeFiles/cmTC_aff61.dir/objects.a "CMakeFiles/cmTC_aff61.dir/CheckFunctionExists.c.obj" 
/C/msys32/mingw32/bin/i686-w64-mingw32-gcc.exe  -DCHECK_FUNCTION_EXISTS=strptime    -Wl,--whole-archive CMakeFiles/cmTC_aff61.dir/objects.a -Wl,--no-whole-archive  -o cmTC_aff61.exe -Wl,--major-image-version,0,--minor-image-version,0 -lkernel32 -luser32 -lgdi32 -lwinspool -lshell32 -lole32 -loleaut32 -luuid -lcomdlg32 -ladvapi32 
CMakeFiles/cmTC_aff61.dir/objects.a(CheckFunctionExists.c.obj):CheckFunctionExists.c:(.text+0xc): undefined reference to `strptime'

collect2.exe: error: ld returned 1 exit status

make[2]: *** [CMakeFiles/cmTC_aff61.dir/build.make:88: cmTC_aff61.exe] Error 1
make[2]: Leaving directory '/home/buildbot/slave/monero-static-win32/build/build/release/CMakeFiles/CMakeTmp'
make[1]: *** [Makefile:121: cmTC_aff61/fast] Error 2
make[1]: Leaving directory '/home/buildbot/slave/monero-static-win32/build/build/release/CMakeFiles/CMakeTmp'


Determining if the include file arpa/inet.h exists failed with the following output:
Change Dir: C:/msys32/home/buildbot/slave/monero-static-win32/build/build/release/CMakeFiles/CMakeTmp

Run Build Command:"C:/msys32/usr/bin/make.exe" "cmTC_ae8f3/fast"
make[1]: Entering directory '/home/buildbot/slave/monero-static-win32/build/build/release/CMakeFiles/CMakeTmp'
/usr/bin/make -f CMakeFiles/cmTC_ae8f3.dir/build.make CMakeFiles/cmTC_ae8f3.dir/build
make[2]: Entering directory '/home/buildbot/slave/monero-static-win32/build/build/release/CMakeFiles/CMakeTmp'
Building C object CMakeFiles/cmTC_ae8f3.dir/CheckIncludeFile.c.obj

/C/msys32/mingw32/bin/i686-w64-mingw32-gcc.exe    -o CMakeFiles/cmTC_ae8f3.dir/CheckIncludeFile.c.obj   -c /C/msys32/home/buildbot/slave/monero-static-win32/build/build/release/CMakeFiles/CMakeTmp/CheckIncludeFile.c
C:/msys32/home/buildbot/slave/monero-static-win32/build/build/release/CMakeFiles/CMakeTmp/CheckIncludeFile.c:1:10: fatal error: arpa/inet.h: No such file or directory

 #include <arpa/inet.h>

          ^~~~~~~~~~~~~

compilation terminated.

make[2]: *** [CMakeFiles/cmTC_ae8f3.dir/build.make:66: CMakeFiles/cmTC_ae8f3.dir/CheckIncludeFile.c.obj] Error 1
make[2]: Leaving directory '/home/buildbot/slave/monero-static-win32/build/build/release/CMakeFiles/CMakeTmp'
make[1]: *** [Makefile:121: cmTC_ae8f3/fast] Error 2
make[1]: Leaving directory '/home/buildbot/slave/monero-static-win32/build/build/release/CMakeFiles/CMakeTmp'


Determining if the include file endian.h exists failed with the following output:
Change Dir: C:/msys32/home/buildbot/slave/monero-static-win32/build/build/release/CMakeFiles/CMakeTmp

Run Build Command:"C:/msys32/usr/bin/make.exe" "cmTC_74670/fast"
make[1]: Entering directory '/home/buildbot/slave/monero-static-win32/build/build/release/CMakeFiles/CMakeTmp'
/usr/bin/make -f CMakeFiles/cmTC_74670.dir/build.make CMakeFiles/cmTC_74670.dir/build
make[2]: Entering directory '/home/buildbot/slave/monero-static-win32/build/build/release/CMakeFiles/CMakeTmp'
Building C object CMakeFiles/cmTC_74670.dir/CheckIncludeFile.c.obj

/C/msys32/mingw32/bin/i686-w64-mingw32-gcc.exe    -o CMakeFiles/cmTC_74670.dir/CheckIncludeFile.c.obj   -c /C/msys32/home/buildbot/slave/monero-static-win32/build/build/release/CMakeFiles/CMakeTmp/CheckIncludeFile.c
C:/msys32/home/buildbot/slave/monero-static-win32/build/build/release/CMakeFiles/CMakeTmp/CheckIncludeFile.c:1:10: fatal error: endian.h: No such file or directory

 #include <endian.h>

          ^~~~~~~~~~

compilation terminated.

make[2]: *** [CMakeFiles/cmTC_74670.dir/build.make:66: CMakeFiles/cmTC_74670.dir/CheckIncludeFile.c.obj] Error 1
make[2]: Leaving directory '/home/buildbot/slave/monero-static-win32/build/build/release/CMakeFiles/CMakeTmp'
make[1]: *** [Makefile:121: cmTC_74670/fast] Error 2
make[1]: Leaving directory '/home/buildbot/slave/monero-static-win32/build/build/release/CMakeFiles/CMakeTmp'


Determining if the include file dlfcn.h exists failed with the following output:
Change Dir: C:/msys32/home/buildbot/slave/monero-static-win32/build/build/release/CMakeFiles/CMakeTmp

Run Build Command:"C:/msys32/usr/bin/make.exe" "cmTC_e9423/fast"
make[1]: Entering directory '/home/buildbot/slave/monero-static-win32/build/build/release/CMakeFiles/CMakeTmp'
/usr/bin/make -f CMakeFiles/cmTC_e9423.dir/build.make CMakeFiles/cmTC_e9423.dir/build
make[2]: Entering directory '/home/buildbot/slave/monero-static-win32/build/build/release/CMakeFiles/CMakeTmp'
Building C object CMakeFiles/cmTC_e9423.dir/CheckIncludeFile.c.obj

/C/msys32/mingw32/bin/i686-w64-mingw32-gcc.exe    -o CMakeFiles/cmTC_e9423.dir/CheckIncludeFile.c.obj   -c /C/msys32/home/buildbot/slave/monero-static-win32/build/build/release/CMakeFiles/CMakeTmp/CheckIncludeFile.c
C:/msys32/home/buildbot/slave/monero-static-win32/build/build/release/CMakeFiles/CMakeTmp/CheckIncludeFile.c:1:10: fatal error: dlfcn.h: No such file or directory

 #include <dlfcn.h>

          ^~~~~~~~~

compilation terminated.

make[2]: *** [CMakeFiles/cmTC_e9423.dir/build.make:66: CMakeFiles/cmTC_e9423.dir/CheckIncludeFile.c.obj] Error 1
make[2]: Leaving directory '/home/buildbot/slave/monero-static-win32/build/build/release/CMakeFiles/CMakeTmp'
make[1]: *** [Makefile:121: cmTC_e9423/fast] Error 2
make[1]: Leaving directory '/home/buildbot/slave/monero-static-win32/build/build/release/CMakeFiles/CMakeTmp'


Determining if the include file event.h exists failed with the following output:
Change Dir: C:/msys32/home/buildbot/slave/monero-static-win32/build/build/release/CMakeFiles/CMakeTmp

Run Build Command:"C:/msys32/usr/bin/make.exe" "cmTC_1c3ae/fast"
make[1]: Entering directory '/home/buildbot/slave/monero-static-win32/build/build/release/CMakeFiles/CMakeTmp'
/usr/bin/make -f CMakeFiles/cmTC_1c3ae.dir/build.make CMakeFiles/cmTC_1c3ae.dir/build
make[2]: Entering directory '/home/buildbot/slave/monero-static-win32/build/build/release/CMakeFiles/CMakeTmp'
Building C object CMakeFiles/cmTC_1c3ae.dir/CheckIncludeFile.c.obj

/C/msys32/mingw32/bin/i686-w64-mingw32-gcc.exe    -o CMakeFiles/cmTC_1c3ae.dir/CheckIncludeFile.c.obj   -c /C/msys32/home/buildbot/slave/monero-static-win32/build/build/release/CMakeFiles/CMakeTmp/CheckIncludeFile.c
C:/msys32/home/buildbot/slave/monero-static-win32/build/build/release/CMakeFiles/CMakeTmp/CheckIncludeFile.c:1:10: fatal error: event.h: No such file or directory

 #include <event.h>

          ^~~~~~~~~

compilation terminated.

make[2]: *** [CMakeFiles/cmTC_1c3ae.dir/build.make:66: CMakeFiles/cmTC_1c3ae.dir/CheckIncludeFile.c.obj] Error 1
make[2]: Leaving directory '/home/buildbot/slave/monero-static-win32/build/build/release/CMakeFiles/CMakeTmp'
make[1]: *** [Makefile:121: cmTC_1c3ae/fast] Error 2
make[1]: Leaving directory '/home/buildbot/slave/monero-static-win32/build/build/release/CMakeFiles/CMakeTmp'


Determining if the include file glob.h exists failed with the following output:
Change Dir: C:/msys32/home/buildbot/slave/monero-static-win32/build/build/release/CMakeFiles/CMakeTmp

Run Build Command:"C:/msys32/usr/bin/make.exe" "cmTC_7fadf/fast"
make[1]: Entering directory '/home/buildbot/slave/monero-static-win32/build/build/release/CMakeFiles/CMakeTmp'
/usr/bin/make -f CMakeFiles/cmTC_7fadf.dir/build.make CMakeFiles/cmTC_7fadf.dir/build
make[2]: Entering directory '/home/buildbot/slave/monero-static-win32/build/build/release/CMakeFiles/CMakeTmp'
Building C object CMakeFiles/cmTC_7fadf.dir/CheckIncludeFile.c.obj

/C/msys32/mingw32/bin/i686-w64-mingw32-gcc.exe    -o CMakeFiles/cmTC_7fadf.dir/CheckIncludeFile.c.obj   -c /C/msys32/home/buildbot/slave/monero-static-win32/build/build/release/CMakeFiles/CMakeTmp/CheckIncludeFile.c
C:/msys32/home/buildbot/slave/monero-static-win32/build/build/release/CMakeFiles/CMakeTmp/CheckIncludeFile.c:1:10: fatal error: glob.h: No such file or directory

 #include <glob.h>

          ^~~~~~~~

compilation terminated.

make[2]: *** [CMakeFiles/cmTC_7fadf.dir/build.make:66: CMakeFiles/cmTC_7fadf.dir/CheckIncludeFile.c.obj] Error 1
make[2]: Leaving directory '/home/buildbot/slave/monero-static-win32/build/build/release/CMakeFiles/CMakeTmp'
make[1]: *** [Makefile:121: cmTC_7fadf/fast] Error 2
make[1]: Leaving directory '/home/buildbot/slave/monero-static-win32/build/build/release/CMakeFiles/CMakeTmp'


Determining if the include file grp.h exists failed with the following output:
Change Dir: C:/msys32/home/buildbot/slave/monero-static-win32/build/build/release/CMakeFiles/CMakeTmp

Run Build Command:"C:/msys32/usr/bin/make.exe" "cmTC_3993a/fast"
make[1]: Entering directory '/home/buildbot/slave/monero-static-win32/build/build/release/CMakeFiles/CMakeTmp'
/usr/bin/make -f CMakeFiles/cmTC_3993a.dir/build.make CMakeFiles/cmTC_3993a.dir/build
make[2]: Entering directory '/home/buildbot/slave/monero-static-win32/build/build/release/CMakeFiles/CMakeTmp'
Building C object CMakeFiles/cmTC_3993a.dir/CheckIncludeFile.c.obj

/C/msys32/mingw32/bin/i686-w64-mingw32-gcc.exe    -o CMakeFiles/cmTC_3993a.dir/CheckIncludeFile.c.obj   -c /C/msys32/home/buildbot/slave/monero-static-win32/build/build/release/CMakeFiles/CMakeTmp/CheckIncludeFile.c
C:/msys32/home/buildbot/slave/monero-static-win32/build/build/release/CMakeFiles/CMakeTmp/CheckIncludeFile.c:1:10: fatal error: grp.h: No such file or directory

 #include <grp.h>

          ^~~~~~~

compilation terminated.

make[2]: *** [CMakeFiles/cmTC_3993a.dir/build.make:66: CMakeFiles/cmTC_3993a.dir/CheckIncludeFile.c.obj] Error 1
make[2]: Leaving directory '/home/buildbot/slave/monero-static-win32/build/build/release/CMakeFiles/CMakeTmp'
make[1]: *** [Makefile:121: cmTC_3993a/fast] Error 2
make[1]: Leaving directory '/home/buildbot/slave/monero-static-win32/build/build/release/CMakeFiles/CMakeTmp'


Determining if the include file login_cap.h exists failed with the following output:
Change Dir: C:/msys32/home/buildbot/slave/monero-static-win32/build/build/release/CMakeFiles/CMakeTmp

Run Build Command:"C:/msys32/usr/bin/make.exe" "cmTC_0de29/fast"
make[1]: Entering directory '/home/buildbot/slave/monero-static-win32/build/build/release/CMakeFiles/CMakeTmp'
/usr/bin/make -f CMakeFiles/cmTC_0de29.dir/build.make CMakeFiles/cmTC_0de29.dir/build
make[2]: Entering directory '/home/buildbot/slave/monero-static-win32/build/build/release/CMakeFiles/CMakeTmp'
Building C object CMakeFiles/cmTC_0de29.dir/CheckIncludeFile.c.obj

/C/msys32/mingw32/bin/i686-w64-mingw32-gcc.exe    -o CMakeFiles/cmTC_0de29.dir/CheckIncludeFile.c.obj   -c /C/msys32/home/buildbot/slave/monero-static-win32/build/build/release/CMakeFiles/CMakeTmp/CheckIncludeFile.c
C:/msys32/home/buildbot/slave/monero-static-win32/build/build/release/CMakeFiles/CMakeTmp/CheckIncludeFile.c:1:10: fatal error: login_cap.h: No such file or directory

 #include <login_cap.h>

          ^~~~~~~~~~~~~

compilation terminated.

make[2]: *** [CMakeFiles/cmTC_0de29.dir/build.make:66: CMakeFiles/cmTC_0de29.dir/CheckIncludeFile.c.obj] Error 1
make[2]: Leaving directory '/home/buildbot/slave/monero-static-win32/build/build/release/CMakeFiles/CMakeTmp'
make[1]: *** [Makefile:121: cmTC_0de29/fast] Error 2
make[1]: Leaving directory '/home/buildbot/slave/monero-static-win32/build/build/release/CMakeFiles/CMakeTmp'


Determining if the include file netdb.h exists failed with the following output:
Change Dir: C:/msys32/home/buildbot/slave/monero-static-win32/build/build/release/CMakeFiles/CMakeTmp

Run Build Command:"C:/msys32/usr/bin/make.exe" "cmTC_2932d/fast"
make[1]: Entering directory '/home/buildbot/slave/monero-static-win32/build/build/release/CMakeFiles/CMakeTmp'
/usr/bin/make -f CMakeFiles/cmTC_2932d.dir/build.make CMakeFiles/cmTC_2932d.dir/build
make[2]: Entering directory '/home/buildbot/slave/monero-static-win32/build/build/release/CMakeFiles/CMakeTmp'
Building C object CMakeFiles/cmTC_2932d.dir/CheckIncludeFile.c.obj

/C/msys32/mingw32/bin/i686-w64-mingw32-gcc.exe    -o CMakeFiles/cmTC_2932d.dir/CheckIncludeFile.c.obj   -c /C/msys32/home/buildbot/slave/monero-static-win32/build/build/release/CMakeFiles/CMakeTmp/CheckIncludeFile.c
C:/msys32/home/buildbot/slave/monero-static-win32/build/build/release/CMakeFiles/CMakeTmp/CheckIncludeFile.c:1:10: fatal error: netdb.h: No such file or directory

 #include <netdb.h>

          ^~~~~~~~~

compilation terminated.

make[2]: *** [CMakeFiles/cmTC_2932d.dir/build.make:66: CMakeFiles/cmTC_2932d.dir/CheckIncludeFile.c.obj] Error 1
make[2]: Leaving directory '/home/buildbot/slave/monero-static-win32/build/build/release/CMakeFiles/CMakeTmp'
make[1]: *** [Makefile:121: cmTC_2932d/fast] Error 2
make[1]: Leaving directory '/home/buildbot/slave/monero-static-win32/build/build/release/CMakeFiles/CMakeTmp'


Determining if the include file netinet/in.h exists failed with the following output:
Change Dir: C:/msys32/home/buildbot/slave/monero-static-win32/build/build/release/CMakeFiles/CMakeTmp

Run Build Command:"C:/msys32/usr/bin/make.exe" "cmTC_5e17d/fast"
make[1]: Entering directory '/home/buildbot/slave/monero-static-win32/build/build/release/CMakeFiles/CMakeTmp'
/usr/bin/make -f CMakeFiles/cmTC_5e17d.dir/build.make CMakeFiles/cmTC_5e17d.dir/build
make[2]: Entering directory '/home/buildbot/slave/monero-static-win32/build/build/release/CMakeFiles/CMakeTmp'
Building C object CMakeFiles/cmTC_5e17d.dir/CheckIncludeFile.c.obj

/C/msys32/mingw32/bin/i686-w64-mingw32-gcc.exe    -o CMakeFiles/cmTC_5e17d.dir/CheckIncludeFile.c.obj   -c /C/msys32/home/buildbot/slave/monero-static-win32/build/build/release/CMakeFiles/CMakeTmp/CheckIncludeFile.c
C:/msys32/home/buildbot/slave/monero-static-win32/build/build/release/CMakeFiles/CMakeTmp/CheckIncludeFile.c:1:10: fatal error: netinet/in.h: No such file or directory

 #include <netinet/in.h>

          ^~~~~~~~~~~~~~

compilation terminated.

make[2]: *** [CMakeFiles/cmTC_5e17d.dir/build.make:66: CMakeFiles/cmTC_5e17d.dir/CheckIncludeFile.c.obj] Error 1
make[2]: Leaving directory '/home/buildbot/slave/monero-static-win32/build/build/release/CMakeFiles/CMakeTmp'
make[1]: *** [Makefile:121: cmTC_5e17d/fast] Error 2
make[1]: Leaving directory '/home/buildbot/slave/monero-static-win32/build/build/release/CMakeFiles/CMakeTmp'


Determining if the include file pwd.h exists failed with the following output:
Change Dir: C:/msys32/home/buildbot/slave/monero-static-win32/build/build/release/CMakeFiles/CMakeTmp

Run Build Command:"C:/msys32/usr/bin/make.exe" "cmTC_a0db4/fast"
make[1]: Entering directory '/home/buildbot/slave/monero-static-win32/build/build/release/CMakeFiles/CMakeTmp'
/usr/bin/make -f CMakeFiles/cmTC_a0db4.dir/build.make CMakeFiles/cmTC_a0db4.dir/build
make[2]: Entering directory '/home/buildbot/slave/monero-static-win32/build/build/release/CMakeFiles/CMakeTmp'
Building C object CMakeFiles/cmTC_a0db4.dir/CheckIncludeFile.c.obj

/C/msys32/mingw32/bin/i686-w64-mingw32-gcc.exe    -o CMakeFiles/cmTC_a0db4.dir/CheckIncludeFile.c.obj   -c /C/msys32/home/buildbot/slave/monero-static-win32/build/build/release/CMakeFiles/CMakeTmp/CheckIncludeFile.c
C:/msys32/home/buildbot/slave/monero-static-win32/build/build/release/CMakeFiles/CMakeTmp/CheckIncludeFile.c:1:10: fatal error: pwd.h: No such file or directory

 #include <pwd.h>

          ^~~~~~~

compilation terminated.

make[2]: *** [CMakeFiles/cmTC_a0db4.dir/build.make:66: CMakeFiles/cmTC_a0db4.dir/CheckIncludeFile.c.obj] Error 1
make[2]: Leaving directory '/home/buildbot/slave/monero-static-win32/build/build/release/CMakeFiles/CMakeTmp'
make[1]: *** [Makefile:121: cmTC_a0db4/fast] Error 2
make[1]: Leaving directory '/home/buildbot/slave/monero-static-win32/build/build/release/CMakeFiles/CMakeTmp'


Determining if the include file sys/resource.h exists failed with the following output:
Change Dir: C:/msys32/home/buildbot/slave/monero-static-win32/build/build/release/CMakeFiles/CMakeTmp

Run Build Command:"C:/msys32/usr/bin/make.exe" "cmTC_57840/fast"
make[1]: Entering directory '/home/buildbot/slave/monero-static-win32/build/build/release/CMakeFiles/CMakeTmp'
/usr/bin/make -f CMakeFiles/cmTC_57840.dir/build.make CMakeFiles/cmTC_57840.dir/build
make[2]: Entering directory '/home/buildbot/slave/monero-static-win32/build/build/release/CMakeFiles/CMakeTmp'
Building C object CMakeFiles/cmTC_57840.dir/CheckIncludeFile.c.obj

/C/msys32/mingw32/bin/i686-w64-mingw32-gcc.exe    -o CMakeFiles/cmTC_57840.dir/CheckIncludeFile.c.obj   -c /C/msys32/home/buildbot/slave/monero-static-win32/build/build/release/CMakeFiles/CMakeTmp/CheckIncludeFile.c
C:/msys32/home/buildbot/slave/monero-static-win32/build/build/release/CMakeFiles/CMakeTmp/CheckIncludeFile.c:1:10: fatal error: sys/resource.h: No such file or directory

 #include <sys/resource.h>

          ^~~~~~~~~~~~~~~~

compilation terminated.

make[2]: *** [CMakeFiles/cmTC_57840.dir/build.make:66: CMakeFiles/cmTC_57840.dir/CheckIncludeFile.c.obj] Error 1
make[2]: Leaving directory '/home/buildbot/slave/monero-static-win32/build/build/release/CMakeFiles/CMakeTmp'
make[1]: *** [Makefile:121: cmTC_57840/fast] Error 2
make[1]: Leaving directory '/home/buildbot/slave/monero-static-win32/build/build/release/CMakeFiles/CMakeTmp'


Determining if the include file sys/sha2.h exists failed with the following output:
Change Dir: C:/msys32/home/buildbot/slave/monero-static-win32/build/build/release/CMakeFiles/CMakeTmp

Run Build Command:"C:/msys32/usr/bin/make.exe" "cmTC_533a1/fast"
make[1]: Entering directory '/home/buildbot/slave/monero-static-win32/build/build/release/CMakeFiles/CMakeTmp'
/usr/bin/make -f CMakeFiles/cmTC_533a1.dir/build.make CMakeFiles/cmTC_533a1.dir/build
make[2]: Entering directory '/home/buildbot/slave/monero-static-win32/build/build/release/CMakeFiles/CMakeTmp'
Building C object CMakeFiles/cmTC_533a1.dir/CheckIncludeFile.c.obj

/C/msys32/mingw32/bin/i686-w64-mingw32-gcc.exe    -o CMakeFiles/cmTC_533a1.dir/CheckIncludeFile.c.obj   -c /C/msys32/home/buildbot/slave/monero-static-win32/build/build/release/CMakeFiles/CMakeTmp/CheckIncludeFile.c
C:/msys32/home/buildbot/slave/monero-static-win32/build/build/release/CMakeFiles/CMakeTmp/CheckIncludeFile.c:1:10: fatal error: sys/sha2.h: No such file or directory

 #include <sys/sha2.h>

          ^~~~~~~~~~~~

compilation terminated.

make[2]: *** [CMakeFiles/cmTC_533a1.dir/build.make:66: CMakeFiles/cmTC_533a1.dir/CheckIncludeFile.c.obj] Error 1
make[2]: Leaving directory '/home/buildbot/slave/monero-static-win32/build/build/release/CMakeFiles/CMakeTmp'
make[1]: *** [Makefile:121: cmTC_533a1/fast] Error 2
make[1]: Leaving directory '/home/buildbot/slave/monero-static-win32/build/build/release/CMakeFiles/CMakeTmp'


Determining if the include file sys/socket.h exists failed with the following output:
Change Dir: C:/msys32/home/buildbot/slave/monero-static-win32/build/build/release/CMakeFiles/CMakeTmp

Run Build Command:"C:/msys32/usr/bin/make.exe" "cmTC_94a75/fast"
make[1]: Entering directory '/home/buildbot/slave/monero-static-win32/build/build/release/CMakeFiles/CMakeTmp'
/usr/bin/make -f CMakeFiles/cmTC_94a75.dir/build.make CMakeFiles/cmTC_94a75.dir/build
make[2]: Entering directory '/home/buildbot/slave/monero-static-win32/build/build/release/CMakeFiles/CMakeTmp'
Building C object CMakeFiles/cmTC_94a75.dir/CheckIncludeFile.c.obj

/C/msys32/mingw32/bin/i686-w64-mingw32-gcc.exe    -o CMakeFiles/cmTC_94a75.dir/CheckIncludeFile.c.obj   -c /C/msys32/home/buildbot/slave/monero-static-win32/build/build/release/CMakeFiles/CMakeTmp/CheckIncludeFile.c
C:/msys32/home/buildbot/slave/monero-static-win32/build/build/release/CMakeFiles/CMakeTmp/CheckIncludeFile.c:1:10: fatal error: sys/socket.h: No such file or directory

 #include <sys/socket.h>

          ^~~~~~~~~~~~~~

compilation terminated.

make[2]: *** [CMakeFiles/cmTC_94a75.dir/build.make:66: CMakeFiles/cmTC_94a75.dir/CheckIncludeFile.c.obj] Error 1
make[2]: Leaving directory '/home/buildbot/slave/monero-static-win32/build/build/release/CMakeFiles/CMakeTmp'
make[1]: *** [Makefile:121: cmTC_94a75/fast] Error 2
make[1]: Leaving directory '/home/buildbot/slave/monero-static-win32/build/build/release/CMakeFiles/CMakeTmp'


Determining if the include file sys/sysctl.h exists failed with the following output:
Change Dir: C:/msys32/home/buildbot/slave/monero-static-win32/build/build/release/CMakeFiles/CMakeTmp

Run Build Command:"C:/msys32/usr/bin/make.exe" "cmTC_9df9b/fast"
make[1]: Entering directory '/home/buildbot/slave/monero-static-win32/build/build/release/CMakeFiles/CMakeTmp'
/usr/bin/make -f CMakeFiles/cmTC_9df9b.dir/build.make CMakeFiles/cmTC_9df9b.dir/build
make[2]: Entering directory '/home/buildbot/slave/monero-static-win32/build/build/release/CMakeFiles/CMakeTmp'
Building C object CMakeFiles/cmTC_9df9b.dir/CheckIncludeFile.c.obj

/C/msys32/mingw32/bin/i686-w64-mingw32-gcc.exe    -o CMakeFiles/cmTC_9df9b.dir/CheckIncludeFile.c.obj   -c /C/msys32/home/buildbot/slave/monero-static-win32/build/build/release/CMakeFiles/CMakeTmp/CheckIncludeFile.c
C:/msys32/home/buildbot/slave/monero-static-win32/build/build/release/CMakeFiles/CMakeTmp/CheckIncludeFile.c:1:10: fatal error: sys/sysctl.h: No such file or directory

 #include <sys/sysctl.h>

          ^~~~~~~~~~~~~~

compilation terminated.

make[2]: *** [CMakeFiles/cmTC_9df9b.dir/build.make:66: CMakeFiles/cmTC_9df9b.dir/CheckIncludeFile.c.obj] Error 1
make[2]: Leaving directory '/home/buildbot/slave/monero-static-win32/build/build/release/CMakeFiles/CMakeTmp'
make[1]: *** [Makefile:121: cmTC_9df9b/fast] Error 2
make[1]: Leaving directory '/home/buildbot/slave/monero-static-win32/build/build/release/CMakeFiles/CMakeTmp'


Determining if the include file sys/uio.h exists failed with the following output:
Change Dir: C:/msys32/home/buildbot/slave/monero-static-win32/build/build/release/CMakeFiles/CMakeTmp

Run Build Command:"C:/msys32/usr/bin/make.exe" "cmTC_1b952/fast"
make[1]: Entering directory '/home/buildbot/slave/monero-static-win32/build/build/release/CMakeFiles/CMakeTmp'
/usr/bin/make -f CMakeFiles/cmTC_1b952.dir/build.make CMakeFiles/cmTC_1b952.dir/build
make[2]: Entering directory '/home/buildbot/slave/monero-static-win32/build/build/release/CMakeFiles/CMakeTmp'
Building C object CMakeFiles/cmTC_1b952.dir/CheckIncludeFile.c.obj

/C/msys32/mingw32/bin/i686-w64-mingw32-gcc.exe    -o CMakeFiles/cmTC_1b952.dir/CheckIncludeFile.c.obj   -c /C/msys32/home/buildbot/slave/monero-static-win32/build/build/release/CMakeFiles/CMakeTmp/CheckIncludeFile.c
C:/msys32/home/buildbot/slave/monero-static-win32/build/build/release/CMakeFiles/CMakeTmp/CheckIncludeFile.c:1:10: fatal error: sys/uio.h: No such file or directory

 #include <sys/uio.h>

          ^~~~~~~~~~~

compilation terminated.

make[2]: *** [CMakeFiles/cmTC_1b952.dir/build.make:66: CMakeFiles/cmTC_1b952.dir/CheckIncludeFile.c.obj] Error 1
make[2]: Leaving directory '/home/buildbot/slave/monero-static-win32/build/build/release/CMakeFiles/CMakeTmp'
make[1]: *** [Makefile:121: cmTC_1b952/fast] Error 2
make[1]: Leaving directory '/home/buildbot/slave/monero-static-win32/build/build/release/CMakeFiles/CMakeTmp'


Determining if the include file sys/un.h exists failed with the following output:
Change Dir: C:/msys32/home/buildbot/slave/monero-static-win32/build/build/release/CMakeFiles/CMakeTmp

Run Build Command:"C:/msys32/usr/bin/make.exe" "cmTC_09f0d/fast"
make[1]: Entering directory '/home/buildbot/slave/monero-static-win32/build/build/release/CMakeFiles/CMakeTmp'
/usr/bin/make -f CMakeFiles/cmTC_09f0d.dir/build.make CMakeFiles/cmTC_09f0d.dir/build
make[2]: Entering directory '/home/buildbot/slave/monero-static-win32/build/build/release/CMakeFiles/CMakeTmp'
Building C object CMakeFiles/cmTC_09f0d.dir/CheckIncludeFile.c.obj

/C/msys32/mingw32/bin/i686-w64-mingw32-gcc.exe    -o CMakeFiles/cmTC_09f0d.dir/CheckIncludeFile.c.obj   -c /C/msys32/home/buildbot/slave/monero-static-win32/build/build/release/CMakeFiles/CMakeTmp/CheckIncludeFile.c
C:/msys32/home/buildbot/slave/monero-static-win32/build/build/release/CMakeFiles/CMakeTmp/CheckIncludeFile.c:1:10: fatal error: sys/un.h: No such file or directory

 #include <sys/un.h>

          ^~~~~~~~~~

compilation terminated.

make[2]: *** [CMakeFiles/cmTC_09f0d.dir/build.make:66: CMakeFiles/cmTC_09f0d.dir/CheckIncludeFile.c.obj] Error 1
make[2]: Leaving directory '/home/buildbot/slave/monero-static-win32/build/build/release/CMakeFiles/CMakeTmp'
make[1]: *** [Makefile:121: cmTC_09f0d/fast] Error 2
make[1]: Leaving directory '/home/buildbot/slave/monero-static-win32/build/build/release/CMakeFiles/CMakeTmp'


Determining if the include file sys/wait.h exists failed with the following output:
Change Dir: C:/msys32/home/buildbot/slave/monero-static-win32/build/build/release/CMakeFiles/CMakeTmp

Run Build Command:"C:/msys32/usr/bin/make.exe" "cmTC_5cf95/fast"
make[1]: Entering directory '/home/buildbot/slave/monero-static-win32/build/build/release/CMakeFiles/CMakeTmp'
/usr/bin/make -f CMakeFiles/cmTC_5cf95.dir/build.make CMakeFiles/cmTC_5cf95.dir/build
make[2]: Entering directory '/home/buildbot/slave/monero-static-win32/build/build/release/CMakeFiles/CMakeTmp'
Building C object CMakeFiles/cmTC_5cf95.dir/CheckIncludeFile.c.obj

/C/msys32/mingw32/bin/i686-w64-mingw32-gcc.exe    -o CMakeFiles/cmTC_5cf95.dir/CheckIncludeFile.c.obj   -c /C/msys32/home/buildbot/slave/monero-static-win32/build/build/release/CMakeFiles/CMakeTmp/CheckIncludeFile.c
C:/msys32/home/buildbot/slave/monero-static-win32/build/build/release/CMakeFiles/CMakeTmp/CheckIncludeFile.c:1:10: fatal error: sys/wait.h: No such file or directory

 #include <sys/wait.h>

          ^~~~~~~~~~~~

compilation terminated.

make[2]: *** [CMakeFiles/cmTC_5cf95.dir/build.make:66: CMakeFiles/cmTC_5cf95.dir/CheckIncludeFile.c.obj] Error 1
make[2]: Leaving directory '/home/buildbot/slave/monero-static-win32/build/build/release/CMakeFiles/CMakeTmp'
make[1]: *** [Makefile:121: cmTC_5cf95/fast] Error 2
make[1]: Leaving directory '/home/buildbot/slave/monero-static-win32/build/build/release/CMakeFiles/CMakeTmp'


Determining if the include file syslog.h exists failed with the following output:
Change Dir: C:/msys32/home/buildbot/slave/monero-static-win32/build/build/release/CMakeFiles/CMakeTmp

Run Build Command:"C:/msys32/usr/bin/make.exe" "cmTC_b3f20/fast"
make[1]: Entering directory '/home/buildbot/slave/monero-static-win32/build/build/release/CMakeFiles/CMakeTmp'
/usr/bin/make -f CMakeFiles/cmTC_b3f20.dir/build.make CMakeFiles/cmTC_b3f20.dir/build
make[2]: Entering directory '/home/buildbot/slave/monero-static-win32/build/build/release/CMakeFiles/CMakeTmp'
Building C object CMakeFiles/cmTC_b3f20.dir/CheckIncludeFile.c.obj

/C/msys32/mingw32/bin/i686-w64-mingw32-gcc.exe    -o CMakeFiles/cmTC_b3f20.dir/CheckIncludeFile.c.obj   -c /C/msys32/home/buildbot/slave/monero-static-win32/build/build/release/CMakeFiles/CMakeTmp/CheckIncludeFile.c
C:/msys32/home/buildbot/slave/monero-static-win32/build/build/release/CMakeFiles/CMakeTmp/CheckIncludeFile.c:1:10: fatal error: syslog.h: No such file or directory

 #include <syslog.h>

          ^~~~~~~~~~

compilation terminated.

make[2]: *** [CMakeFiles/cmTC_b3f20.dir/build.make:66: CMakeFiles/cmTC_b3f20.dir/CheckIncludeFile.c.obj] Error 1
make[2]: Leaving directory '/home/buildbot/slave/monero-static-win32/build/build/release/CMakeFiles/CMakeTmp'
make[1]: *** [Makefile:121: cmTC_b3f20/fast] Error 2
make[1]: Leaving directory '/home/buildbot/slave/monero-static-win32/build/build/release/CMakeFiles/CMakeTmp'


Determining if the include file vfork.h exists failed with the following output:
Change Dir: C:/msys32/home/buildbot/slave/monero-static-win32/build/build/release/CMakeFiles/CMakeTmp

Run Build Command:"C:/msys32/usr/bin/make.exe" "cmTC_3b618/fast"
make[1]: Entering directory '/home/buildbot/slave/monero-static-win32/build/build/release/CMakeFiles/CMakeTmp'
/usr/bin/make -f CMakeFiles/cmTC_3b618.dir/build.make CMakeFiles/cmTC_3b618.dir/build
make[2]: Entering directory '/home/buildbot/slave/monero-static-win32/build/build/release/CMakeFiles/CMakeTmp'
Building C object CMakeFiles/cmTC_3b618.dir/CheckIncludeFile.c.obj

/C/msys32/mingw32/bin/i686-w64-mingw32-gcc.exe    -o CMakeFiles/cmTC_3b618.dir/CheckIncludeFile.c.obj   -c /C/msys32/home/buildbot/slave/monero-static-win32/build/build/release/CMakeFiles/CMakeTmp/CheckIncludeFile.c
C:/msys32/home/buildbot/slave/monero-static-win32/build/build/release/CMakeFiles/CMakeTmp/CheckIncludeFile.c:1:10: fatal error: vfork.h: No such file or directory

 #include <vfork.h>

          ^~~~~~~~~


compilation terminated.

make[2]: *** [CMakeFiles/cmTC_3b618.dir/build.make:66: CMakeFiles/cmTC_3b618.dir/CheckIncludeFile.c.obj] Error 1
make[2]: Leaving directory '/home/buildbot/slave/monero-static-win32/build/build/release/CMakeFiles/CMakeTmp'
make[1]: *** [Makefile:121: cmTC_3b618/fast] Error 2
make[1]: Leaving directory '/home/buildbot/slave/monero-static-win32/build/build/release/CMakeFiles/CMakeTmp'


Determining if the function arc4random exists failed with the following output:
Change Dir: C:/msys32/home/buildbot/slave/monero-static-win32/build/build/release/CMakeFiles/CMakeTmp

Run Build Command:"C:/msys32/usr/bin/make.exe" "cmTC_7181a/fast"
make[1]: Entering directory '/home/buildbot/slave/monero-static-win32/build/build/release/CMakeFiles/CMakeTmp'
/usr/bin/make -f CMakeFiles/cmTC_7181a.dir/build.make CMakeFiles/cmTC_7181a.dir/build
make[2]: Entering directory '/home/buildbot/slave/monero-static-win32/build/build/release/CMakeFiles/CMakeTmp'
Building C object CMakeFiles/cmTC_7181a.dir/CheckFunctionExists.c.obj

/C/msys32/mingw32/bin/i686-w64-mingw32-gcc.exe   -DCHECK_FUNCTION_EXISTS=arc4random   -o CMakeFiles/cmTC_7181a.dir/CheckFunctionExists.c.obj   -c /C/msys32/mingw32/share/cmake-3.12/Modules/CheckFunctionExists.c
Linking C executable cmTC_7181a.exe

/C/msys32/mingw32/bin/cmake.exe -E remove -f CMakeFiles/cmTC_7181a.dir/objects.a
ar cr CMakeFiles/cmTC_7181a.dir/objects.a "CMakeFiles/cmTC_7181a.dir/CheckFunctionExists.c.obj" 
/C/msys32/mingw32/bin/i686-w64-mingw32-gcc.exe  -DCHECK_FUNCTION_EXISTS=arc4random    -Wl,--whole-archive CMakeFiles/cmTC_7181a.dir/objects.a -Wl,--no-whole-archive  -o cmTC_7181a.exe -Wl,--major-image-version,0,--minor-image-version,0 -liphlpapi -lws2_32 -lkernel32 -luser32 -lgdi32 -lwinspool -lshell32 -lole32 -loleaut32 -luuid -lcomdlg32 -ladvapi32 
CMakeFiles/cmTC_7181a.dir/objects.a(CheckFunctionExists.c.obj):CheckFunctionExists.c:(.text+0xc): undefined reference to `arc4random'

collect2.exe: error: ld returned 1 exit status

make[2]: *** [CMakeFiles/cmTC_7181a.dir/build.make:88: cmTC_7181a.exe] Error 1
make[2]: Leaving directory '/home/buildbot/slave/monero-static-win32/build/build/release/CMakeFiles/CMakeTmp'
make[1]: *** [Makefile:121: cmTC_7181a/fast] Error 2
make[1]: Leaving directory '/home/buildbot/slave/monero-static-win32/build/build/release/CMakeFiles/CMakeTmp'


Determining if the function arc4random_uniform exists failed with the following output:
Change Dir: C:/msys32/home/buildbot/slave/monero-static-win32/build/build/release/CMakeFiles/CMakeTmp

Run Build Command:"C:/msys32/usr/bin/make.exe" "cmTC_0af7e/fast"
make[1]: Entering directory '/home/buildbot/slave/monero-static-win32/build/build/release/CMakeFiles/CMakeTmp'
/usr/bin/make -f CMakeFiles/cmTC_0af7e.dir/build.make CMakeFiles/cmTC_0af7e.dir/build
make[2]: Entering directory '/home/buildbot/slave/monero-static-win32/build/build/release/CMakeFiles/CMakeTmp'
Building C object CMakeFiles/cmTC_0af7e.dir/CheckFunctionExists.c.obj

/C/msys32/mingw32/bin/i686-w64-mingw32-gcc.exe   -DCHECK_FUNCTION_EXISTS=arc4random_uniform   -o CMakeFiles/cmTC_0af7e.dir/CheckFunctionExists.c.obj   -c /C/msys32/mingw32/share/cmake-3.12/Modules/CheckFunctionExists.c
Linking C executable cmTC_0af7e.exe

/C/msys32/mingw32/bin/cmake.exe -E remove -f CMakeFiles/cmTC_0af7e.dir/objects.a
ar cr CMakeFiles/cmTC_0af7e.dir/objects.a "CMakeFiles/cmTC_0af7e.dir/CheckFunctionExists.c.obj" 
/C/msys32/mingw32/bin/i686-w64-mingw32-gcc.exe  -DCHECK_FUNCTION_EXISTS=arc4random_uniform    -Wl,--whole-archive CMakeFiles/cmTC_0af7e.dir/objects.a -Wl,--no-whole-archive  -o cmTC_0af7e.exe -Wl,--major-image-version,0,--minor-image-version,0 -liphlpapi -lws2_32 -lkernel32 -luser32 -lgdi32 -lwinspool -lshell32 -lole32 -loleaut32 -luuid -lcomdlg32 -ladvapi32 
CMakeFiles/cmTC_0af7e.dir/objects.a(CheckFunctionExists.c.obj):CheckFunctionExists.c:(.text+0xc): undefined reference to `arc4random_uniform'

collect2.exe: error: ld returned 1 exit status

make[2]: *** [CMakeFiles/cmTC_0af7e.dir/build.make:88: cmTC_0af7e.exe] Error 1
make[2]: Leaving directory '/home/buildbot/slave/monero-static-win32/build/build/release/CMakeFiles/CMakeTmp'
make[1]: *** [Makefile:121: cmTC_0af7e/fast] Error 2
make[1]: Leaving directory '/home/buildbot/slave/monero-static-win32/build/build/release/CMakeFiles/CMakeTmp'


Determining if the function chown exists failed with the following output:
Change Dir: C:/msys32/home/buildbot/slave/monero-static-win32/build/build/release/CMakeFiles/CMakeTmp

Run Build Command:"C:/msys32/usr/bin/make.exe" "cmTC_a83e9/fast"
make[1]: Entering directory '/home/buildbot/slave/monero-static-win32/build/build/release/CMakeFiles/CMakeTmp'
/usr/bin/make -f CMakeFiles/cmTC_a83e9.dir/build.make CMakeFiles/cmTC_a83e9.dir/build
make[2]: Entering directory '/home/buildbot/slave/monero-static-win32/build/build/release/CMakeFiles/CMakeTmp'
Building C object CMakeFiles/cmTC_a83e9.dir/CheckFunctionExists.c.obj

/C/msys32/mingw32/bin/i686-w64-mingw32-gcc.exe   -DCHECK_FUNCTION_EXISTS=chown   -o CMakeFiles/cmTC_a83e9.dir/CheckFunctionExists.c.obj   -c /C/msys32/mingw32/share/cmake-3.12/Modules/CheckFunctionExists.c
Linking C executable cmTC_a83e9.exe

/C/msys32/mingw32/bin/cmake.exe -E remove -f CMakeFiles/cmTC_a83e9.dir/objects.a
ar cr CMakeFiles/cmTC_a83e9.dir/objects.a "CMakeFiles/cmTC_a83e9.dir/CheckFunctionExists.c.obj" 
/C/msys32/mingw32/bin/i686-w64-mingw32-gcc.exe  -DCHECK_FUNCTION_EXISTS=chown    -Wl,--whole-archive CMakeFiles/cmTC_a83e9.dir/objects.a -Wl,--no-whole-archive  -o cmTC_a83e9.exe -Wl,--major-image-version,0,--minor-image-version,0 -liphlpapi -lws2_32 -lkernel32 -luser32 -lgdi32 -lwinspool -lshell32 -lole32 -loleaut32 -luuid -lcomdlg32 -ladvapi32 
CMakeFiles/cmTC_a83e9.dir/objects.a(CheckFunctionExists.c.obj):CheckFunctionExists.c:(.text+0xc): undefined reference to `chown'

collect2.exe: error: ld returned 1 exit status

make[2]: *** [CMakeFiles/cmTC_a83e9.dir/build.make:88: cmTC_a83e9.exe] Error 1
make[2]: Leaving directory '/home/buildbot/slave/monero-static-win32/build/build/release/CMakeFiles/CMakeTmp'
make[1]: *** [Makefile:121: cmTC_a83e9/fast] Error 2
make[1]: Leaving directory '/home/buildbot/slave/monero-static-win32/build/build/release/CMakeFiles/CMakeTmp'


Determining if the function chroot exists failed with the following output:
Change Dir: C:/msys32/home/buildbot/slave/monero-static-win32/build/build/release/CMakeFiles/CMakeTmp

Run Build Command:"C:/msys32/usr/bin/make.exe" "cmTC_8f1ed/fast"
make[1]: Entering directory '/home/buildbot/slave/monero-static-win32/build/build/release/CMakeFiles/CMakeTmp'
/usr/bin/make -f CMakeFiles/cmTC_8f1ed.dir/build.make CMakeFiles/cmTC_8f1ed.dir/build
make[2]: Entering directory '/home/buildbot/slave/monero-static-win32/build/build/release/CMakeFiles/CMakeTmp'
Building C object CMakeFiles/cmTC_8f1ed.dir/CheckFunctionExists.c.obj

/C/msys32/mingw32/bin/i686-w64-mingw32-gcc.exe   -DCHECK_FUNCTION_EXISTS=chroot   -o CMakeFiles/cmTC_8f1ed.dir/CheckFunctionExists.c.obj   -c /C/msys32/mingw32/share/cmake-3.12/Modules/CheckFunctionExists.c
Linking C executable cmTC_8f1ed.exe

/C/msys32/mingw32/bin/cmake.exe -E remove -f CMakeFiles/cmTC_8f1ed.dir/objects.a
ar cr CMakeFiles/cmTC_8f1ed.dir/objects.a "CMakeFiles/cmTC_8f1ed.dir/CheckFunctionExists.c.obj" 
/C/msys32/mingw32/bin/i686-w64-mingw32-gcc.exe  -DCHECK_FUNCTION_EXISTS=chroot    -Wl,--whole-archive CMakeFiles/cmTC_8f1ed.dir/objects.a -Wl,--no-whole-archive  -o cmTC_8f1ed.exe -Wl,--major-image-version,0,--minor-image-version,0 -liphlpapi -lws2_32 -lkernel32 -luser32 -lgdi32 -lwinspool -lshell32 -lole32 -loleaut32 -luuid -lcomdlg32 -ladvapi32 
CMakeFiles/cmTC_8f1ed.dir/objects.a(CheckFunctionExists.c.obj):CheckFunctionExists.c:(.text+0xc): undefined reference to `chroot'

collect2.exe: error: ld returned 1 exit status

make[2]: *** [CMakeFiles/cmTC_8f1ed.dir/build.make:88: cmTC_8f1ed.exe] Error 1
make[2]: Leaving directory '/home/buildbot/slave/monero-static-win32/build/build/release/CMakeFiles/CMakeTmp'
make[1]: *** [Makefile:121: cmTC_8f1ed/fast] Error 2
make[1]: Leaving directory '/home/buildbot/slave/monero-static-win32/build/build/release/CMakeFiles/CMakeTmp'


Determining if the function ctime_r exists failed with the following output:
Change Dir: C:/msys32/home/buildbot/slave/monero-static-win32/build/build/release/CMakeFiles/CMakeTmp

Run Build Command:"C:/msys32/usr/bin/make.exe" "cmTC_57351/fast"
make[1]: Entering directory '/home/buildbot/slave/monero-static-win32/build/build/release/CMakeFiles/CMakeTmp'
/usr/bin/make -f CMakeFiles/cmTC_57351.dir/build.make CMakeFiles/cmTC_57351.dir/build
make[2]: Entering directory '/home/buildbot/slave/monero-static-win32/build/build/release/CMakeFiles/CMakeTmp'
Building C object CMakeFiles/cmTC_57351.dir/CheckFunctionExists.c.obj

/C/msys32/mingw32/bin/i686-w64-mingw32-gcc.exe   -DCHECK_FUNCTION_EXISTS=ctime_r   -o CMakeFiles/cmTC_57351.dir/CheckFunctionExists.c.obj   -c /C/msys32/mingw32/share/cmake-3.12/Modules/CheckFunctionExists.c
Linking C executable cmTC_57351.exe

/C/msys32/mingw32/bin/cmake.exe -E remove -f CMakeFiles/cmTC_57351.dir/objects.a
ar cr CMakeFiles/cmTC_57351.dir/objects.a "CMakeFiles/cmTC_57351.dir/CheckFunctionExists.c.obj" 
/C/msys32/mingw32/bin/i686-w64-mingw32-gcc.exe  -DCHECK_FUNCTION_EXISTS=ctime_r    -Wl,--whole-archive CMakeFiles/cmTC_57351.dir/objects.a -Wl,--no-whole-archive  -o cmTC_57351.exe -Wl,--major-image-version,0,--minor-image-version,0 -liphlpapi -lws2_32 -lkernel32 -luser32 -lgdi32 -lwinspool -lshell32 -lole32 -loleaut32 -luuid -lcomdlg32 -ladvapi32 
CMakeFiles/cmTC_57351.dir/objects.a(CheckFunctionExists.c.obj):CheckFunctionExists.c:(.text+0xc): undefined reference to `ctime_r'

collect2.exe: error: ld returned 1 exit status

make[2]: *** [CMakeFiles/cmTC_57351.dir/build.make:88: cmTC_57351.exe] Error 1
make[2]: Leaving directory '/home/buildbot/slave/monero-static-win32/build/build/release/CMakeFiles/CMakeTmp'
make[1]: *** [Makefile:121: cmTC_57351/fast] Error 2
make[1]: Leaving directory '/home/buildbot/slave/monero-static-win32/build/build/release/CMakeFiles/CMakeTmp'


Determining if the function daemon exists failed with the following output:
Change Dir: C:/msys32/home/buildbot/slave/monero-static-win32/build/build/release/CMakeFiles/CMakeTmp

Run Build Command:"C:/msys32/usr/bin/make.exe" "cmTC_8e2cd/fast"
make[1]: Entering directory '/home/buildbot/slave/monero-static-win32/build/build/release/CMakeFiles/CMakeTmp'
/usr/bin/make -f CMakeFiles/cmTC_8e2cd.dir/build.make CMakeFiles/cmTC_8e2cd.dir/build
make[2]: Entering directory '/home/buildbot/slave/monero-static-win32/build/build/release/CMakeFiles/CMakeTmp'
Building C object CMakeFiles/cmTC_8e2cd.dir/CheckFunctionExists.c.obj

/C/msys32/mingw32/bin/i686-w64-mingw32-gcc.exe   -DCHECK_FUNCTION_EXISTS=daemon   -o CMakeFiles/cmTC_8e2cd.dir/CheckFunctionExists.c.obj   -c /C/msys32/mingw32/share/cmake-3.12/Modules/CheckFunctionExists.c
Linking C executable cmTC_8e2cd.exe

/C/msys32/mingw32/bin/cmake.exe -E remove -f CMakeFiles/cmTC_8e2cd.dir/objects.a
ar cr CMakeFiles/cmTC_8e2cd.dir/objects.a "CMakeFiles/cmTC_8e2cd.dir/CheckFunctionExists.c.obj" 
/C/msys32/mingw32/bin/i686-w64-mingw32-gcc.exe  -DCHECK_FUNCTION_EXISTS=daemon    -Wl,--whole-archive CMakeFiles/cmTC_8e2cd.dir/objects.a -Wl,--no-whole-archive  -o cmTC_8e2cd.exe -Wl,--major-image-version,0,--minor-image-version,0 -liphlpapi -lws2_32 -lkernel32 -luser32 -lgdi32 -lwinspool -lshell32 -lole32 -loleaut32 -luuid -lcomdlg32 -ladvapi32 
CMakeFiles/cmTC_8e2cd.dir/objects.a(CheckFunctionExists.c.obj):CheckFunctionExists.c:(.text+0xc): undefined reference to `daemon'

collect2.exe: error: ld returned 1 exit status

make[2]: *** [CMakeFiles/cmTC_8e2cd.dir/build.make:88: cmTC_8e2cd.exe] Error 1
make[2]: Leaving directory '/home/buildbot/slave/monero-static-win32/build/build/release/CMakeFiles/CMakeTmp'
make[1]: *** [Makefile:121: cmTC_8e2cd/fast] Error 2
make[1]: Leaving directory '/home/buildbot/slave/monero-static-win32/build/build/release/CMakeFiles/CMakeTmp'


Determining if the function endprotoent exists failed with the following output:
Change Dir: C:/msys32/home/buildbot/slave/monero-static-win32/build/build/release/CMakeFiles/CMakeTmp

Run Build Command:"C:/msys32/usr/bin/make.exe" "cmTC_ef761/fast"
make[1]: Entering directory '/home/buildbot/slave/monero-static-win32/build/build/release/CMakeFiles/CMakeTmp'
/usr/bin/make -f CMakeFiles/cmTC_ef761.dir/build.make CMakeFiles/cmTC_ef761.dir/build
make[2]: Entering directory '/home/buildbot/slave/monero-static-win32/build/build/release/CMakeFiles/CMakeTmp'
Building C object CMakeFiles/cmTC_ef761.dir/CheckFunctionExists.c.obj

/C/msys32/mingw32/bin/i686-w64-mingw32-gcc.exe   -DCHECK_FUNCTION_EXISTS=endprotoent   -o CMakeFiles/cmTC_ef761.dir/CheckFunctionExists.c.obj   -c /C/msys32/mingw32/share/cmake-3.12/Modules/CheckFunctionExists.c
Linking C executable cmTC_ef761.exe

/C/msys32/mingw32/bin/cmake.exe -E remove -f CMakeFiles/cmTC_ef761.dir/objects.a
ar cr CMakeFiles/cmTC_ef761.dir/objects.a "CMakeFiles/cmTC_ef761.dir/CheckFunctionExists.c.obj" 
/C/msys32/mingw32/bin/i686-w64-mingw32-gcc.exe  -DCHECK_FUNCTION_EXISTS=endprotoent    -Wl,--whole-archive CMakeFiles/cmTC_ef761.dir/objects.a -Wl,--no-whole-archive  -o cmTC_ef761.exe -Wl,--major-image-version,0,--minor-image-version,0 -liphlpapi -lws2_32 -lkernel32 -luser32 -lgdi32 -lwinspool -lshell32 -lole32 -loleaut32 -luuid -lcomdlg32 -ladvapi32 
CMakeFiles/cmTC_ef761.dir/objects.a(CheckFunctionExists.c.obj):CheckFunctionExists.c:(.text+0xc): undefined reference to `endprotoent'

collect2.exe: error: ld returned 1 exit status

make[2]: *** [CMakeFiles/cmTC_ef761.dir/build.make:88: cmTC_ef761.exe] Error 1
make[2]: Leaving directory '/home/buildbot/slave/monero-static-win32/build/build/release/CMakeFiles/CMakeTmp'
make[1]: *** [Makefile:121: cmTC_ef761/fast] Error 2
make[1]: Leaving directory '/home/buildbot/slave/monero-static-win32/build/build/release/CMakeFiles/CMakeTmp'


Determining if the function endservent exists failed with the following output:
Change Dir: C:/msys32/home/buildbot/slave/monero-static-win32/build/build/release/CMakeFiles/CMakeTmp

Run Build Command:"C:/msys32/usr/bin/make.exe" "cmTC_4f5c9/fast"
make[1]: Entering directory '/home/buildbot/slave/monero-static-win32/build/build/release/CMakeFiles/CMakeTmp'
/usr/bin/make -f CMakeFiles/cmTC_4f5c9.dir/build.make CMakeFiles/cmTC_4f5c9.dir/build
make[2]: Entering directory '/home/buildbot/slave/monero-static-win32/build/build/release/CMakeFiles/CMakeTmp'
Building C object CMakeFiles/cmTC_4f5c9.dir/CheckFunctionExists.c.obj

/C/msys32/mingw32/bin/i686-w64-mingw32-gcc.exe   -DCHECK_FUNCTION_EXISTS=endservent   -o CMakeFiles/cmTC_4f5c9.dir/CheckFunctionExists.c.obj   -c /C/msys32/mingw32/share/cmake-3.12/Modules/CheckFunctionExists.c
Linking C executable cmTC_4f5c9.exe

/C/msys32/mingw32/bin/cmake.exe -E remove -f CMakeFiles/cmTC_4f5c9.dir/objects.a
ar cr CMakeFiles/cmTC_4f5c9.dir/objects.a "CMakeFiles/cmTC_4f5c9.dir/CheckFunctionExists.c.obj" 
/C/msys32/mingw32/bin/i686-w64-mingw32-gcc.exe  -DCHECK_FUNCTION_EXISTS=endservent    -Wl,--whole-archive CMakeFiles/cmTC_4f5c9.dir/objects.a -Wl,--no-whole-archive  -o cmTC_4f5c9.exe -Wl,--major-image-version,0,--minor-image-version,0 -liphlpapi -lws2_32 -lkernel32 -luser32 -lgdi32 -lwinspool -lshell32 -lole32 -loleaut32 -luuid -lcomdlg32 -ladvapi32 
CMakeFiles/cmTC_4f5c9.dir/objects.a(CheckFunctionExists.c.obj):CheckFunctionExists.c:(.text+0xc): undefined reference to `endservent'

collect2.exe: error: ld returned 1 exit status

make[2]: *** [CMakeFiles/cmTC_4f5c9.dir/build.make:88: cmTC_4f5c9.exe] Error 1
make[2]: Leaving directory '/home/buildbot/slave/monero-static-win32/build/build/release/CMakeFiles/CMakeTmp'
make[1]: *** [Makefile:121: cmTC_4f5c9/fast] Error 2
make[1]: Leaving directory '/home/buildbot/slave/monero-static-win32/build/build/release/CMakeFiles/CMakeTmp'


Determining if the function fork exists failed with the following output:
Change Dir: C:/msys32/home/buildbot/slave/monero-static-win32/build/build/release/CMakeFiles/CMakeTmp

Run Build Command:"C:/msys32/usr/bin/make.exe" "cmTC_bba49/fast"
make[1]: Entering directory '/home/buildbot/slave/monero-static-win32/build/build/release/CMakeFiles/CMakeTmp'
/usr/bin/make -f CMakeFiles/cmTC_bba49.dir/build.make CMakeFiles/cmTC_bba49.dir/build
make[2]: Entering directory '/home/buildbot/slave/monero-static-win32/build/build/release/CMakeFiles/CMakeTmp'
Building C object CMakeFiles/cmTC_bba49.dir/CheckFunctionExists.c.obj

/C/msys32/mingw32/bin/i686-w64-mingw32-gcc.exe   -DCHECK_FUNCTION_EXISTS=fork   -o CMakeFiles/cmTC_bba49.dir/CheckFunctionExists.c.obj   -c /C/msys32/mingw32/share/cmake-3.12/Modules/CheckFunctionExists.c
<command-line>:0:23: warning: conflicting types for built-in function 'fork' [-Wbuiltin-declaration-mismatch]

C:/msys32/mingw32/share/cmake-3.12/Modules/CheckFunctionExists.c:7:3: note: in expansion of macro 'CHECK_FUNCTION_EXISTS'

   CHECK_FUNCTION_EXISTS(void);

   ^~~~~~~~~~~~~~~~~~~~~

Linking C executable cmTC_bba49.exe

/C/msys32/mingw32/bin/cmake.exe -E remove -f CMakeFiles/cmTC_bba49.dir/objects.a
ar cr CMakeFiles/cmTC_bba49.dir/objects.a "CMakeFiles/cmTC_bba49.dir/CheckFunctionExists.c.obj" 
/C/msys32/mingw32/bin/i686-w64-mingw32-gcc.exe  -DCHECK_FUNCTION_EXISTS=fork    -Wl,--whole-archive CMakeFiles/cmTC_bba49.dir/objects.a -Wl,--no-whole-archive  -o cmTC_bba49.exe -Wl,--major-image-version,0,--minor-image-version,0 -liphlpapi -lws2_32 -lkernel32 -luser32 -lgdi32 -lwinspool -lshell32 -lole32 -loleaut32 -luuid -lcomdlg32 -ladvapi32 
CMakeFiles/cmTC_bba49.dir/objects.a(CheckFunctionExists.c.obj):CheckFunctionExists.c:(.text+0xc): undefined reference to `fork'

collect2.exe: error: ld returned 1 exit status

make[2]: *** [CMakeFiles/cmTC_bba49.dir/build.make:88: cmTC_bba49.exe] Error 1
make[2]: Leaving directory '/home/buildbot/slave/monero-static-win32/build/build/release/CMakeFiles/CMakeTmp'
make[1]: *** [Makefile:121: cmTC_bba49/fast] Error 2
make[1]: Leaving directory '/home/buildbot/slave/monero-static-win32/build/build/release/CMakeFiles/CMakeTmp'


Determining if the function fsync exists failed with the following output:
Change Dir: C:/msys32/home/buildbot/slave/monero-static-win32/build/build/release/CMakeFiles/CMakeTmp

Run Build Command:"C:/msys32/usr/bin/make.exe" "cmTC_5f964/fast"
make[1]: Entering directory '/home/buildbot/slave/monero-static-win32/build/build/release/CMakeFiles/CMakeTmp'
/usr/bin/make -f CMakeFiles/cmTC_5f964.dir/build.make CMakeFiles/cmTC_5f964.dir/build
make[2]: Entering directory '/home/buildbot/slave/monero-static-win32/build/build/release/CMakeFiles/CMakeTmp'
Building C object CMakeFiles/cmTC_5f964.dir/CheckFunctionExists.c.obj

/C/msys32/mingw32/bin/i686-w64-mingw32-gcc.exe   -DCHECK_FUNCTION_EXISTS=fsync   -o CMakeFiles/cmTC_5f964.dir/CheckFunctionExists.c.obj   -c /C/msys32/mingw32/share/cmake-3.12/Modules/CheckFunctionExists.c
Linking C executable cmTC_5f964.exe

/C/msys32/mingw32/bin/cmake.exe -E remove -f CMakeFiles/cmTC_5f964.dir/objects.a
ar cr CMakeFiles/cmTC_5f964.dir/objects.a "CMakeFiles/cmTC_5f964.dir/CheckFunctionExists.c.obj" 
/C/msys32/mingw32/bin/i686-w64-mingw32-gcc.exe  -DCHECK_FUNCTION_EXISTS=fsync    -Wl,--whole-archive CMakeFiles/cmTC_5f964.dir/objects.a -Wl,--no-whole-archive  -o cmTC_5f964.exe -Wl,--major-image-version,0,--minor-image-version,0 -liphlpapi -lws2_32 -lkernel32 -luser32 -lgdi32 -lwinspool -lshell32 -lole32 -loleaut32 -luuid -lcomdlg32 -ladvapi32 
CMakeFiles/cmTC_5f964.dir/objects.a(CheckFunctionExists.c.obj):CheckFunctionExists.c:(.text+0xc): undefined reference to `fsync'

collect2.exe: error: ld returned 1 exit status

make[2]: *** [CMakeFiles/cmTC_5f964.dir/build.make:88: cmTC_5f964.exe] Error 1
make[2]: Leaving directory '/home/buildbot/slave/monero-static-win32/build/build/release/CMakeFiles/CMakeTmp'
make[1]: *** [Makefile:121: cmTC_5f964/fast] Error 2
make[1]: Leaving directory '/home/buildbot/slave/monero-static-win32/build/build/release/CMakeFiles/CMakeTmp'


Determining if the function getauxval exists failed with the following output:
Change Dir: C:/msys32/home/buildbot/slave/monero-static-win32/build/build/release/CMakeFiles/CMakeTmp

Run Build Command:"C:/msys32/usr/bin/make.exe" "cmTC_235ca/fast"
make[1]: Entering directory '/home/buildbot/slave/monero-static-win32/build/build/release/CMakeFiles/CMakeTmp'
/usr/bin/make -f CMakeFiles/cmTC_235ca.dir/build.make CMakeFiles/cmTC_235ca.dir/build
make[2]: Entering directory '/home/buildbot/slave/monero-static-win32/build/build/release/CMakeFiles/CMakeTmp'
Building C object CMakeFiles/cmTC_235ca.dir/CheckFunctionExists.c.obj

/C/msys32/mingw32/bin/i686-w64-mingw32-gcc.exe   -DCHECK_FUNCTION_EXISTS=getauxval   -o CMakeFiles/cmTC_235ca.dir/CheckFunctionExists.c.obj   -c /C/msys32/mingw32/share/cmake-3.12/Modules/CheckFunctionExists.c
Linking C executable cmTC_235ca.exe

/C/msys32/mingw32/bin/cmake.exe -E remove -f CMakeFiles/cmTC_235ca.dir/objects.a
ar cr CMakeFiles/cmTC_235ca.dir/objects.a "CMakeFiles/cmTC_235ca.dir/CheckFunctionExists.c.obj" 
/C/msys32/mingw32/bin/i686-w64-mingw32-gcc.exe  -DCHECK_FUNCTION_EXISTS=getauxval    -Wl,--whole-archive CMakeFiles/cmTC_235ca.dir/objects.a -Wl,--no-whole-archive  -o cmTC_235ca.exe -Wl,--major-image-version,0,--minor-image-version,0 -liphlpapi -lws2_32 -lkernel32 -luser32 -lgdi32 -lwinspool -lshell32 -lole32 -loleaut32 -luuid -lcomdlg32 -ladvapi32 
CMakeFiles/cmTC_235ca.dir/objects.a(CheckFunctionExists.c.obj):CheckFunctionExists.c:(.text+0xc): undefined reference to `getauxval'

collect2.exe: error: ld returned 1 exit status

make[2]: *** [CMakeFiles/cmTC_235ca.dir/build.make:88: cmTC_235ca.exe] Error 1
make[2]: Leaving directory '/home/buildbot/slave/monero-static-win32/build/build/release/CMakeFiles/CMakeTmp'
make[1]: *** [Makefile:121: cmTC_235ca/fast] Error 2
make[1]: Leaving directory '/home/buildbot/slave/monero-static-win32/build/build/release/CMakeFiles/CMakeTmp'


Determining if the function getentropy exists failed with the following output:
Change Dir: C:/msys32/home/buildbot/slave/monero-static-win32/build/build/release/CMakeFiles/CMakeTmp

Run Build Command:"C:/msys32/usr/bin/make.exe" "cmTC_4a26e/fast"
make[1]: Entering directory '/home/buildbot/slave/monero-static-win32/build/build/release/CMakeFiles/CMakeTmp'
/usr/bin/make -f CMakeFiles/cmTC_4a26e.dir/build.make CMakeFiles/cmTC_4a26e.dir/build
make[2]: Entering directory '/home/buildbot/slave/monero-static-win32/build/build/release/CMakeFiles/CMakeTmp'
Building C object CMakeFiles/cmTC_4a26e.dir/CheckFunctionExists.c.obj

/C/msys32/mingw32/bin/i686-w64-mingw32-gcc.exe   -DCHECK_FUNCTION_EXISTS=getentropy   -o CMakeFiles/cmTC_4a26e.dir/CheckFunctionExists.c.obj   -c /C/msys32/mingw32/share/cmake-3.12/Modules/CheckFunctionExists.c
Linking C executable cmTC_4a26e.exe

/C/msys32/mingw32/bin/cmake.exe -E remove -f CMakeFiles/cmTC_4a26e.dir/objects.a
ar cr CMakeFiles/cmTC_4a26e.dir/objects.a "CMakeFiles/cmTC_4a26e.dir/CheckFunctionExists.c.obj" 
/C/msys32/mingw32/bin/i686-w64-mingw32-gcc.exe  -DCHECK_FUNCTION_EXISTS=getentropy    -Wl,--whole-archive CMakeFiles/cmTC_4a26e.dir/objects.a -Wl,--no-whole-archive  -o cmTC_4a26e.exe -Wl,--major-image-version,0,--minor-image-version,0 -liphlpapi -lws2_32 -lkernel32 -luser32 -lgdi32 -lwinspool -lshell32 -lole32 -loleaut32 -luuid -lcomdlg32 -ladvapi32 
CMakeFiles/cmTC_4a26e.dir/objects.a(CheckFunctionExists.c.obj):CheckFunctionExists.c:(.text+0xc): undefined reference to `getentropy'

collect2.exe: error: ld returned 1 exit status

make[2]: *** [CMakeFiles/cmTC_4a26e.dir/build.make:88: cmTC_4a26e.exe] Error 1
make[2]: Leaving directory '/home/buildbot/slave/monero-static-win32/build/build/release/CMakeFiles/CMakeTmp'
make[1]: *** [Makefile:121: cmTC_4a26e/fast] Error 2
make[1]: Leaving directory '/home/buildbot/slave/monero-static-win32/build/build/release/CMakeFiles/CMakeTmp'


Determining if the function getpwnam exists failed with the following output:
Change Dir: C:/msys32/home/buildbot/slave/monero-static-win32/build/build/release/CMakeFiles/CMakeTmp

Run Build Command:"C:/msys32/usr/bin/make.exe" "cmTC_09882/fast"
make[1]: Entering directory '/home/buildbot/slave/monero-static-win32/build/build/release/CMakeFiles/CMakeTmp'
/usr/bin/make -f CMakeFiles/cmTC_09882.dir/build.make CMakeFiles/cmTC_09882.dir/build
make[2]: Entering directory '/home/buildbot/slave/monero-static-win32/build/build/release/CMakeFiles/CMakeTmp'
Building C object CMakeFiles/cmTC_09882.dir/CheckFunctionExists.c.obj

/C/msys32/mingw32/bin/i686-w64-mingw32-gcc.exe   -DCHECK_FUNCTION_EXISTS=getpwnam   -o CMakeFiles/cmTC_09882.dir/CheckFunctionExists.c.obj   -c /C/msys32/mingw32/share/cmake-3.12/Modules/CheckFunctionExists.c
Linking C executable cmTC_09882.exe

/C/msys32/mingw32/bin/cmake.exe -E remove -f CMakeFiles/cmTC_09882.dir/objects.a
ar cr CMakeFiles/cmTC_09882.dir/objects.a "CMakeFiles/cmTC_09882.dir/CheckFunctionExists.c.obj" 
/C/msys32/mingw32/bin/i686-w64-mingw32-gcc.exe  -DCHECK_FUNCTION_EXISTS=getpwnam    -Wl,--whole-archive CMakeFiles/cmTC_09882.dir/objects.a -Wl,--no-whole-archive  -o cmTC_09882.exe -Wl,--major-image-version,0,--minor-image-version,0 -liphlpapi -lws2_32 -lkernel32 -luser32 -lgdi32 -lwinspool -lshell32 -lole32 -loleaut32 -luuid -lcomdlg32 -ladvapi32 
CMakeFiles/cmTC_09882.dir/objects.a(CheckFunctionExists.c.obj):CheckFunctionExists.c:(.text+0xc): undefined reference to `getpwnam'

collect2.exe: error: ld returned 1 exit status

make[2]: *** [CMakeFiles/cmTC_09882.dir/build.make:88: cmTC_09882.exe] Error 1
make[2]: Leaving directory '/home/buildbot/slave/monero-static-win32/build/build/release/CMakeFiles/CMakeTmp'
make[1]: *** [Makefile:121: cmTC_09882/fast] Error 2
make[1]: Leaving directory '/home/buildbot/slave/monero-static-win32/build/build/release/CMakeFiles/CMakeTmp'


Determining if the function getrlimit exists failed with the following output:
Change Dir: C:/msys32/home/buildbot/slave/monero-static-win32/build/build/release/CMakeFiles/CMakeTmp

Run Build Command:"C:/msys32/usr/bin/make.exe" "cmTC_ef879/fast"
make[1]: Entering directory '/home/buildbot/slave/monero-static-win32/build/build/release/CMakeFiles/CMakeTmp'
/usr/bin/make -f CMakeFiles/cmTC_ef879.dir/build.make CMakeFiles/cmTC_ef879.dir/build
make[2]: Entering directory '/home/buildbot/slave/monero-static-win32/build/build/release/CMakeFiles/CMakeTmp'
Building C object CMakeFiles/cmTC_ef879.dir/CheckFunctionExists.c.obj

/C/msys32/mingw32/bin/i686-w64-mingw32-gcc.exe   -DCHECK_FUNCTION_EXISTS=getrlimit   -o CMakeFiles/cmTC_ef879.dir/CheckFunctionExists.c.obj   -c /C/msys32/mingw32/share/cmake-3.12/Modules/CheckFunctionExists.c
Linking C executable cmTC_ef879.exe

/C/msys32/mingw32/bin/cmake.exe -E remove -f CMakeFiles/cmTC_ef879.dir/objects.a
ar cr CMakeFiles/cmTC_ef879.dir/objects.a "CMakeFiles/cmTC_ef879.dir/CheckFunctionExists.c.obj" 
/C/msys32/mingw32/bin/i686-w64-mingw32-gcc.exe  -DCHECK_FUNCTION_EXISTS=getrlimit    -Wl,--whole-archive CMakeFiles/cmTC_ef879.dir/objects.a -Wl,--no-whole-archive  -o cmTC_ef879.exe -Wl,--major-image-version,0,--minor-image-version,0 -liphlpapi -lws2_32 -lkernel32 -luser32 -lgdi32 -lwinspool -lshell32 -lole32 -loleaut32 -luuid -lcomdlg32 -ladvapi32 
CMakeFiles/cmTC_ef879.dir/objects.a(CheckFunctionExists.c.obj):CheckFunctionExists.c:(.text+0xc): undefined reference to `getrlimit'

collect2.exe: error: ld returned 1 exit status

make[2]: *** [CMakeFiles/cmTC_ef879.dir/build.make:88: cmTC_ef879.exe] Error 1
make[2]: Leaving directory '/home/buildbot/slave/monero-static-win32/build/build/release/CMakeFiles/CMakeTmp'
make[1]: *** [Makefile:121: cmTC_ef879/fast] Error 2
make[1]: Leaving directory '/home/buildbot/slave/monero-static-win32/build/build/release/CMakeFiles/CMakeTmp'


Determining if the function glob exists failed with the following output:
Change Dir: C:/msys32/home/buildbot/slave/monero-static-win32/build/build/release/CMakeFiles/CMakeTmp

Run Build Command:"C:/msys32/usr/bin/make.exe" "cmTC_802f1/fast"
make[1]: Entering directory '/home/buildbot/slave/monero-static-win32/build/build/release/CMakeFiles/CMakeTmp'
/usr/bin/make -f CMakeFiles/cmTC_802f1.dir/build.make CMakeFiles/cmTC_802f1.dir/build
make[2]: Entering directory '/home/buildbot/slave/monero-static-win32/build/build/release/CMakeFiles/CMakeTmp'
Building C object CMakeFiles/cmTC_802f1.dir/CheckFunctionExists.c.obj

/C/msys32/mingw32/bin/i686-w64-mingw32-gcc.exe   -DCHECK_FUNCTION_EXISTS=glob   -o CMakeFiles/cmTC_802f1.dir/CheckFunctionExists.c.obj   -c /C/msys32/mingw32/share/cmake-3.12/Modules/CheckFunctionExists.c
Linking C executable cmTC_802f1.exe

/C/msys32/mingw32/bin/cmake.exe -E remove -f CMakeFiles/cmTC_802f1.dir/objects.a
ar cr CMakeFiles/cmTC_802f1.dir/objects.a "CMakeFiles/cmTC_802f1.dir/CheckFunctionExists.c.obj" 
/C/msys32/mingw32/bin/i686-w64-mingw32-gcc.exe  -DCHECK_FUNCTION_EXISTS=glob    -Wl,--whole-archive CMakeFiles/cmTC_802f1.dir/objects.a -Wl,--no-whole-archive  -o cmTC_802f1.exe -Wl,--major-image-version,0,--minor-image-version,0 -liphlpapi -lws2_32 -lkernel32 -luser32 -lgdi32 -lwinspool -lshell32 -lole32 -loleaut32 -luuid -lcomdlg32 -ladvapi32 
CMakeFiles/cmTC_802f1.dir/objects.a(CheckFunctionExists.c.obj):CheckFunctionExists.c:(.text+0xc): undefined reference to `glob'

collect2.exe: error: ld returned 1 exit status

make[2]: *** [CMakeFiles/cmTC_802f1.dir/build.make:88: cmTC_802f1.exe] Error 1
make[2]: Leaving directory '/home/buildbot/slave/monero-static-win32/build/build/release/CMakeFiles/CMakeTmp'
make[1]: *** [Makefile:121: cmTC_802f1/fast] Error 2
make[1]: Leaving directory '/home/buildbot/slave/monero-static-win32/build/build/release/CMakeFiles/CMakeTmp'


Determining if the function gmtime_r exists failed with the following output:
Change Dir: C:/msys32/home/buildbot/slave/monero-static-win32/build/build/release/CMakeFiles/CMakeTmp

Run Build Command:"C:/msys32/usr/bin/make.exe" "cmTC_852f0/fast"
make[1]: Entering directory '/home/buildbot/slave/monero-static-win32/build/build/release/CMakeFiles/CMakeTmp'
/usr/bin/make -f CMakeFiles/cmTC_852f0.dir/build.make CMakeFiles/cmTC_852f0.dir/build
make[2]: Entering directory '/home/buildbot/slave/monero-static-win32/build/build/release/CMakeFiles/CMakeTmp'
Building C object CMakeFiles/cmTC_852f0.dir/CheckFunctionExists.c.obj

/C/msys32/mingw32/bin/i686-w64-mingw32-gcc.exe   -DCHECK_FUNCTION_EXISTS=gmtime_r   -o CMakeFiles/cmTC_852f0.dir/CheckFunctionExists.c.obj   -c /C/msys32/mingw32/share/cmake-3.12/Modules/CheckFunctionExists.c
Linking C executable cmTC_852f0.exe

/C/msys32/mingw32/bin/cmake.exe -E remove -f CMakeFiles/cmTC_852f0.dir/objects.a
ar cr CMakeFiles/cmTC_852f0.dir/objects.a "CMakeFiles/cmTC_852f0.dir/CheckFunctionExists.c.obj" 
/C/msys32/mingw32/bin/i686-w64-mingw32-gcc.exe  -DCHECK_FUNCTION_EXISTS=gmtime_r    -Wl,--whole-archive CMakeFiles/cmTC_852f0.dir/objects.a -Wl,--no-whole-archive  -o cmTC_852f0.exe -Wl,--major-image-version,0,--minor-image-version,0 -liphlpapi -lws2_32 -lkernel32 -luser32 -lgdi32 -lwinspool -lshell32 -lole32 -loleaut32 -luuid -lcomdlg32 -ladvapi32 
CMakeFiles/cmTC_852f0.dir/objects.a(CheckFunctionExists.c.obj):CheckFunctionExists.c:(.text+0xc): undefined reference to `gmtime_r'

collect2.exe: error: ld returned 1 exit status

make[2]: *** [CMakeFiles/cmTC_852f0.dir/build.make:88: cmTC_852f0.exe] Error 1
make[2]: Leaving directory '/home/buildbot/slave/monero-static-win32/build/build/release/CMakeFiles/CMakeTmp'
make[1]: *** [Makefile:121: cmTC_852f0/fast] Error 2
make[1]: Leaving directory '/home/buildbot/slave/monero-static-win32/build/build/release/CMakeFiles/CMakeTmp'


Determining if the function fcntl exists failed with the following output:
Change Dir: C:/msys32/home/buildbot/slave/monero-static-win32/build/build/release/CMakeFiles/CMakeTmp

Run Build Command:"C:/msys32/usr/bin/make.exe" "cmTC_9e4ba/fast"
make[1]: Entering directory '/home/buildbot/slave/monero-static-win32/build/build/release/CMakeFiles/CMakeTmp'
/usr/bin/make -f CMakeFiles/cmTC_9e4ba.dir/build.make CMakeFiles/cmTC_9e4ba.dir/build
make[2]: Entering directory '/home/buildbot/slave/monero-static-win32/build/build/release/CMakeFiles/CMakeTmp'
Building C object CMakeFiles/cmTC_9e4ba.dir/CheckFunctionExists.c.obj

/C/msys32/mingw32/bin/i686-w64-mingw32-gcc.exe   -DCHECK_FUNCTION_EXISTS=fcntl   -o CMakeFiles/cmTC_9e4ba.dir/CheckFunctionExists.c.obj   -c /C/msys32/mingw32/share/cmake-3.12/Modules/CheckFunctionExists.c
Linking C executable cmTC_9e4ba.exe

/C/msys32/mingw32/bin/cmake.exe -E remove -f CMakeFiles/cmTC_9e4ba.dir/objects.a
ar cr CMakeFiles/cmTC_9e4ba.dir/objects.a "CMakeFiles/cmTC_9e4ba.dir/CheckFunctionExists.c.obj" 
/C/msys32/mingw32/bin/i686-w64-mingw32-gcc.exe  -DCHECK_FUNCTION_EXISTS=fcntl    -Wl,--whole-archive CMakeFiles/cmTC_9e4ba.dir/objects.a -Wl,--no-whole-archive  -o cmTC_9e4ba.exe -Wl,--major-image-version,0,--minor-image-version,0 -liphlpapi -lws2_32 -lkernel32 -luser32 -lgdi32 -lwinspool -lshell32 -lole32 -loleaut32 -luuid -lcomdlg32 -ladvapi32 
CMakeFiles/cmTC_9e4ba.dir/objects.a(CheckFunctionExists.c.obj):CheckFunctionExists.c:(.text+0xc): undefined reference to `fcntl'

collect2.exe: error: ld returned 1 exit status

make[2]: *** [CMakeFiles/cmTC_9e4ba.dir/build.make:88: cmTC_9e4ba.exe] Error 1
make[2]: Leaving directory '/home/buildbot/slave/monero-static-win32/build/build/release/CMakeFiles/CMakeTmp'
make[1]: *** [Makefile:121: cmTC_9e4ba/fast] Error 2
make[1]: Leaving directory '/home/buildbot/slave/monero-static-win32/build/build/release/CMakeFiles/CMakeTmp'


Determining if the function inet_aton exists failed with the following output:
Change Dir: C:/msys32/home/buildbot/slave/monero-static-win32/build/build/release/CMakeFiles/CMakeTmp

Run Build Command:"C:/msys32/usr/bin/make.exe" "cmTC_f7f01/fast"
make[1]: Entering directory '/home/buildbot/slave/monero-static-win32/build/build/release/CMakeFiles/CMakeTmp'
/usr/bin/make -f CMakeFiles/cmTC_f7f01.dir/build.make CMakeFiles/cmTC_f7f01.dir/build
make[2]: Entering directory '/home/buildbot/slave/monero-static-win32/build/build/release/CMakeFiles/CMakeTmp'
Building C object CMakeFiles/cmTC_f7f01.dir/CheckFunctionExists.c.obj

/C/msys32/mingw32/bin/i686-w64-mingw32-gcc.exe   -DCHECK_FUNCTION_EXISTS=inet_aton   -o CMakeFiles/cmTC_f7f01.dir/CheckFunctionExists.c.obj   -c /C/msys32/mingw32/share/cmake-3.12/Modules/CheckFunctionExists.c
Linking C executable cmTC_f7f01.exe

/C/msys32/mingw32/bin/cmake.exe -E remove -f CMakeFiles/cmTC_f7f01.dir/objects.a
ar cr CMakeFiles/cmTC_f7f01.dir/objects.a "CMakeFiles/cmTC_f7f01.dir/CheckFunctionExists.c.obj" 
/C/msys32/mingw32/bin/i686-w64-mingw32-gcc.exe  -DCHECK_FUNCTION_EXISTS=inet_aton    -Wl,--whole-archive CMakeFiles/cmTC_f7f01.dir/objects.a -Wl,--no-whole-archive  -o cmTC_f7f01.exe -Wl,--major-image-version,0,--minor-image-version,0 -liphlpapi -lws2_32 -lkernel32 -luser32 -lgdi32 -lwinspool -lshell32 -lole32 -loleaut32 -luuid -lcomdlg32 -ladvapi32 
CMakeFiles/cmTC_f7f01.dir/objects.a(CheckFunctionExists.c.obj):CheckFunctionExists.c:(.text+0xc): undefined reference to `inet_aton'

collect2.exe: error: ld returned 1 exit status

make[2]: *** [CMakeFiles/cmTC_f7f01.dir/build.make:88: cmTC_f7f01.exe] Error 1
make[2]: Leaving directory '/home/buildbot/slave/monero-static-win32/build/build/release/CMakeFiles/CMakeTmp'
make[1]: *** [Makefile:121: cmTC_f7f01/fast] Error 2
make[1]: Leaving directory '/home/buildbot/slave/monero-static-win32/build/build/release/CMakeFiles/CMakeTmp'


Determining if the function inet_ntop exists failed with the following output:
Change Dir: C:/msys32/home/buildbot/slave/monero-static-win32/build/build/release/CMakeFiles/CMakeTmp

Run Build Command:"C:/msys32/usr/bin/make.exe" "cmTC_f3e18/fast"
make[1]: Entering directory '/home/buildbot/slave/monero-static-win32/build/build/release/CMakeFiles/CMakeTmp'
/usr/bin/make -f CMakeFiles/cmTC_f3e18.dir/build.make CMakeFiles/cmTC_f3e18.dir/build
make[2]: Entering directory '/home/buildbot/slave/monero-static-win32/build/build/release/CMakeFiles/CMakeTmp'
Building C object CMakeFiles/cmTC_f3e18.dir/CheckFunctionExists.c.obj

/C/msys32/mingw32/bin/i686-w64-mingw32-gcc.exe   -DCHECK_FUNCTION_EXISTS=inet_ntop   -o CMakeFiles/cmTC_f3e18.dir/CheckFunctionExists.c.obj   -c /C/msys32/mingw32/share/cmake-3.12/Modules/CheckFunctionExists.c
Linking C executable cmTC_f3e18.exe

/C/msys32/mingw32/bin/cmake.exe -E remove -f CMakeFiles/cmTC_f3e18.dir/objects.a
ar cr CMakeFiles/cmTC_f3e18.dir/objects.a "CMakeFiles/cmTC_f3e18.dir/CheckFunctionExists.c.obj" 
/C/msys32/mingw32/bin/i686-w64-mingw32-gcc.exe  -DCHECK_FUNCTION_EXISTS=inet_ntop    -Wl,--whole-archive CMakeFiles/cmTC_f3e18.dir/objects.a -Wl,--no-whole-archive  -o cmTC_f3e18.exe -Wl,--major-image-version,0,--minor-image-version,0 -liphlpapi -lws2_32 -lkernel32 -luser32 -lgdi32 -lwinspool -lshell32 -lole32 -loleaut32 -luuid -lcomdlg32 -ladvapi32 
CMakeFiles/cmTC_f3e18.dir/objects.a(CheckFunctionExists.c.obj):CheckFunctionExists.c:(.text+0xc): undefined reference to `inet_ntop'

collect2.exe: error: ld returned 1 exit status

make[2]: *** [CMakeFiles/cmTC_f3e18.dir/build.make:88: cmTC_f3e18.exe] Error 1
make[2]: Leaving directory '/home/buildbot/slave/monero-static-win32/build/build/release/CMakeFiles/CMakeTmp'
make[1]: *** [Makefile:121: cmTC_f3e18/fast] Error 2
make[1]: Leaving directory '/home/buildbot/slave/monero-static-win32/build/build/release/CMakeFiles/CMakeTmp'


Determining if the function inet_pton exists failed with the following output:
Change Dir: C:/msys32/home/buildbot/slave/monero-static-win32/build/build/release/CMakeFiles/CMakeTmp

Run Build Command:"C:/msys32/usr/bin/make.exe" "cmTC_030ae/fast"
make[1]: Entering directory '/home/buildbot/slave/monero-static-win32/build/build/release/CMakeFiles/CMakeTmp'
/usr/bin/make -f CMakeFiles/cmTC_030ae.dir/build.make CMakeFiles/cmTC_030ae.dir/build
make[2]: Entering directory '/home/buildbot/slave/monero-static-win32/build/build/release/CMakeFiles/CMakeTmp'
Building C object CMakeFiles/cmTC_030ae.dir/CheckFunctionExists.c.obj

/C/msys32/mingw32/bin/i686-w64-mingw32-gcc.exe   -DCHECK_FUNCTION_EXISTS=inet_pton   -o CMakeFiles/cmTC_030ae.dir/CheckFunctionExists.c.obj   -c /C/msys32/mingw32/share/cmake-3.12/Modules/CheckFunctionExists.c
Linking C executable cmTC_030ae.exe

/C/msys32/mingw32/bin/cmake.exe -E remove -f CMakeFiles/cmTC_030ae.dir/objects.a
ar cr CMakeFiles/cmTC_030ae.dir/objects.a "CMakeFiles/cmTC_030ae.dir/CheckFunctionExists.c.obj" 
/C/msys32/mingw32/bin/i686-w64-mingw32-gcc.exe  -DCHECK_FUNCTION_EXISTS=inet_pton    -Wl,--whole-archive CMakeFiles/cmTC_030ae.dir/objects.a -Wl,--no-whole-archive  -o cmTC_030ae.exe -Wl,--major-image-version,0,--minor-image-version,0 -liphlpapi -lws2_32 -lkernel32 -luser32 -lgdi32 -lwinspool -lshell32 -lole32 -loleaut32 -luuid -lcomdlg32 -ladvapi32 
CMakeFiles/cmTC_030ae.dir/objects.a(CheckFunctionExists.c.obj):CheckFunctionExists.c:(.text+0xc): undefined reference to `inet_pton'

collect2.exe: error: ld returned 1 exit status

make[2]: *** [CMakeFiles/cmTC_030ae.dir/build.make:88: cmTC_030ae.exe] Error 1
make[2]: Leaving directory '/home/buildbot/slave/monero-static-win32/build/build/release/CMakeFiles/CMakeTmp'
make[1]: *** [Makefile:121: cmTC_030ae/fast] Error 2
make[1]: Leaving directory '/home/buildbot/slave/monero-static-win32/build/build/release/CMakeFiles/CMakeTmp'


Determining if the function initgroups exists failed with the following output:
Change Dir: C:/msys32/home/buildbot/slave/monero-static-win32/build/build/release/CMakeFiles/CMakeTmp

Run Build Command:"C:/msys32/usr/bin/make.exe" "cmTC_426e7/fast"
make[1]: Entering directory '/home/buildbot/slave/monero-static-win32/build/build/release/CMakeFiles/CMakeTmp'
/usr/bin/make -f CMakeFiles/cmTC_426e7.dir/build.make CMakeFiles/cmTC_426e7.dir/build
make[2]: Entering directory '/home/buildbot/slave/monero-static-win32/build/build/release/CMakeFiles/CMakeTmp'
Building C object CMakeFiles/cmTC_426e7.dir/CheckFunctionExists.c.obj

/C/msys32/mingw32/bin/i686-w64-mingw32-gcc.exe   -DCHECK_FUNCTION_EXISTS=initgroups   -o CMakeFiles/cmTC_426e7.dir/CheckFunctionExists.c.obj   -c /C/msys32/mingw32/share/cmake-3.12/Modules/CheckFunctionExists.c
Linking C executable cmTC_426e7.exe

/C/msys32/mingw32/bin/cmake.exe -E remove -f CMakeFiles/cmTC_426e7.dir/objects.a
ar cr CMakeFiles/cmTC_426e7.dir/objects.a "CMakeFiles/cmTC_426e7.dir/CheckFunctionExists.c.obj" 
/C/msys32/mingw32/bin/i686-w64-mingw32-gcc.exe  -DCHECK_FUNCTION_EXISTS=initgroups    -Wl,--whole-archive CMakeFiles/cmTC_426e7.dir/objects.a -Wl,--no-whole-archive  -o cmTC_426e7.exe -Wl,--major-image-version,0,--minor-image-version,0 -liphlpapi -lws2_32 -lkernel32 -luser32 -lgdi32 -lwinspool -lshell32 -lole32 -loleaut32 -luuid -lcomdlg32 -ladvapi32 
CMakeFiles/cmTC_426e7.dir/objects.a(CheckFunctionExists.c.obj):CheckFunctionExists.c:(.text+0xc): undefined reference to `initgroups'

collect2.exe: error: ld returned 1 exit status

make[2]: *** [CMakeFiles/cmTC_426e7.dir/build.make:88: cmTC_426e7.exe] Error 1
make[2]: Leaving directory '/home/buildbot/slave/monero-static-win32/build/build/release/CMakeFiles/CMakeTmp'
make[1]: *** [Makefile:121: cmTC_426e7/fast] Error 2
make[1]: Leaving directory '/home/buildbot/slave/monero-static-win32/build/build/release/CMakeFiles/CMakeTmp'


Determining if the function ioctlsocket exists failed with the following output:
Change Dir: C:/msys32/home/buildbot/slave/monero-static-win32/build/build/release/CMakeFiles/CMakeTmp

Run Build Command:"C:/msys32/usr/bin/make.exe" "cmTC_b1d97/fast"
make[1]: Entering directory '/home/buildbot/slave/monero-static-win32/build/build/release/CMakeFiles/CMakeTmp'
/usr/bin/make -f CMakeFiles/cmTC_b1d97.dir/build.make CMakeFiles/cmTC_b1d97.dir/build
make[2]: Entering directory '/home/buildbot/slave/monero-static-win32/build/build/release/CMakeFiles/CMakeTmp'
Building C object CMakeFiles/cmTC_b1d97.dir/CheckFunctionExists.c.obj

/C/msys32/mingw32/bin/i686-w64-mingw32-gcc.exe   -DCHECK_FUNCTION_EXISTS=ioctlsocket   -o CMakeFiles/cmTC_b1d97.dir/CheckFunctionExists.c.obj   -c /C/msys32/mingw32/share/cmake-3.12/Modules/CheckFunctionExists.c
Linking C executable cmTC_b1d97.exe

/C/msys32/mingw32/bin/cmake.exe -E remove -f CMakeFiles/cmTC_b1d97.dir/objects.a
ar cr CMakeFiles/cmTC_b1d97.dir/objects.a "CMakeFiles/cmTC_b1d97.dir/CheckFunctionExists.c.obj" 
/C/msys32/mingw32/bin/i686-w64-mingw32-gcc.exe  -DCHECK_FUNCTION_EXISTS=ioctlsocket    -Wl,--whole-archive CMakeFiles/cmTC_b1d97.dir/objects.a -Wl,--no-whole-archive  -o cmTC_b1d97.exe -Wl,--major-image-version,0,--minor-image-version,0 -liphlpapi -lws2_32 -lkernel32 -luser32 -lgdi32 -lwinspool -lshell32 -lole32 -loleaut32 -luuid -lcomdlg32 -ladvapi32 
CMakeFiles/cmTC_b1d97.dir/objects.a(CheckFunctionExists.c.obj):CheckFunctionExists.c:(.text+0xc): undefined reference to `ioctlsocket'

collect2.exe: error: ld returned 1 exit status

make[2]: *** [CMakeFiles/cmTC_b1d97.dir/build.make:88: cmTC_b1d97.exe] Error 1
make[2]: Leaving directory '/home/buildbot/slave/monero-static-win32/build/build/release/CMakeFiles/CMakeTmp'
make[1]: *** [Makefile:121: cmTC_b1d97/fast] Error 2
make[1]: Leaving directory '/home/buildbot/slave/monero-static-win32/build/build/release/CMakeFiles/CMakeTmp'


Determining if the function kill exists failed with the following output:
Change Dir: C:/msys32/home/buildbot/slave/monero-static-win32/build/build/release/CMakeFiles/CMakeTmp

Run Build Command:"C:/msys32/usr/bin/make.exe" "cmTC_e788c/fast"
make[1]: Entering directory '/home/buildbot/slave/monero-static-win32/build/build/release/CMakeFiles/CMakeTmp'
/usr/bin/make -f CMakeFiles/cmTC_e788c.dir/build.make CMakeFiles/cmTC_e788c.dir/build
make[2]: Entering directory '/home/buildbot/slave/monero-static-win32/build/build/release/CMakeFiles/CMakeTmp'
Building C object CMakeFiles/cmTC_e788c.dir/CheckFunctionExists.c.obj

/C/msys32/mingw32/bin/i686-w64-mingw32-gcc.exe   -DCHECK_FUNCTION_EXISTS=kill   -o CMakeFiles/cmTC_e788c.dir/CheckFunctionExists.c.obj   -c /C/msys32/mingw32/share/cmake-3.12/Modules/CheckFunctionExists.c
Linking C executable cmTC_e788c.exe

/C/msys32/mingw32/bin/cmake.exe -E remove -f CMakeFiles/cmTC_e788c.dir/objects.a
ar cr CMakeFiles/cmTC_e788c.dir/objects.a "CMakeFiles/cmTC_e788c.dir/CheckFunctionExists.c.obj" 
/C/msys32/mingw32/bin/i686-w64-mingw32-gcc.exe  -DCHECK_FUNCTION_EXISTS=kill    -Wl,--whole-archive CMakeFiles/cmTC_e788c.dir/objects.a -Wl,--no-whole-archive  -o cmTC_e788c.exe -Wl,--major-image-version,0,--minor-image-version,0 -liphlpapi -lws2_32 -lkernel32 -luser32 -lgdi32 -lwinspool -lshell32 -lole32 -loleaut32 -luuid -lcomdlg32 -ladvapi32 
CMakeFiles/cmTC_e788c.dir/objects.a(CheckFunctionExists.c.obj):CheckFunctionExists.c:(.text+0xc): undefined reference to `kill'

collect2.exe: error: ld returned 1 exit status

make[2]: *** [CMakeFiles/cmTC_e788c.dir/build.make:88: cmTC_e788c.exe] Error 1
make[2]: Leaving directory '/home/buildbot/slave/monero-static-win32/build/build/release/CMakeFiles/CMakeTmp'
make[1]: *** [Makefile:121: cmTC_e788c/fast] Error 2
make[1]: Leaving directory '/home/buildbot/slave/monero-static-win32/build/build/release/CMakeFiles/CMakeTmp'


Determining if the function localtime_r exists failed with the following output:
Change Dir: C:/msys32/home/buildbot/slave/monero-static-win32/build/build/release/CMakeFiles/CMakeTmp

Run Build Command:"C:/msys32/usr/bin/make.exe" "cmTC_c8711/fast"
make[1]: Entering directory '/home/buildbot/slave/monero-static-win32/build/build/release/CMakeFiles/CMakeTmp'
/usr/bin/make -f CMakeFiles/cmTC_c8711.dir/build.make CMakeFiles/cmTC_c8711.dir/build
make[2]: Entering directory '/home/buildbot/slave/monero-static-win32/build/build/release/CMakeFiles/CMakeTmp'
Building C object CMakeFiles/cmTC_c8711.dir/CheckFunctionExists.c.obj

/C/msys32/mingw32/bin/i686-w64-mingw32-gcc.exe   -DCHECK_FUNCTION_EXISTS=localtime_r   -o CMakeFiles/cmTC_c8711.dir/CheckFunctionExists.c.obj   -c /C/msys32/mingw32/share/cmake-3.12/Modules/CheckFunctionExists.c
Linking C executable cmTC_c8711.exe

/C/msys32/mingw32/bin/cmake.exe -E remove -f CMakeFiles/cmTC_c8711.dir/objects.a
ar cr CMakeFiles/cmTC_c8711.dir/objects.a "CMakeFiles/cmTC_c8711.dir/CheckFunctionExists.c.obj" 
/C/msys32/mingw32/bin/i686-w64-mingw32-gcc.exe  -DCHECK_FUNCTION_EXISTS=localtime_r    -Wl,--whole-archive CMakeFiles/cmTC_c8711.dir/objects.a -Wl,--no-whole-archive  -o cmTC_c8711.exe -Wl,--major-image-version,0,--minor-image-version,0 -liphlpapi -lws2_32 -lkernel32 -luser32 -lgdi32 -lwinspool -lshell32 -lole32 -loleaut32 -luuid -lcomdlg32 -ladvapi32 
CMakeFiles/cmTC_c8711.dir/objects.a(CheckFunctionExists.c.obj):CheckFunctionExists.c:(.text+0xc): undefined reference to `localtime_r'

collect2.exe: error: ld returned 1 exit status

make[2]: *** [CMakeFiles/cmTC_c8711.dir/build.make:88: cmTC_c8711.exe] Error 1
make[2]: Leaving directory '/home/buildbot/slave/monero-static-win32/build/build/release/CMakeFiles/CMakeTmp'
make[1]: *** [Makefile:121: cmTC_c8711/fast] Error 2
make[1]: Leaving directory '/home/buildbot/slave/monero-static-win32/build/build/release/CMakeFiles/CMakeTmp'


Determining if the function random exists failed with the following output:
Change Dir: C:/msys32/home/buildbot/slave/monero-static-win32/build/build/release/CMakeFiles/CMakeTmp

Run Build Command:"C:/msys32/usr/bin/make.exe" "cmTC_bc8eb/fast"
make[1]: Entering directory '/home/buildbot/slave/monero-static-win32/build/build/release/CMakeFiles/CMakeTmp'
/usr/bin/make -f CMakeFiles/cmTC_bc8eb.dir/build.make CMakeFiles/cmTC_bc8eb.dir/build
make[2]: Entering directory '/home/buildbot/slave/monero-static-win32/build/build/release/CMakeFiles/CMakeTmp'
Building C object CMakeFiles/cmTC_bc8eb.dir/CheckFunctionExists.c.obj

/C/msys32/mingw32/bin/i686-w64-mingw32-gcc.exe   -DCHECK_FUNCTION_EXISTS=random   -o CMakeFiles/cmTC_bc8eb.dir/CheckFunctionExists.c.obj   -c /C/msys32/mingw32/share/cmake-3.12/Modules/CheckFunctionExists.c
Linking C executable cmTC_bc8eb.exe

/C/msys32/mingw32/bin/cmake.exe -E remove -f CMakeFiles/cmTC_bc8eb.dir/objects.a
ar cr CMakeFiles/cmTC_bc8eb.dir/objects.a "CMakeFiles/cmTC_bc8eb.dir/CheckFunctionExists.c.obj" 
/C/msys32/mingw32/bin/i686-w64-mingw32-gcc.exe  -DCHECK_FUNCTION_EXISTS=random    -Wl,--whole-archive CMakeFiles/cmTC_bc8eb.dir/objects.a -Wl,--no-whole-archive  -o cmTC_bc8eb.exe -Wl,--major-image-version,0,--minor-image-version,0 -liphlpapi -lws2_32 -lkernel32 -luser32 -lgdi32 -lwinspool -lshell32 -lole32 -loleaut32 -luuid -lcomdlg32 -ladvapi32 
CMakeFiles/cmTC_bc8eb.dir/objects.a(CheckFunctionExists.c.obj):CheckFunctionExists.c:(.text+0xc): undefined reference to `random'

collect2.exe: error: ld returned 1 exit status

make[2]: *** [CMakeFiles/cmTC_bc8eb.dir/build.make:88: cmTC_bc8eb.exe] Error 1
make[2]: Leaving directory '/home/buildbot/slave/monero-static-win32/build/build/release/CMakeFiles/CMakeTmp'
make[1]: *** [Makefile:121: cmTC_bc8eb/fast] Error 2
make[1]: Leaving directory '/home/buildbot/slave/monero-static-win32/build/build/release/CMakeFiles/CMakeTmp'


Determining if the function reallocarray exists failed with the following output:
Change Dir: C:/msys32/home/buildbot/slave/monero-static-win32/build/build/release/CMakeFiles/CMakeTmp

Run Build Command:"C:/msys32/usr/bin/make.exe" "cmTC_f2fa4/fast"
make[1]: Entering directory '/home/buildbot/slave/monero-static-win32/build/build/release/CMakeFiles/CMakeTmp'
/usr/bin/make -f CMakeFiles/cmTC_f2fa4.dir/build.make CMakeFiles/cmTC_f2fa4.dir/build
make[2]: Entering directory '/home/buildbot/slave/monero-static-win32/build/build/release/CMakeFiles/CMakeTmp'
Building C object CMakeFiles/cmTC_f2fa4.dir/CheckFunctionExists.c.obj

/C/msys32/mingw32/bin/i686-w64-mingw32-gcc.exe   -DCHECK_FUNCTION_EXISTS=reallocarray   -o CMakeFiles/cmTC_f2fa4.dir/CheckFunctionExists.c.obj   -c /C/msys32/mingw32/share/cmake-3.12/Modules/CheckFunctionExists.c
Linking C executable cmTC_f2fa4.exe

/C/msys32/mingw32/bin/cmake.exe -E remove -f CMakeFiles/cmTC_f2fa4.dir/objects.a
ar cr CMakeFiles/cmTC_f2fa4.dir/objects.a "CMakeFiles/cmTC_f2fa4.dir/CheckFunctionExists.c.obj" 
/C/msys32/mingw32/bin/i686-w64-mingw32-gcc.exe  -DCHECK_FUNCTION_EXISTS=reallocarray    -Wl,--whole-archive CMakeFiles/cmTC_f2fa4.dir/objects.a -Wl,--no-whole-archive  -o cmTC_f2fa4.exe -Wl,--major-image-version,0,--minor-image-version,0 -liphlpapi -lws2_32 -lkernel32 -luser32 -lgdi32 -lwinspool -lshell32 -lole32 -loleaut32 -luuid -lcomdlg32 -ladvapi32 
CMakeFiles/cmTC_f2fa4.dir/objects.a(CheckFunctionExists.c.obj):CheckFunctionExists.c:(.text+0xc): undefined reference to `reallocarray'

collect2.exe: error: ld returned 1 exit status

make[2]: *** [CMakeFiles/cmTC_f2fa4.dir/build.make:88: cmTC_f2fa4.exe] Error 1
make[2]: Leaving directory '/home/buildbot/slave/monero-static-win32/build/build/release/CMakeFiles/CMakeTmp'
make[1]: *** [Makefile:121: cmTC_f2fa4/fast] Error 2
make[1]: Leaving directory '/home/buildbot/slave/monero-static-win32/build/build/release/CMakeFiles/CMakeTmp'


Determining if the function recvmsg exists failed with the following output:
Change Dir: C:/msys32/home/buildbot/slave/monero-static-win32/build/build/release/CMakeFiles/CMakeTmp

Run Build Command:"C:/msys32/usr/bin/make.exe" "cmTC_e6fe3/fast"
make[1]: Entering directory '/home/buildbot/slave/monero-static-win32/build/build/release/CMakeFiles/CMakeTmp'
/usr/bin/make -f CMakeFiles/cmTC_e6fe3.dir/build.make CMakeFiles/cmTC_e6fe3.dir/build
make[2]: Entering directory '/home/buildbot/slave/monero-static-win32/build/build/release/CMakeFiles/CMakeTmp'
Building C object CMakeFiles/cmTC_e6fe3.dir/CheckFunctionExists.c.obj

/C/msys32/mingw32/bin/i686-w64-mingw32-gcc.exe   -DCHECK_FUNCTION_EXISTS=recvmsg   -o CMakeFiles/cmTC_e6fe3.dir/CheckFunctionExists.c.obj   -c /C/msys32/mingw32/share/cmake-3.12/Modules/CheckFunctionExists.c
Linking C executable cmTC_e6fe3.exe

/C/msys32/mingw32/bin/cmake.exe -E remove -f CMakeFiles/cmTC_e6fe3.dir/objects.a
ar cr CMakeFiles/cmTC_e6fe3.dir/objects.a "CMakeFiles/cmTC_e6fe3.dir/CheckFunctionExists.c.obj" 
/C/msys32/mingw32/bin/i686-w64-mingw32-gcc.exe  -DCHECK_FUNCTION_EXISTS=recvmsg    -Wl,--whole-archive CMakeFiles/cmTC_e6fe3.dir/objects.a -Wl,--no-whole-archive  -o cmTC_e6fe3.exe -Wl,--major-image-version,0,--minor-image-version,0 -liphlpapi -lws2_32 -lkernel32 -luser32 -lgdi32 -lwinspool -lshell32 -lole32 -loleaut32 -luuid -lcomdlg32 -ladvapi32 
CMakeFiles/cmTC_e6fe3.dir/objects.a(CheckFunctionExists.c.obj):CheckFunctionExists.c:(.text+0xc): undefined reference to `recvmsg'

collect2.exe: error: ld returned 1 exit status

make[2]: *** [CMakeFiles/cmTC_e6fe3.dir/build.make:88: cmTC_e6fe3.exe] Error 1
make[2]: Leaving directory '/home/buildbot/slave/monero-static-win32/build/build/release/CMakeFiles/CMakeTmp'
make[1]: *** [Makefile:121: cmTC_e6fe3/fast] Error 2
make[1]: Leaving directory '/home/buildbot/slave/monero-static-win32/build/build/release/CMakeFiles/CMakeTmp'


Determining if the function sbrk exists failed with the following output:
Change Dir: C:/msys32/home/buildbot/slave/monero-static-win32/build/build/release/CMakeFiles/CMakeTmp

Run Build Command:"C:/msys32/usr/bin/make.exe" "cmTC_caef9/fast"
make[1]: Entering directory '/home/buildbot/slave/monero-static-win32/build/build/release/CMakeFiles/CMakeTmp'
/usr/bin/make -f CMakeFiles/cmTC_caef9.dir/build.make CMakeFiles/cmTC_caef9.dir/build
make[2]: Entering directory '/home/buildbot/slave/monero-static-win32/build/build/release/CMakeFiles/CMakeTmp'
Building C object CMakeFiles/cmTC_caef9.dir/CheckFunctionExists.c.obj

/C/msys32/mingw32/bin/i686-w64-mingw32-gcc.exe   -DCHECK_FUNCTION_EXISTS=sbrk   -o CMakeFiles/cmTC_caef9.dir/CheckFunctionExists.c.obj   -c /C/msys32/mingw32/share/cmake-3.12/Modules/CheckFunctionExists.c
Linking C executable cmTC_caef9.exe

/C/msys32/mingw32/bin/cmake.exe -E remove -f CMakeFiles/cmTC_caef9.dir/objects.a
ar cr CMakeFiles/cmTC_caef9.dir/objects.a "CMakeFiles/cmTC_caef9.dir/CheckFunctionExists.c.obj" 
/C/msys32/mingw32/bin/i686-w64-mingw32-gcc.exe  -DCHECK_FUNCTION_EXISTS=sbrk    -Wl,--whole-archive CMakeFiles/cmTC_caef9.dir/objects.a -Wl,--no-whole-archive  -o cmTC_caef9.exe -Wl,--major-image-version,0,--minor-image-version,0 -liphlpapi -lws2_32 -lkernel32 -luser32 -lgdi32 -lwinspool -lshell32 -lole32 -loleaut32 -luuid -lcomdlg32 -ladvapi32 
CMakeFiles/cmTC_caef9.dir/objects.a(CheckFunctionExists.c.obj):CheckFunctionExists.c:(.text+0xc): undefined reference to `sbrk'

collect2.exe: error: ld returned 1 exit status

make[2]: *** [CMakeFiles/cmTC_caef9.dir/build.make:88: cmTC_caef9.exe] Error 1
make[2]: Leaving directory '/home/buildbot/slave/monero-static-win32/build/build/release/CMakeFiles/CMakeTmp'
make[1]: *** [Makefile:121: cmTC_caef9/fast] Error 2
make[1]: Leaving directory '/home/buildbot/slave/monero-static-win32/build/build/release/CMakeFiles/CMakeTmp'


Determining if the function sendmsg exists failed with the following output:
Change Dir: C:/msys32/home/buildbot/slave/monero-static-win32/build/build/release/CMakeFiles/CMakeTmp

Run Build Command:"C:/msys32/usr/bin/make.exe" "cmTC_80a34/fast"
make[1]: Entering directory '/home/buildbot/slave/monero-static-win32/build/build/release/CMakeFiles/CMakeTmp'
/usr/bin/make -f CMakeFiles/cmTC_80a34.dir/build.make CMakeFiles/cmTC_80a34.dir/build
make[2]: Entering directory '/home/buildbot/slave/monero-static-win32/build/build/release/CMakeFiles/CMakeTmp'
Building C object CMakeFiles/cmTC_80a34.dir/CheckFunctionExists.c.obj

/C/msys32/mingw32/bin/i686-w64-mingw32-gcc.exe   -DCHECK_FUNCTION_EXISTS=sendmsg   -o CMakeFiles/cmTC_80a34.dir/CheckFunctionExists.c.obj   -c /C/msys32/mingw32/share/cmake-3.12/Modules/CheckFunctionExists.c
Linking C executable cmTC_80a34.exe

/C/msys32/mingw32/bin/cmake.exe -E remove -f CMakeFiles/cmTC_80a34.dir/objects.a
ar cr CMakeFiles/cmTC_80a34.dir/objects.a "CMakeFiles/cmTC_80a34.dir/CheckFunctionExists.c.obj" 
/C/msys32/mingw32/bin/i686-w64-mingw32-gcc.exe  -DCHECK_FUNCTION_EXISTS=sendmsg    -Wl,--whole-archive CMakeFiles/cmTC_80a34.dir/objects.a -Wl,--no-whole-archive  -o cmTC_80a34.exe -Wl,--major-image-version,0,--minor-image-version,0 -liphlpapi -lws2_32 -lkernel32 -luser32 -lgdi32 -lwinspool -lshell32 -lole32 -loleaut32 -luuid -lcomdlg32 -ladvapi32 
CMakeFiles/cmTC_80a34.dir/objects.a(CheckFunctionExists.c.obj):CheckFunctionExists.c:(.text+0xc): undefined reference to `sendmsg'

collect2.exe: error: ld returned 1 exit status

make[2]: *** [CMakeFiles/cmTC_80a34.dir/build.make:88: cmTC_80a34.exe] Error 1
make[2]: Leaving directory '/home/buildbot/slave/monero-static-win32/build/build/release/CMakeFiles/CMakeTmp'
make[1]: *** [Makefile:121: cmTC_80a34/fast] Error 2
make[1]: Leaving directory '/home/buildbot/slave/monero-static-win32/build/build/release/CMakeFiles/CMakeTmp'


Determining if the function setregid exists failed with the following output:
Change Dir: C:/msys32/home/buildbot/slave/monero-static-win32/build/build/release/CMakeFiles/CMakeTmp

Run Build Command:"C:/msys32/usr/bin/make.exe" "cmTC_778d3/fast"
make[1]: Entering directory '/home/buildbot/slave/monero-static-win32/build/build/release/CMakeFiles/CMakeTmp'
/usr/bin/make -f CMakeFiles/cmTC_778d3.dir/build.make CMakeFiles/cmTC_778d3.dir/build
make[2]: Entering directory '/home/buildbot/slave/monero-static-win32/build/build/release/CMakeFiles/CMakeTmp'
Building C object CMakeFiles/cmTC_778d3.dir/CheckFunctionExists.c.obj

/C/msys32/mingw32/bin/i686-w64-mingw32-gcc.exe   -DCHECK_FUNCTION_EXISTS=setregid   -o CMakeFiles/cmTC_778d3.dir/CheckFunctionExists.c.obj   -c /C/msys32/mingw32/share/cmake-3.12/Modules/CheckFunctionExists.c
Linking C executable cmTC_778d3.exe

/C/msys32/mingw32/bin/cmake.exe -E remove -f CMakeFiles/cmTC_778d3.dir/objects.a
ar cr CMakeFiles/cmTC_778d3.dir/objects.a "CMakeFiles/cmTC_778d3.dir/CheckFunctionExists.c.obj" 
/C/msys32/mingw32/bin/i686-w64-mingw32-gcc.exe  -DCHECK_FUNCTION_EXISTS=setregid    -Wl,--whole-archive CMakeFiles/cmTC_778d3.dir/objects.a -Wl,--no-whole-archive  -o cmTC_778d3.exe -Wl,--major-image-version,0,--minor-image-version,0 -liphlpapi -lws2_32 -lkernel32 -luser32 -lgdi32 -lwinspool -lshell32 -lole32 -loleaut32 -luuid -lcomdlg32 -ladvapi32 
CMakeFiles/cmTC_778d3.dir/objects.a(CheckFunctionExists.c.obj):CheckFunctionExists.c:(.text+0xc): undefined reference to `setregid'

collect2.exe: error: ld returned 1 exit status

make[2]: *** [CMakeFiles/cmTC_778d3.dir/build.make:88: cmTC_778d3.exe] Error 1
make[2]: Leaving directory '/home/buildbot/slave/monero-static-win32/build/build/release/CMakeFiles/CMakeTmp'
make[1]: *** [Makefile:121: cmTC_778d3/fast] Error 2
make[1]: Leaving directory '/home/buildbot/slave/monero-static-win32/build/build/release/CMakeFiles/CMakeTmp'


Determining if the function setresgid exists failed with the following output:
Change Dir: C:/msys32/home/buildbot/slave/monero-static-win32/build/build/release/CMakeFiles/CMakeTmp

Run Build Command:"C:/msys32/usr/bin/make.exe" "cmTC_919f4/fast"
make[1]: Entering directory '/home/buildbot/slave/monero-static-win32/build/build/release/CMakeFiles/CMakeTmp'
/usr/bin/make -f CMakeFiles/cmTC_919f4.dir/build.make CMakeFiles/cmTC_919f4.dir/build
make[2]: Entering directory '/home/buildbot/slave/monero-static-win32/build/build/release/CMakeFiles/CMakeTmp'
Building C object CMakeFiles/cmTC_919f4.dir/CheckFunctionExists.c.obj

/C/msys32/mingw32/bin/i686-w64-mingw32-gcc.exe   -DCHECK_FUNCTION_EXISTS=setresgid   -o CMakeFiles/cmTC_919f4.dir/CheckFunctionExists.c.obj   -c /C/msys32/mingw32/share/cmake-3.12/Modules/CheckFunctionExists.c
Linking C executable cmTC_919f4.exe

/C/msys32/mingw32/bin/cmake.exe -E remove -f CMakeFiles/cmTC_919f4.dir/objects.a
ar cr CMakeFiles/cmTC_919f4.dir/objects.a "CMakeFiles/cmTC_919f4.dir/CheckFunctionExists.c.obj" 
/C/msys32/mingw32/bin/i686-w64-mingw32-gcc.exe  -DCHECK_FUNCTION_EXISTS=setresgid    -Wl,--whole-archive CMakeFiles/cmTC_919f4.dir/objects.a -Wl,--no-whole-archive  -o cmTC_919f4.exe -Wl,--major-image-version,0,--minor-image-version,0 -liphlpapi -lws2_32 -lkernel32 -luser32 -lgdi32 -lwinspool -lshell32 -lole32 -loleaut32 -luuid -lcomdlg32 -ladvapi32 
CMakeFiles/cmTC_919f4.dir/objects.a(CheckFunctionExists.c.obj):CheckFunctionExists.c:(.text+0xc): undefined reference to `setresgid'

collect2.exe: error: ld returned 1 exit status

make[2]: *** [CMakeFiles/cmTC_919f4.dir/build.make:88: cmTC_919f4.exe] Error 1
make[2]: Leaving directory '/home/buildbot/slave/monero-static-win32/build/build/release/CMakeFiles/CMakeTmp'
make[1]: *** [Makefile:121: cmTC_919f4/fast] Error 2
make[1]: Leaving directory '/home/buildbot/slave/monero-static-win32/build/build/release/CMakeFiles/CMakeTmp'


Determining if the function setresuid exists failed with the following output:
Change Dir: C:/msys32/home/buildbot/slave/monero-static-win32/build/build/release/CMakeFiles/CMakeTmp

Run Build Command:"C:/msys32/usr/bin/make.exe" "cmTC_17c2f/fast"
make[1]: Entering directory '/home/buildbot/slave/monero-static-win32/build/build/release/CMakeFiles/CMakeTmp'
/usr/bin/make -f CMakeFiles/cmTC_17c2f.dir/build.make CMakeFiles/cmTC_17c2f.dir/build
make[2]: Entering directory '/home/buildbot/slave/monero-static-win32/build/build/release/CMakeFiles/CMakeTmp'
Building C object CMakeFiles/cmTC_17c2f.dir/CheckFunctionExists.c.obj

/C/msys32/mingw32/bin/i686-w64-mingw32-gcc.exe   -DCHECK_FUNCTION_EXISTS=setresuid   -o CMakeFiles/cmTC_17c2f.dir/CheckFunctionExists.c.obj   -c /C/msys32/mingw32/share/cmake-3.12/Modules/CheckFunctionExists.c
Linking C executable cmTC_17c2f.exe

/C/msys32/mingw32/bin/cmake.exe -E remove -f CMakeFiles/cmTC_17c2f.dir/objects.a
ar cr CMakeFiles/cmTC_17c2f.dir/objects.a "CMakeFiles/cmTC_17c2f.dir/CheckFunctionExists.c.obj" 
/C/msys32/mingw32/bin/i686-w64-mingw32-gcc.exe  -DCHECK_FUNCTION_EXISTS=setresuid    -Wl,--whole-archive CMakeFiles/cmTC_17c2f.dir/objects.a -Wl,--no-whole-archive  -o cmTC_17c2f.exe -Wl,--major-image-version,0,--minor-image-version,0 -liphlpapi -lws2_32 -lkernel32 -luser32 -lgdi32 -lwinspool -lshell32 -lole32 -loleaut32 -luuid -lcomdlg32 -ladvapi32 
CMakeFiles/cmTC_17c2f.dir/objects.a(CheckFunctionExists.c.obj):CheckFunctionExists.c:(.text+0xc): undefined reference to `setresuid'

collect2.exe: error: ld returned 1 exit status

make[2]: *** [CMakeFiles/cmTC_17c2f.dir/build.make:88: cmTC_17c2f.exe] Error 1
make[2]: Leaving directory '/home/buildbot/slave/monero-static-win32/build/build/release/CMakeFiles/CMakeTmp'
make[1]: *** [Makefile:121: cmTC_17c2f/fast] Error 2
make[1]: Leaving directory '/home/buildbot/slave/monero-static-win32/build/build/release/CMakeFiles/CMakeTmp'


Determining if the function setreuid exists failed with the following output:
Change Dir: C:/msys32/home/buildbot/slave/monero-static-win32/build/build/release/CMakeFiles/CMakeTmp

Run Build Command:"C:/msys32/usr/bin/make.exe" "cmTC_98ae3/fast"
make[1]: Entering directory '/home/buildbot/slave/monero-static-win32/build/build/release/CMakeFiles/CMakeTmp'
/usr/bin/make -f CMakeFiles/cmTC_98ae3.dir/build.make CMakeFiles/cmTC_98ae3.dir/build
make[2]: Entering directory '/home/buildbot/slave/monero-static-win32/build/build/release/CMakeFiles/CMakeTmp'
Building C object CMakeFiles/cmTC_98ae3.dir/CheckFunctionExists.c.obj

/C/msys32/mingw32/bin/i686-w64-mingw32-gcc.exe   -DCHECK_FUNCTION_EXISTS=setreuid   -o CMakeFiles/cmTC_98ae3.dir/CheckFunctionExists.c.obj   -c /C/msys32/mingw32/share/cmake-3.12/Modules/CheckFunctionExists.c
Linking C executable cmTC_98ae3.exe

/C/msys32/mingw32/bin/cmake.exe -E remove -f CMakeFiles/cmTC_98ae3.dir/objects.a
ar cr CMakeFiles/cmTC_98ae3.dir/objects.a "CMakeFiles/cmTC_98ae3.dir/CheckFunctionExists.c.obj" 
/C/msys32/mingw32/bin/i686-w64-mingw32-gcc.exe  -DCHECK_FUNCTION_EXISTS=setreuid    -Wl,--whole-archive CMakeFiles/cmTC_98ae3.dir/objects.a -Wl,--no-whole-archive  -o cmTC_98ae3.exe -Wl,--major-image-version,0,--minor-image-version,0 -liphlpapi -lws2_32 -lkernel32 -luser32 -lgdi32 -lwinspool -lshell32 -lole32 -loleaut32 -luuid -lcomdlg32 -ladvapi32 
CMakeFiles/cmTC_98ae3.dir/objects.a(CheckFunctionExists.c.obj):CheckFunctionExists.c:(.text+0xc): undefined reference to `setreuid'

collect2.exe: error: ld returned 1 exit status

make[2]: *** [CMakeFiles/cmTC_98ae3.dir/build.make:88: cmTC_98ae3.exe] Error 1
make[2]: Leaving directory '/home/buildbot/slave/monero-static-win32/build/build/release/CMakeFiles/CMakeTmp'
make[1]: *** [Makefile:121: cmTC_98ae3/fast] Error 2
make[1]: Leaving directory '/home/buildbot/slave/monero-static-win32/build/build/release/CMakeFiles/CMakeTmp'


Determining if the function setrlimit exists failed with the following output:
Change Dir: C:/msys32/home/buildbot/slave/monero-static-win32/build/build/release/CMakeFiles/CMakeTmp

Run Build Command:"C:/msys32/usr/bin/make.exe" "cmTC_0ada3/fast"
make[1]: Entering directory '/home/buildbot/slave/monero-static-win32/build/build/release/CMakeFiles/CMakeTmp'
/usr/bin/make -f CMakeFiles/cmTC_0ada3.dir/build.make CMakeFiles/cmTC_0ada3.dir/build
make[2]: Entering directory '/home/buildbot/slave/monero-static-win32/build/build/release/CMakeFiles/CMakeTmp'
Building C object CMakeFiles/cmTC_0ada3.dir/CheckFunctionExists.c.obj

/C/msys32/mingw32/bin/i686-w64-mingw32-gcc.exe   -DCHECK_FUNCTION_EXISTS=setrlimit   -o CMakeFiles/cmTC_0ada3.dir/CheckFunctionExists.c.obj   -c /C/msys32/mingw32/share/cmake-3.12/Modules/CheckFunctionExists.c
Linking C executable cmTC_0ada3.exe

/C/msys32/mingw32/bin/cmake.exe -E remove -f CMakeFiles/cmTC_0ada3.dir/objects.a
ar cr CMakeFiles/cmTC_0ada3.dir/objects.a "CMakeFiles/cmTC_0ada3.dir/CheckFunctionExists.c.obj" 
/C/msys32/mingw32/bin/i686-w64-mingw32-gcc.exe  -DCHECK_FUNCTION_EXISTS=setrlimit    -Wl,--whole-archive CMakeFiles/cmTC_0ada3.dir/objects.a -Wl,--no-whole-archive  -o cmTC_0ada3.exe -Wl,--major-image-version,0,--minor-image-version,0 -liphlpapi -lws2_32 -lkernel32 -luser32 -lgdi32 -lwinspool -lshell32 -lole32 -loleaut32 -luuid -lcomdlg32 -ladvapi32 
CMakeFiles/cmTC_0ada3.dir/objects.a(CheckFunctionExists.c.obj):CheckFunctionExists.c:(.text+0xc): undefined reference to `setrlimit'

collect2.exe: error: ld returned 1 exit status

make[2]: *** [CMakeFiles/cmTC_0ada3.dir/build.make:88: cmTC_0ada3.exe] Error 1
make[2]: Leaving directory '/home/buildbot/slave/monero-static-win32/build/build/release/CMakeFiles/CMakeTmp'
make[1]: *** [Makefile:121: cmTC_0ada3/fast] Error 2
make[1]: Leaving directory '/home/buildbot/slave/monero-static-win32/build/build/release/CMakeFiles/CMakeTmp'


Determining if the function setsid exists failed with the following output:
Change Dir: C:/msys32/home/buildbot/slave/monero-static-win32/build/build/release/CMakeFiles/CMakeTmp

Run Build Command:"C:/msys32/usr/bin/make.exe" "cmTC_3f0d6/fast"
make[1]: Entering directory '/home/buildbot/slave/monero-static-win32/build/build/release/CMakeFiles/CMakeTmp'
/usr/bin/make -f CMakeFiles/cmTC_3f0d6.dir/build.make CMakeFiles/cmTC_3f0d6.dir/build
make[2]: Entering directory '/home/buildbot/slave/monero-static-win32/build/build/release/CMakeFiles/CMakeTmp'
Building C object CMakeFiles/cmTC_3f0d6.dir/CheckFunctionExists.c.obj

/C/msys32/mingw32/bin/i686-w64-mingw32-gcc.exe   -DCHECK_FUNCTION_EXISTS=setsid   -o CMakeFiles/cmTC_3f0d6.dir/CheckFunctionExists.c.obj   -c /C/msys32/mingw32/share/cmake-3.12/Modules/CheckFunctionExists.c
Linking C executable cmTC_3f0d6.exe

/C/msys32/mingw32/bin/cmake.exe -E remove -f CMakeFiles/cmTC_3f0d6.dir/objects.a
ar cr CMakeFiles/cmTC_3f0d6.dir/objects.a "CMakeFiles/cmTC_3f0d6.dir/CheckFunctionExists.c.obj" 
/C/msys32/mingw32/bin/i686-w64-mingw32-gcc.exe  -DCHECK_FUNCTION_EXISTS=setsid    -Wl,--whole-archive CMakeFiles/cmTC_3f0d6.dir/objects.a -Wl,--no-whole-archive  -o cmTC_3f0d6.exe -Wl,--major-image-version,0,--minor-image-version,0 -liphlpapi -lws2_32 -lkernel32 -luser32 -lgdi32 -lwinspool -lshell32 -lole32 -loleaut32 -luuid -lcomdlg32 -ladvapi32 
CMakeFiles/cmTC_3f0d6.dir/objects.a(CheckFunctionExists.c.obj):CheckFunctionExists.c:(.text+0xc): undefined reference to `setsid'

collect2.exe: error: ld returned 1 exit status

make[2]: *** [CMakeFiles/cmTC_3f0d6.dir/build.make:88: cmTC_3f0d6.exe] Error 1
make[2]: Leaving directory '/home/buildbot/slave/monero-static-win32/build/build/release/CMakeFiles/CMakeTmp'
make[1]: *** [Makefile:121: cmTC_3f0d6/fast] Error 2
make[1]: Leaving directory '/home/buildbot/slave/monero-static-win32/build/build/release/CMakeFiles/CMakeTmp'


Determining if the function setusercontent exists failed with the following output:
Change Dir: C:/msys32/home/buildbot/slave/monero-static-win32/build/build/release/CMakeFiles/CMakeTmp

Run Build Command:"C:/msys32/usr/bin/make.exe" "cmTC_73f78/fast"
make[1]: Entering directory '/home/buildbot/slave/monero-static-win32/build/build/release/CMakeFiles/CMakeTmp'
/usr/bin/make -f CMakeFiles/cmTC_73f78.dir/build.make CMakeFiles/cmTC_73f78.dir/build
make[2]: Entering directory '/home/buildbot/slave/monero-static-win32/build/build/release/CMakeFiles/CMakeTmp'
Building C object CMakeFiles/cmTC_73f78.dir/CheckFunctionExists.c.obj

/C/msys32/mingw32/bin/i686-w64-mingw32-gcc.exe   -DCHECK_FUNCTION_EXISTS=setusercontent   -o CMakeFiles/cmTC_73f78.dir/CheckFunctionExists.c.obj   -c /C/msys32/mingw32/share/cmake-3.12/Modules/CheckFunctionExists.c
Linking C executable cmTC_73f78.exe

/C/msys32/mingw32/bin/cmake.exe -E remove -f CMakeFiles/cmTC_73f78.dir/objects.a
ar cr CMakeFiles/cmTC_73f78.dir/objects.a "CMakeFiles/cmTC_73f78.dir/CheckFunctionExists.c.obj" 
/C/msys32/mingw32/bin/i686-w64-mingw32-gcc.exe  -DCHECK_FUNCTION_EXISTS=setusercontent    -Wl,--whole-archive CMakeFiles/cmTC_73f78.dir/objects.a -Wl,--no-whole-archive  -o cmTC_73f78.exe -Wl,--major-image-version,0,--minor-image-version,0 -liphlpapi -lws2_32 -lkernel32 -luser32 -lgdi32 -lwinspool -lshell32 -lole32 -loleaut32 -luuid -lcomdlg32 -ladvapi32 
CMakeFiles/cmTC_73f78.dir/objects.a(CheckFunctionExists.c.obj):CheckFunctionExists.c:(.text+0xc): undefined reference to `setusercontent'

collect2.exe: error: ld returned 1 exit status

make[2]: *** [CMakeFiles/cmTC_73f78.dir/build.make:88: cmTC_73f78.exe] Error 1
make[2]: Leaving directory '/home/buildbot/slave/monero-static-win32/build/build/release/CMakeFiles/CMakeTmp'
make[1]: *** [Makefile:121: cmTC_73f78/fast] Error 2
make[1]: Leaving directory '/home/buildbot/slave/monero-static-win32/build/build/release/CMakeFiles/CMakeTmp'


Determining if the function sigprocmask exists failed with the following output:
Change Dir: C:/msys32/home/buildbot/slave/monero-static-win32/build/build/release/CMakeFiles/CMakeTmp

Run Build Command:"C:/msys32/usr/bin/make.exe" "cmTC_7034f/fast"
make[1]: Entering directory '/home/buildbot/slave/monero-static-win32/build/build/release/CMakeFiles/CMakeTmp'
/usr/bin/make -f CMakeFiles/cmTC_7034f.dir/build.make CMakeFiles/cmTC_7034f.dir/build
make[2]: Entering directory '/home/buildbot/slave/monero-static-win32/build/build/release/CMakeFiles/CMakeTmp'
Building C object CMakeFiles/cmTC_7034f.dir/CheckFunctionExists.c.obj

/C/msys32/mingw32/bin/i686-w64-mingw32-gcc.exe   -DCHECK_FUNCTION_EXISTS=sigprocmask   -o CMakeFiles/cmTC_7034f.dir/CheckFunctionExists.c.obj   -c /C/msys32/mingw32/share/cmake-3.12/Modules/CheckFunctionExists.c
Linking C executable cmTC_7034f.exe

/C/msys32/mingw32/bin/cmake.exe -E remove -f CMakeFiles/cmTC_7034f.dir/objects.a
ar cr CMakeFiles/cmTC_7034f.dir/objects.a "CMakeFiles/cmTC_7034f.dir/CheckFunctionExists.c.obj" 
/C/msys32/mingw32/bin/i686-w64-mingw32-gcc.exe  -DCHECK_FUNCTION_EXISTS=sigprocmask    -Wl,--whole-archive CMakeFiles/cmTC_7034f.dir/objects.a -Wl,--no-whole-archive  -o cmTC_7034f.exe -Wl,--major-image-version,0,--minor-image-version,0 -liphlpapi -lws2_32 -lkernel32 -luser32 -lgdi32 -lwinspool -lshell32 -lole32 -loleaut32 -luuid -lcomdlg32 -ladvapi32 
CMakeFiles/cmTC_7034f.dir/objects.a(CheckFunctionExists.c.obj):CheckFunctionExists.c:(.text+0xc): undefined reference to `sigprocmask'

collect2.exe: error: ld returned 1 exit status

make[2]: *** [CMakeFiles/cmTC_7034f.dir/build.make:88: cmTC_7034f.exe] Error 1
make[2]: Leaving directory '/home/buildbot/slave/monero-static-win32/build/build/release/CMakeFiles/CMakeTmp'
make[1]: *** [Makefile:121: cmTC_7034f/fast] Error 2
make[1]: Leaving directory '/home/buildbot/slave/monero-static-win32/build/build/release/CMakeFiles/CMakeTmp'


Determining if the function socketpair exists failed with the following output:
Change Dir: C:/msys32/home/buildbot/slave/monero-static-win32/build/build/release/CMakeFiles/CMakeTmp

Run Build Command:"C:/msys32/usr/bin/make.exe" "cmTC_d5948/fast"
make[1]: Entering directory '/home/buildbot/slave/monero-static-win32/build/build/release/CMakeFiles/CMakeTmp'
/usr/bin/make -f CMakeFiles/cmTC_d5948.dir/build.make CMakeFiles/cmTC_d5948.dir/build
make[2]: Entering directory '/home/buildbot/slave/monero-static-win32/build/build/release/CMakeFiles/CMakeTmp'
Building C object CMakeFiles/cmTC_d5948.dir/CheckFunctionExists.c.obj

/C/msys32/mingw32/bin/i686-w64-mingw32-gcc.exe   -DCHECK_FUNCTION_EXISTS=socketpair   -o CMakeFiles/cmTC_d5948.dir/CheckFunctionExists.c.obj   -c /C/msys32/mingw32/share/cmake-3.12/Modules/CheckFunctionExists.c
Linking C executable cmTC_d5948.exe

/C/msys32/mingw32/bin/cmake.exe -E remove -f CMakeFiles/cmTC_d5948.dir/objects.a
ar cr CMakeFiles/cmTC_d5948.dir/objects.a "CMakeFiles/cmTC_d5948.dir/CheckFunctionExists.c.obj" 
/C/msys32/mingw32/bin/i686-w64-mingw32-gcc.exe  -DCHECK_FUNCTION_EXISTS=socketpair    -Wl,--whole-archive CMakeFiles/cmTC_d5948.dir/objects.a -Wl,--no-whole-archive  -o cmTC_d5948.exe -Wl,--major-image-version,0,--minor-image-version,0 -liphlpapi -lws2_32 -lkernel32 -luser32 -lgdi32 -lwinspool -lshell32 -lole32 -loleaut32 -luuid -lcomdlg32 -ladvapi32 
CMakeFiles/cmTC_d5948.dir/objects.a(CheckFunctionExists.c.obj):CheckFunctionExists.c:(.text+0xc): undefined reference to `socketpair'

collect2.exe: error: ld returned 1 exit status

make[2]: *** [CMakeFiles/cmTC_d5948.dir/build.make:88: cmTC_d5948.exe] Error 1
make[2]: Leaving directory '/home/buildbot/slave/monero-static-win32/build/build/release/CMakeFiles/CMakeTmp'
make[1]: *** [Makefile:121: cmTC_d5948/fast] Error 2
make[1]: Leaving directory '/home/buildbot/slave/monero-static-win32/build/build/release/CMakeFiles/CMakeTmp'


Determining if the function srandom exists failed with the following output:
Change Dir: C:/msys32/home/buildbot/slave/monero-static-win32/build/build/release/CMakeFiles/CMakeTmp

Run Build Command:"C:/msys32/usr/bin/make.exe" "cmTC_671dd/fast"
make[1]: Entering directory '/home/buildbot/slave/monero-static-win32/build/build/release/CMakeFiles/CMakeTmp'
/usr/bin/make -f CMakeFiles/cmTC_671dd.dir/build.make CMakeFiles/cmTC_671dd.dir/build
make[2]: Entering directory '/home/buildbot/slave/monero-static-win32/build/build/release/CMakeFiles/CMakeTmp'
Building C object CMakeFiles/cmTC_671dd.dir/CheckFunctionExists.c.obj

/C/msys32/mingw32/bin/i686-w64-mingw32-gcc.exe   -DCHECK_FUNCTION_EXISTS=srandom   -o CMakeFiles/cmTC_671dd.dir/CheckFunctionExists.c.obj   -c /C/msys32/mingw32/share/cmake-3.12/Modules/CheckFunctionExists.c
Linking C executable cmTC_671dd.exe

/C/msys32/mingw32/bin/cmake.exe -E remove -f CMakeFiles/cmTC_671dd.dir/objects.a
ar cr CMakeFiles/cmTC_671dd.dir/objects.a "CMakeFiles/cmTC_671dd.dir/CheckFunctionExists.c.obj" 
/C/msys32/mingw32/bin/i686-w64-mingw32-gcc.exe  -DCHECK_FUNCTION_EXISTS=srandom    -Wl,--whole-archive CMakeFiles/cmTC_671dd.dir/objects.a -Wl,--no-whole-archive  -o cmTC_671dd.exe -Wl,--major-image-version,0,--minor-image-version,0 -liphlpapi -lws2_32 -lkernel32 -luser32 -lgdi32 -lwinspool -lshell32 -lole32 -loleaut32 -luuid -lcomdlg32 -ladvapi32 
CMakeFiles/cmTC_671dd.dir/objects.a(CheckFunctionExists.c.obj):CheckFunctionExists.c:(.text+0xc): undefined reference to `srandom'

collect2.exe: error: ld returned 1 exit status

make[2]: *** [CMakeFiles/cmTC_671dd.dir/build.make:88: cmTC_671dd.exe] Error 1
make[2]: Leaving directory '/home/buildbot/slave/monero-static-win32/build/build/release/CMakeFiles/CMakeTmp'
make[1]: *** [Makefile:121: cmTC_671dd/fast] Error 2
make[1]: Leaving directory '/home/buildbot/slave/monero-static-win32/build/build/release/CMakeFiles/CMakeTmp'


Determining if the function strsep exists failed with the following output:
Change Dir: C:/msys32/home/buildbot/slave/monero-static-win32/build/build/release/CMakeFiles/CMakeTmp

Run Build Command:"C:/msys32/usr/bin/make.exe" "cmTC_82c19/fast"
make[1]: Entering directory '/home/buildbot/slave/monero-static-win32/build/build/release/CMakeFiles/CMakeTmp'
/usr/bin/make -f CMakeFiles/cmTC_82c19.dir/build.make CMakeFiles/cmTC_82c19.dir/build
make[2]: Entering directory '/home/buildbot/slave/monero-static-win32/build/build/release/CMakeFiles/CMakeTmp'
Building C object CMakeFiles/cmTC_82c19.dir/CheckFunctionExists.c.obj

/C/msys32/mingw32/bin/i686-w64-mingw32-gcc.exe   -DCHECK_FUNCTION_EXISTS=strsep   -o CMakeFiles/cmTC_82c19.dir/CheckFunctionExists.c.obj   -c /C/msys32/mingw32/share/cmake-3.12/Modules/CheckFunctionExists.c
Linking C executable cmTC_82c19.exe

/C/msys32/mingw32/bin/cmake.exe -E remove -f CMakeFiles/cmTC_82c19.dir/objects.a
ar cr CMakeFiles/cmTC_82c19.dir/objects.a "CMakeFiles/cmTC_82c19.dir/CheckFunctionExists.c.obj" 
/C/msys32/mingw32/bin/i686-w64-mingw32-gcc.exe  -DCHECK_FUNCTION_EXISTS=strsep    -Wl,--whole-archive CMakeFiles/cmTC_82c19.dir/objects.a -Wl,--no-whole-archive  -o cmTC_82c19.exe -Wl,--major-image-version,0,--minor-image-version,0 -liphlpapi -lws2_32 -lkernel32 -luser32 -lgdi32 -lwinspool -lshell32 -lole32 -loleaut32 -luuid -lcomdlg32 -ladvapi32 
CMakeFiles/cmTC_82c19.dir/objects.a(CheckFunctionExists.c.obj):CheckFunctionExists.c:(.text+0xc): undefined reference to `strsep'

collect2.exe: error: ld returned 1 exit status

make[2]: *** [CMakeFiles/cmTC_82c19.dir/build.make:88: cmTC_82c19.exe] Error 1
make[2]: Leaving directory '/home/buildbot/slave/monero-static-win32/build/build/release/CMakeFiles/CMakeTmp'
make[1]: *** [Makefile:121: cmTC_82c19/fast] Error 2
make[1]: Leaving directory '/home/buildbot/slave/monero-static-win32/build/build/release/CMakeFiles/CMakeTmp'


Determining if the function strlcat exists failed with the following output:
Change Dir: C:/msys32/home/buildbot/slave/monero-static-win32/build/build/release/CMakeFiles/CMakeTmp

Run Build Command:"C:/msys32/usr/bin/make.exe" "cmTC_d42cf/fast"
make[1]: Entering directory '/home/buildbot/slave/monero-static-win32/build/build/release/CMakeFiles/CMakeTmp'
/usr/bin/make -f CMakeFiles/cmTC_d42cf.dir/build.make CMakeFiles/cmTC_d42cf.dir/build
make[2]: Entering directory '/home/buildbot/slave/monero-static-win32/build/build/release/CMakeFiles/CMakeTmp'
Building C object CMakeFiles/cmTC_d42cf.dir/CheckFunctionExists.c.obj

/C/msys32/mingw32/bin/i686-w64-mingw32-gcc.exe   -DCHECK_FUNCTION_EXISTS=strlcat   -o CMakeFiles/cmTC_d42cf.dir/CheckFunctionExists.c.obj   -c /C/msys32/mingw32/share/cmake-3.12/Modules/CheckFunctionExists.c
Linking C executable cmTC_d42cf.exe

/C/msys32/mingw32/bin/cmake.exe -E remove -f CMakeFiles/cmTC_d42cf.dir/objects.a
ar cr CMakeFiles/cmTC_d42cf.dir/objects.a "CMakeFiles/cmTC_d42cf.dir/CheckFunctionExists.c.obj" 
/C/msys32/mingw32/bin/i686-w64-mingw32-gcc.exe  -DCHECK_FUNCTION_EXISTS=strlcat    -Wl,--whole-archive CMakeFiles/cmTC_d42cf.dir/objects.a -Wl,--no-whole-archive  -o cmTC_d42cf.exe -Wl,--major-image-version,0,--minor-image-version,0 -liphlpapi -lws2_32 -lkernel32 -luser32 -lgdi32 -lwinspool -lshell32 -lole32 -loleaut32 -luuid -lcomdlg32 -ladvapi32 
CMakeFiles/cmTC_d42cf.dir/objects.a(CheckFunctionExists.c.obj):CheckFunctionExists.c:(.text+0xc): undefined reference to `strlcat'

collect2.exe: error: ld returned 1 exit status

make[2]: *** [CMakeFiles/cmTC_d42cf.dir/build.make:88: cmTC_d42cf.exe] Error 1
make[2]: Leaving directory '/home/buildbot/slave/monero-static-win32/build/build/release/CMakeFiles/CMakeTmp'
make[1]: *** [Makefile:121: cmTC_d42cf/fast] Error 2
make[1]: Leaving directory '/home/buildbot/slave/monero-static-win32/build/build/release/CMakeFiles/CMakeTmp'


Determining if the function strlcpy exists failed with the following output:
Change Dir: C:/msys32/home/buildbot/slave/monero-static-win32/build/build/release/CMakeFiles/CMakeTmp

Run Build Command:"C:/msys32/usr/bin/make.exe" "cmTC_dd5d2/fast"
make[1]: Entering directory '/home/buildbot/slave/monero-static-win32/build/build/release/CMakeFiles/CMakeTmp'
/usr/bin/make -f CMakeFiles/cmTC_dd5d2.dir/build.make CMakeFiles/cmTC_dd5d2.dir/build
make[2]: Entering directory '/home/buildbot/slave/monero-static-win32/build/build/release/CMakeFiles/CMakeTmp'
Building C object CMakeFiles/cmTC_dd5d2.dir/CheckFunctionExists.c.obj

/C/msys32/mingw32/bin/i686-w64-mingw32-gcc.exe   -DCHECK_FUNCTION_EXISTS=strlcpy   -o CMakeFiles/cmTC_dd5d2.dir/CheckFunctionExists.c.obj   -c /C/msys32/mingw32/share/cmake-3.12/Modules/CheckFunctionExists.c
Linking C executable cmTC_dd5d2.exe

/C/msys32/mingw32/bin/cmake.exe -E remove -f CMakeFiles/cmTC_dd5d2.dir/objects.a
ar cr CMakeFiles/cmTC_dd5d2.dir/objects.a "CMakeFiles/cmTC_dd5d2.dir/CheckFunctionExists.c.obj" 
/C/msys32/mingw32/bin/i686-w64-mingw32-gcc.exe  -DCHECK_FUNCTION_EXISTS=strlcpy    -Wl,--whole-archive CMakeFiles/cmTC_dd5d2.dir/objects.a -Wl,--no-whole-archive  -o cmTC_dd5d2.exe -Wl,--major-image-version,0,--minor-image-version,0 -liphlpapi -lws2_32 -lkernel32 -luser32 -lgdi32 -lwinspool -lshell32 -lole32 -loleaut32 -luuid -lcomdlg32 -ladvapi32 
CMakeFiles/cmTC_dd5d2.dir/objects.a(CheckFunctionExists.c.obj):CheckFunctionExists.c:(.text+0xc): undefined reference to `strlcpy'

collect2.exe: error: ld returned 1 exit status

make[2]: *** [CMakeFiles/cmTC_dd5d2.dir/build.make:88: cmTC_dd5d2.exe] Error 1
make[2]: Leaving directory '/home/buildbot/slave/monero-static-win32/build/build/release/CMakeFiles/CMakeTmp'
make[1]: *** [Makefile:121: cmTC_dd5d2/fast] Error 2
make[1]: Leaving directory '/home/buildbot/slave/monero-static-win32/build/build/release/CMakeFiles/CMakeTmp'


Determining if the function strptime exists failed with the following output:
Change Dir: C:/msys32/home/buildbot/slave/monero-static-win32/build/build/release/CMakeFiles/CMakeTmp

Run Build Command:"C:/msys32/usr/bin/make.exe" "cmTC_6fa55/fast"
make[1]: Entering directory '/home/buildbot/slave/monero-static-win32/build/build/release/CMakeFiles/CMakeTmp'
/usr/bin/make -f CMakeFiles/cmTC_6fa55.dir/build.make CMakeFiles/cmTC_6fa55.dir/build
make[2]: Entering directory '/home/buildbot/slave/monero-static-win32/build/build/release/CMakeFiles/CMakeTmp'
Building C object CMakeFiles/cmTC_6fa55.dir/CheckFunctionExists.c.obj

/C/msys32/mingw32/bin/i686-w64-mingw32-gcc.exe   -DCHECK_FUNCTION_EXISTS=strptime   -o CMakeFiles/cmTC_6fa55.dir/CheckFunctionExists.c.obj   -c /C/msys32/mingw32/share/cmake-3.12/Modules/CheckFunctionExists.c
Linking C executable cmTC_6fa55.exe

/C/msys32/mingw32/bin/cmake.exe -E remove -f CMakeFiles/cmTC_6fa55.dir/objects.a
ar cr CMakeFiles/cmTC_6fa55.dir/objects.a "CMakeFiles/cmTC_6fa55.dir/CheckFunctionExists.c.obj" 
/C/msys32/mingw32/bin/i686-w64-mingw32-gcc.exe  -DCHECK_FUNCTION_EXISTS=strptime    -Wl,--whole-archive CMakeFiles/cmTC_6fa55.dir/objects.a -Wl,--no-whole-archive  -o cmTC_6fa55.exe -Wl,--major-image-version,0,--minor-image-version,0 -liphlpapi -lws2_32 -lkernel32 -luser32 -lgdi32 -lwinspool -lshell32 -lole32 -loleaut32 -luuid -lcomdlg32 -ladvapi32 
CMakeFiles/cmTC_6fa55.dir/objects.a(CheckFunctionExists.c.obj):CheckFunctionExists.c:(.text+0xc): undefined reference to `strptime'

collect2.exe: error: ld returned 1 exit status

make[2]: *** [CMakeFiles/cmTC_6fa55.dir/build.make:88: cmTC_6fa55.exe] Error 1
make[2]: Leaving directory '/home/buildbot/slave/monero-static-win32/build/build/release/CMakeFiles/CMakeTmp'
make[1]: *** [Makefile:121: cmTC_6fa55/fast] Error 2
make[1]: Leaving directory '/home/buildbot/slave/monero-static-win32/build/build/release/CMakeFiles/CMakeTmp'


Determining if the function writev exists failed with the following output:
Change Dir: C:/msys32/home/buildbot/slave/monero-static-win32/build/build/release/CMakeFiles/CMakeTmp

Run Build Command:"C:/msys32/usr/bin/make.exe" "cmTC_24d53/fast"
make[1]: Entering directory '/home/buildbot/slave/monero-static-win32/build/build/release/CMakeFiles/CMakeTmp'
/usr/bin/make -f CMakeFiles/cmTC_24d53.dir/build.make CMakeFiles/cmTC_24d53.dir/build
make[2]: Entering directory '/home/buildbot/slave/monero-static-win32/build/build/release/CMakeFiles/CMakeTmp'
Building C object CMakeFiles/cmTC_24d53.dir/CheckFunctionExists.c.obj

/C/msys32/mingw32/bin/i686-w64-mingw32-gcc.exe   -DCHECK_FUNCTION_EXISTS=writev   -o CMakeFiles/cmTC_24d53.dir/CheckFunctionExists.c.obj   -c /C/msys32/mingw32/share/cmake-3.12/Modules/CheckFunctionExists.c
Linking C executable cmTC_24d53.exe

/C/msys32/mingw32/bin/cmake.exe -E remove -f CMakeFiles/cmTC_24d53.dir/objects.a
ar cr CMakeFiles/cmTC_24d53.dir/objects.a "CMakeFiles/cmTC_24d53.dir/CheckFunctionExists.c.obj" 
/C/msys32/mingw32/bin/i686-w64-mingw32-gcc.exe  -DCHECK_FUNCTION_EXISTS=writev    -Wl,--whole-archive CMakeFiles/cmTC_24d53.dir/objects.a -Wl,--no-whole-archive  -o cmTC_24d53.exe -Wl,--major-image-version,0,--minor-image-version,0 -liphlpapi -lws2_32 -lkernel32 -luser32 -lgdi32 -lwinspool -lshell32 -lole32 -loleaut32 -luuid -lcomdlg32 -ladvapi32 
CMakeFiles/cmTC_24d53.dir/objects.a(CheckFunctionExists.c.obj):CheckFunctionExists.c:(.text+0xc): undefined reference to `writev'

collect2.exe: error: ld returned 1 exit status

make[2]: *** [CMakeFiles/cmTC_24d53.dir/build.make:88: cmTC_24d53.exe] Error 1
make[2]: Leaving directory '/home/buildbot/slave/monero-static-win32/build/build/release/CMakeFiles/CMakeTmp'
make[1]: *** [Makefile:121: cmTC_24d53/fast] Error 2
make[1]: Leaving directory '/home/buildbot/slave/monero-static-win32/build/build/release/CMakeFiles/CMakeTmp'


Determining size of gid_t failed with the following output:
Change Dir: C:/msys32/home/buildbot/slave/monero-static-win32/build/build/release/CMakeFiles/CMakeTmp

Run Build Command:"C:/msys32/usr/bin/make.exe" "cmTC_f1fe0/fast"
make[1]: Entering directory '/home/buildbot/slave/monero-static-win32/build/build/release/CMakeFiles/CMakeTmp'
/usr/bin/make -f CMakeFiles/cmTC_f1fe0.dir/build.make CMakeFiles/cmTC_f1fe0.dir/build
make[2]: Entering directory '/home/buildbot/slave/monero-static-win32/build/build/release/CMakeFiles/CMakeTmp'
Building C object CMakeFiles/cmTC_f1fe0.dir/gid_t.c.obj

/C/msys32/mingw32/bin/i686-w64-mingw32-gcc.exe    -o CMakeFiles/cmTC_f1fe0.dir/gid_t.c.obj   -c /C/msys32/home/buildbot/slave/monero-static-win32/build/build/release/CMakeFiles/CheckTypeSize/gid_t.c
C:/msys32/home/buildbot/slave/monero-static-win32/build/build/release/CMakeFiles/CheckTypeSize/gid_t.c:24:22: error: 'gid_t' undeclared here (not in a function); did you mean 'pid_t'?

 #define SIZE (sizeof(gid_t))

                      ^

C:/msys32/home/buildbot/slave/monero-static-win32/build/build/release/CMakeFiles/CheckTypeSize/gid_t.c:26:12: note: in expansion of macro 'SIZE'

   ('0' + ((SIZE / 10000)%10)),

            ^~~~

make[2]: *** [CMakeFiles/cmTC_f1fe0.dir/build.make:66: CMakeFiles/cmTC_f1fe0.dir/gid_t.c.obj] Error 1
make[2]: Leaving directory '/home/buildbot/slave/monero-static-win32/build/build/release/CMakeFiles/CMakeTmp'
make[1]: *** [Makefile:121: cmTC_f1fe0/fast] Error 2
make[1]: Leaving directory '/home/buildbot/slave/monero-static-win32/build/build/release/CMakeFiles/CMakeTmp'

C:/msys32/home/buildbot/slave/monero-static-win32/build/build/release/CMakeFiles/CheckTypeSize/gid_t.c:
#include <sys/types.h>
#include <stdint.h>
#include <stddef.h>
#include "sys/types.h"


#undef KEY
#if defined(__i386)
# define KEY '_','_','i','3','8','6'
#elif defined(__x86_64)
# define KEY '_','_','x','8','6','_','6','4'
#elif defined(__ppc__)
# define KEY '_','_','p','p','c','_','_'
#elif defined(__ppc64__)
# define KEY '_','_','p','p','c','6','4','_','_'
#elif defined(__aarch64__)
# define KEY '_','_','a','a','r','c','h','6','4','_','_'
#elif defined(__ARM_ARCH_7A__)
# define KEY '_','_','A','R','M','_','A','R','C','H','_','7','A','_','_'
#elif defined(__ARM_ARCH_7S__)
# define KEY '_','_','A','R','M','_','A','R','C','H','_','7','S','_','_'
#endif

#define SIZE (sizeof(gid_t))
char info_size[] =  {'I', 'N', 'F', 'O', ':', 's','i','z','e','[',
  ('0' + ((SIZE / 10000)%10)),
  ('0' + ((SIZE / 1000)%10)),
  ('0' + ((SIZE / 100)%10)),
  ('0' + ((SIZE / 10)%10)),
  ('0' +  (SIZE    % 10)),
  ']',
#ifdef KEY
  ' ','k','e','y','[', KEY, ']',
#endif
  '\0'};

#ifdef __CLASSIC_C__
int main(argc, argv) int argc; char *argv[];
#else
int main(int argc, char *argv[])
#endif
{
  int require = 0;
  require += info_size[argc];
  (void)argv;
  return require;
}


Determining size of in_addr_t failed with the following output:
Change Dir: C:/msys32/home/buildbot/slave/monero-static-win32/build/build/release/CMakeFiles/CMakeTmp

Run Build Command:"C:/msys32/usr/bin/make.exe" "cmTC_7cde3/fast"
make[1]: Entering directory '/home/buildbot/slave/monero-static-win32/build/build/release/CMakeFiles/CMakeTmp'
/usr/bin/make -f CMakeFiles/cmTC_7cde3.dir/build.make CMakeFiles/cmTC_7cde3.dir/build
make[2]: Entering directory '/home/buildbot/slave/monero-static-win32/build/build/release/CMakeFiles/CMakeTmp'
Building C object CMakeFiles/cmTC_7cde3.dir/in_addr_t.c.obj

/C/msys32/mingw32/bin/i686-w64-mingw32-gcc.exe    -o CMakeFiles/cmTC_7cde3.dir/in_addr_t.c.obj   -c /C/msys32/home/buildbot/slave/monero-static-win32/build/build/release/CMakeFiles/CheckTypeSize/in_addr_t.c
C:/msys32/home/buildbot/slave/monero-static-win32/build/build/release/CMakeFiles/CheckTypeSize/in_addr_t.c:4:10: fatal error: netinet/in.h: No such file or directory

 #include "netinet/in.h"

          ^~~~~~~~~~~~~~

compilation terminated.

make[2]: *** [CMakeFiles/cmTC_7cde3.dir/build.make:66: CMakeFiles/cmTC_7cde3.dir/in_addr_t.c.obj] Error 1
make[2]: Leaving directory '/home/buildbot/slave/monero-static-win32/build/build/release/CMakeFiles/CMakeTmp'
make[1]: *** [Makefile:121: cmTC_7cde3/fast] Error 2
make[1]: Leaving directory '/home/buildbot/slave/monero-static-win32/build/build/release/CMakeFiles/CMakeTmp'

C:/msys32/home/buildbot/slave/monero-static-win32/build/build/release/CMakeFiles/CheckTypeSize/in_addr_t.c:
#include <sys/types.h>
#include <stdint.h>
#include <stddef.h>
#include "netinet/in.h"


#undef KEY
#if defined(__i386)
# define KEY '_','_','i','3','8','6'
#elif defined(__x86_64)
# define KEY '_','_','x','8','6','_','6','4'
#elif defined(__ppc__)
# define KEY '_','_','p','p','c','_','_'
#elif defined(__ppc64__)
# define KEY '_','_','p','p','c','6','4','_','_'
#elif defined(__aarch64__)
# define KEY '_','_','a','a','r','c','h','6','4','_','_'
#elif defined(__ARM_ARCH_7A__)
# define KEY '_','_','A','R','M','_','A','R','C','H','_','7','A','_','_'
#elif defined(__ARM_ARCH_7S__)
# define KEY '_','_','A','R','M','_','A','R','C','H','_','7','S','_','_'
#endif

#define SIZE (sizeof(in_addr_t))
char info_size[] =  {'I', 'N', 'F', 'O', ':', 's','i','z','e','[',
  ('0' + ((SIZE / 10000)%10)),
  ('0' + ((SIZE / 1000)%10)),
  ('0' + ((SIZE / 100)%10)),
  ('0' + ((SIZE / 10)%10)),
  ('0' +  (SIZE    % 10)),
  ']',
#ifdef KEY
  ' ','k','e','y','[', KEY, ']',
#endif
  '\0'};

#ifdef __CLASSIC_C__
int main(argc, argv) int argc; char *argv[];
#else
int main(int argc, char *argv[])
#endif
{
  int require = 0;
  require += info_size[argc];
  (void)argv;
  return require;
}


Determining size of in_port_t failed with the following output:
Change Dir: C:/msys32/home/buildbot/slave/monero-static-win32/build/build/release/CMakeFiles/CMakeTmp

Run Build Command:"C:/msys32/usr/bin/make.exe" "cmTC_44d09/fast"
make[1]: Entering directory '/home/buildbot/slave/monero-static-win32/build/build/release/CMakeFiles/CMakeTmp'
/usr/bin/make -f CMakeFiles/cmTC_44d09.dir/build.make CMakeFiles/cmTC_44d09.dir/build
make[2]: Entering directory '/home/buildbot/slave/monero-static-win32/build/build/release/CMakeFiles/CMakeTmp'
Building C object CMakeFiles/cmTC_44d09.dir/in_port_t.c.obj

/C/msys32/mingw32/bin/i686-w64-mingw32-gcc.exe    -o CMakeFiles/cmTC_44d09.dir/in_port_t.c.obj   -c /C/msys32/home/buildbot/slave/monero-static-win32/build/build/release/CMakeFiles/CheckTypeSize/in_port_t.c
C:/msys32/home/buildbot/slave/monero-static-win32/build/build/release/CMakeFiles/CheckTypeSize/in_port_t.c:4:10: fatal error: netinet/in.h: No such file or directory

 #include "netinet/in.h"

          ^~~~~~~~~~~~~~

compilation terminated.

make[2]: *** [CMakeFiles/cmTC_44d09.dir/build.make:66: CMakeFiles/cmTC_44d09.dir/in_port_t.c.obj] Error 1
make[2]: Leaving directory '/home/buildbot/slave/monero-static-win32/build/build/release/CMakeFiles/CMakeTmp'
make[1]: *** [Makefile:121: cmTC_44d09/fast] Error 2
make[1]: Leaving directory '/home/buildbot/slave/monero-static-win32/build/build/release/CMakeFiles/CMakeTmp'

C:/msys32/home/buildbot/slave/monero-static-win32/build/build/release/CMakeFiles/CheckTypeSize/in_port_t.c:
#include <sys/types.h>
#include <stdint.h>
#include <stddef.h>
#include "netinet/in.h"


#undef KEY
#if defined(__i386)
# define KEY '_','_','i','3','8','6'
#elif defined(__x86_64)
# define KEY '_','_','x','8','6','_','6','4'
#elif defined(__ppc__)
# define KEY '_','_','p','p','c','_','_'
#elif defined(__ppc64__)
# define KEY '_','_','p','p','c','6','4','_','_'
#elif defined(__aarch64__)
# define KEY '_','_','a','a','r','c','h','6','4','_','_'
#elif defined(__ARM_ARCH_7A__)
# define KEY '_','_','A','R','M','_','A','R','C','H','_','7','A','_','_'
#elif defined(__ARM_ARCH_7S__)
# define KEY '_','_','A','R','M','_','A','R','C','H','_','7','S','_','_'
#endif

#define SIZE (sizeof(in_port_t))
char info_size[] =  {'I', 'N', 'F', 'O', ':', 's','i','z','e','[',
  ('0' + ((SIZE / 10000)%10)),
  ('0' + ((SIZE / 1000)%10)),
  ('0' + ((SIZE / 100)%10)),
  ('0' + ((SIZE / 10)%10)),
  ('0' +  (SIZE    % 10)),
  ']',
#ifdef KEY
  ' ','k','e','y','[', KEY, ']',
#endif
  '\0'};

#ifdef __CLASSIC_C__
int main(argc, argv) int argc; char *argv[];
#else
int main(int argc, char *argv[])
#endif
{
  int require = 0;
  require += info_size[argc];
  (void)argv;
  return require;
}


Determining size of rlim_t failed with the following output:
Change Dir: C:/msys32/home/buildbot/slave/monero-static-win32/build/build/release/CMakeFiles/CMakeTmp

Run Build Command:"C:/msys32/usr/bin/make.exe" "cmTC_97f08/fast"
make[1]: Entering directory '/home/buildbot/slave/monero-static-win32/build/build/release/CMakeFiles/CMakeTmp'
/usr/bin/make -f CMakeFiles/cmTC_97f08.dir/build.make CMakeFiles/cmTC_97f08.dir/build
make[2]: Entering directory '/home/buildbot/slave/monero-static-win32/build/build/release/CMakeFiles/CMakeTmp'
Building C object CMakeFiles/cmTC_97f08.dir/rlim_t.c.obj

/C/msys32/mingw32/bin/i686-w64-mingw32-gcc.exe    -o CMakeFiles/cmTC_97f08.dir/rlim_t.c.obj   -c /C/msys32/home/buildbot/slave/monero-static-win32/build/build/release/CMakeFiles/CheckTypeSize/rlim_t.c
C:/msys32/home/buildbot/slave/monero-static-win32/build/build/release/CMakeFiles/CheckTypeSize/rlim_t.c:4:10: fatal error: sys/resource.h: No such file or directory

 #include "sys/resource.h"

          ^~~~~~~~~~~~~~~~

compilation terminated.

make[2]: *** [CMakeFiles/cmTC_97f08.dir/build.make:66: CMakeFiles/cmTC_97f08.dir/rlim_t.c.obj] Error 1
make[2]: Leaving directory '/home/buildbot/slave/monero-static-win32/build/build/release/CMakeFiles/CMakeTmp'
make[1]: *** [Makefile:121: cmTC_97f08/fast] Error 2
make[1]: Leaving directory '/home/buildbot/slave/monero-static-win32/build/build/release/CMakeFiles/CMakeTmp'

C:/msys32/home/buildbot/slave/monero-static-win32/build/build/release/CMakeFiles/CheckTypeSize/rlim_t.c:
#include <sys/types.h>
#include <stdint.h>
#include <stddef.h>
#include "sys/resource.h"


#undef KEY
#if defined(__i386)
# define KEY '_','_','i','3','8','6'
#elif defined(__x86_64)
# define KEY '_','_','x','8','6','_','6','4'
#elif defined(__ppc__)
# define KEY '_','_','p','p','c','_','_'
#elif defined(__ppc64__)
# define KEY '_','_','p','p','c','6','4','_','_'
#elif defined(__aarch64__)
# define KEY '_','_','a','a','r','c','h','6','4','_','_'
#elif defined(__ARM_ARCH_7A__)
# define KEY '_','_','A','R','M','_','A','R','C','H','_','7','A','_','_'
#elif defined(__ARM_ARCH_7S__)
# define KEY '_','_','A','R','M','_','A','R','C','H','_','7','S','_','_'
#endif

#define SIZE (sizeof(rlim_t))
char info_size[] =  {'I', 'N', 'F', 'O', ':', 's','i','z','e','[',
  ('0' + ((SIZE / 10000)%10)),
  ('0' + ((SIZE / 1000)%10)),
  ('0' + ((SIZE / 100)%10)),
  ('0' + ((SIZE / 10)%10)),
  ('0' +  (SIZE    % 10)),
  ']',
#ifdef KEY
  ' ','k','e','y','[', KEY, ']',
#endif
  '\0'};

#ifdef __CLASSIC_C__
int main(argc, argv) int argc; char *argv[];
#else
int main(int argc, char *argv[])
#endif
{
  int require = 0;
  require += info_size[argc];
  (void)argv;
  return require;
}


Determining size of uid_t failed with the following output:
Change Dir: C:/msys32/home/buildbot/slave/monero-static-win32/build/build/release/CMakeFiles/CMakeTmp

Run Build Command:"C:/msys32/usr/bin/make.exe" "cmTC_8ebc9/fast"
make[1]: Entering directory '/home/buildbot/slave/monero-static-win32/build/build/release/CMakeFiles/CMakeTmp'
/usr/bin/make -f CMakeFiles/cmTC_8ebc9.dir/build.make CMakeFiles/cmTC_8ebc9.dir/build
make[2]: Entering directory '/home/buildbot/slave/monero-static-win32/build/build/release/CMakeFiles/CMakeTmp'
Building C object CMakeFiles/cmTC_8ebc9.dir/uid_t.c.obj

/C/msys32/mingw32/bin/i686-w64-mingw32-gcc.exe    -o CMakeFiles/cmTC_8ebc9.dir/uid_t.c.obj   -c /C/msys32/home/buildbot/slave/monero-static-win32/build/build/release/CMakeFiles/CheckTypeSize/uid_t.c
C:/msys32/home/buildbot/slave/monero-static-win32/build/build/release/CMakeFiles/CheckTypeSize/uid_t.c:24:22: error: 'uid_t' undeclared here (not in a function); did you mean 'pid_t'?

 #define SIZE (sizeof(uid_t))

                      ^

C:/msys32/home/buildbot/slave/monero-static-win32/build/build/release/CMakeFiles/CheckTypeSize/uid_t.c:26:12: note: in expansion of macro 'SIZE'

   ('0' + ((SIZE / 10000)%10)),

            ^~~~

make[2]: *** [CMakeFiles/cmTC_8ebc9.dir/build.make:66: CMakeFiles/cmTC_8ebc9.dir/uid_t.c.obj] Error 1
make[2]: Leaving directory '/home/buildbot/slave/monero-static-win32/build/build/release/CMakeFiles/CMakeTmp'
make[1]: *** [Makefile:121: cmTC_8ebc9/fast] Error 2
make[1]: Leaving directory '/home/buildbot/slave/monero-static-win32/build/build/release/CMakeFiles/CMakeTmp'

C:/msys32/home/buildbot/slave/monero-static-win32/build/build/release/CMakeFiles/CheckTypeSize/uid_t.c:
#include <sys/types.h>
#include <stdint.h>
#include <stddef.h>
#include "sys/types.h"


#undef KEY
#if defined(__i386)
# define KEY '_','_','i','3','8','6'
#elif defined(__x86_64)
# define KEY '_','_','x','8','6','_','6','4'
#elif defined(__ppc__)
# define KEY '_','_','p','p','c','_','_'
#elif defined(__ppc64__)
# define KEY '_','_','p','p','c','6','4','_','_'
#elif defined(__aarch64__)
# define KEY '_','_','a','a','r','c','h','6','4','_','_'
#elif defined(__ARM_ARCH_7A__)
# define KEY '_','_','A','R','M','_','A','R','C','H','_','7','A','_','_'
#elif defined(__ARM_ARCH_7S__)
# define KEY '_','_','A','R','M','_','A','R','C','H','_','7','S','_','_'
#endif

#define SIZE (sizeof(uid_t))
char info_size[] =  {'I', 'N', 'F', 'O', ':', 's','i','z','e','[',
  ('0' + ((SIZE / 10000)%10)),
  ('0' + ((SIZE / 1000)%10)),
  ('0' + ((SIZE / 100)%10)),
  ('0' + ((SIZE / 10)%10)),
  ('0' +  (SIZE    % 10)),
  ']',
#ifdef KEY
  ' ','k','e','y','[', KEY, ']',
#endif
  '\0'};

#ifdef __CLASSIC_C__
int main(argc, argv) int argc; char *argv[];
#else
int main(int argc, char *argv[])
#endif
{
  int require = 0;
  require += info_size[argc];
  (void)argv;
  return require;
}


Determining if the pthread_rwlock_t exist failed with the following output:
Change Dir: C:/msys32/home/buildbot/slave/monero-static-win32/build/build/release/CMakeFiles/CMakeTmp

Run Build Command:"C:/msys32/usr/bin/make.exe" "cmTC_186e1/fast"
make[1]: Entering directory '/home/buildbot/slave/monero-static-win32/build/build/release/CMakeFiles/CMakeTmp'
/usr/bin/make -f CMakeFiles/cmTC_186e1.dir/build.make CMakeFiles/cmTC_186e1.dir/build
make[2]: Entering directory '/home/buildbot/slave/monero-static-win32/build/build/release/CMakeFiles/CMakeTmp'
Building C object CMakeFiles/cmTC_186e1.dir/CheckSymbolExists.c.obj

/C/msys32/mingw32/bin/i686-w64-mingw32-gcc.exe    -o CMakeFiles/cmTC_186e1.dir/CheckSymbolExists.c.obj   -c /C/msys32/home/buildbot/slave/monero-static-win32/build/build/release/CMakeFiles/CMakeTmp/CheckSymbolExists.c
C:/msys32/home/buildbot/slave/monero-static-win32/build/build/release/CMakeFiles/CMakeTmp/CheckSymbolExists.c: In function 'main':

C:/msys32/home/buildbot/slave/monero-static-win32/build/build/release/CMakeFiles/CMakeTmp/CheckSymbolExists.c:8:19: error: expected expression before 'pthread_rwlock_t'

   return ((int*)(&pthread_rwlock_t))[argc];

                   ^~~~~~~~~~~~~~~~

make[2]: *** [CMakeFiles/cmTC_186e1.dir/build.make:66: CMakeFiles/cmTC_186e1.dir/CheckSymbolExists.c.obj] Error 1
make[2]: Leaving directory '/home/buildbot/slave/monero-static-win32/build/build/release/CMakeFiles/CMakeTmp'
make[1]: *** [Makefile:121: cmTC_186e1/fast] Error 2
make[1]: Leaving directory '/home/buildbot/slave/monero-static-win32/build/build/release/CMakeFiles/CMakeTmp'

File C:/msys32/home/buildbot/slave/monero-static-win32/build/build/release/CMakeFiles/CMakeTmp/CheckSymbolExists.c:
/* */
#include <pthread.h>

int main(int argc, char** argv)
{
  (void)argv;
#ifndef pthread_rwlock_t
  return ((int*)(&pthread_rwlock_t))[argc];
#else
  (void)argc;
  return 0;
#endif
}

Determining if the pthread_spinlock_t exist failed with the following output:
Change Dir: C:/msys32/home/buildbot/slave/monero-static-win32/build/build/release/CMakeFiles/CMakeTmp

Run Build Command:"C:/msys32/usr/bin/make.exe" "cmTC_3ce46/fast"
make[1]: Entering directory '/home/buildbot/slave/monero-static-win32/build/build/release/CMakeFiles/CMakeTmp'
/usr/bin/make -f CMakeFiles/cmTC_3ce46.dir/build.make CMakeFiles/cmTC_3ce46.dir/build
make[2]: Entering directory '/home/buildbot/slave/monero-static-win32/build/build/release/CMakeFiles/CMakeTmp'
Building C object CMakeFiles/cmTC_3ce46.dir/CheckSymbolExists.c.obj

/C/msys32/mingw32/bin/i686-w64-mingw32-gcc.exe    -o CMakeFiles/cmTC_3ce46.dir/CheckSymbolExists.c.obj   -c /C/msys32/home/buildbot/slave/monero-static-win32/build/build/release/CMakeFiles/CMakeTmp/CheckSymbolExists.c
C:/msys32/home/buildbot/slave/monero-static-win32/build/build/release/CMakeFiles/CMakeTmp/CheckSymbolExists.c: In function 'main':

C:/msys32/home/buildbot/slave/monero-static-win32/build/build/release/CMakeFiles/CMakeTmp/CheckSymbolExists.c:8:19: error: expected expression before 'pthread_spinlock_t'

   return ((int*)(&pthread_spinlock_t))[argc];

                   ^~~~~~~~~~~~~~~~~~

make[2]: *** [CMakeFiles/cmTC_3ce46.dir/build.make:66: CMakeFiles/cmTC_3ce46.dir/CheckSymbolExists.c.obj] Error 1
make[2]: Leaving directory '/home/buildbot/slave/monero-static-win32/build/build/release/CMakeFiles/CMakeTmp'
make[1]: *** [Makefile:121: cmTC_3ce46/fast] Error 2
make[1]: Leaving directory '/home/buildbot/slave/monero-static-win32/build/build/release/CMakeFiles/CMakeTmp'

File C:/msys32/home/buildbot/slave/monero-static-win32/build/build/release/CMakeFiles/CMakeTmp/CheckSymbolExists.c:
/* */
#include <pthread.h>

int main(int argc, char** argv)
{
  (void)argv;
#ifndef pthread_spinlock_t
  return ((int*)(&pthread_spinlock_t))[argc];
#else
  (void)argc;
  return 0;
#endif
}

Determining if the LIBRESSL_VERSION_TEXT exist failed with the following output:
Change Dir: C:/msys32/home/buildbot/slave/monero-static-win32/build/build/release/CMakeFiles/CMakeTmp

Run Build Command:"C:/msys32/usr/bin/make.exe" "cmTC_c515b/fast"
make[1]: Entering directory '/home/buildbot/slave/monero-static-win32/build/build/release/CMakeFiles/CMakeTmp'
/usr/bin/make -f CMakeFiles/cmTC_c515b.dir/build.make CMakeFiles/cmTC_c515b.dir/build
make[2]: Entering directory '/home/buildbot/slave/monero-static-win32/build/build/release/CMakeFiles/CMakeTmp'
Building C object CMakeFiles/cmTC_c515b.dir/CheckSymbolExists.c.obj

/C/msys32/mingw32/bin/i686-w64-mingw32-gcc.exe    -o CMakeFiles/cmTC_c515b.dir/CheckSymbolExists.c.obj   -c /C/msys32/home/buildbot/slave/monero-static-win32/build/build/release/CMakeFiles/CMakeTmp/CheckSymbolExists.c
C:/msys32/home/buildbot/slave/monero-static-win32/build/build/release/CMakeFiles/CMakeTmp/CheckSymbolExists.c: In function 'main':

C:/msys32/home/buildbot/slave/monero-static-win32/build/build/release/CMakeFiles/CMakeTmp/CheckSymbolExists.c:8:19: error: 'LIBRESSL_VERSION_TEXT' undeclared (first use in this function); did you mean 'OPENSSL_VERSION_TEXT'?

   return ((int*)(&LIBRESSL_VERSION_TEXT))[argc];

                   ^~~~~~~~~~~~~~~~~~~~~

                   OPENSSL_VERSION_TEXT

C:/msys32/home/buildbot/slave/monero-static-win32/build/build/release/CMakeFiles/CMakeTmp/CheckSymbolExists.c:8:19: note: each undeclared identifier is reported only once for each function it appears in

make[2]: *** [CMakeFiles/cmTC_c515b.dir/build.make:66: CMakeFiles/cmTC_c515b.dir/CheckSymbolExists.c.obj] Error 1
make[2]: Leaving directory '/home/buildbot/slave/monero-static-win32/build/build/release/CMakeFiles/CMakeTmp'
make[1]: *** [Makefile:121: cmTC_c515b/fast] Error 2
make[1]: Leaving directory '/home/buildbot/slave/monero-static-win32/build/build/release/CMakeFiles/CMakeTmp'

File C:/msys32/home/buildbot/slave/monero-static-win32/build/build/release/CMakeFiles/CMakeTmp/CheckSymbolExists.c:
/* */
#include <openssl/opensslv.h>

int main(int argc, char** argv)
{
  (void)argv;
#ifndef LIBRESSL_VERSION_TEXT
  return ((int*)(&LIBRESSL_VERSION_TEXT))[argc];
#else
  (void)argc;
  return 0;
#endif
}

Determining if the backtrace exist failed with the following output:
Change Dir: C:/msys32/home/buildbot/slave/monero-static-win32/build/build/release/CMakeFiles/CMakeTmp

Run Build Command:"C:/msys32/usr/bin/make.exe" "cmTC_79ab0/fast"
make[1]: Entering directory '/home/buildbot/slave/monero-static-win32/build/build/release/CMakeFiles/CMakeTmp'
/usr/bin/make -f CMakeFiles/cmTC_79ab0.dir/build.make CMakeFiles/cmTC_79ab0.dir/build
make[2]: Entering directory '/home/buildbot/slave/monero-static-win32/build/build/release/CMakeFiles/CMakeTmp'
Building C object CMakeFiles/cmTC_79ab0.dir/CheckSymbolExists.c.obj

/C/msys32/mingw32/bin/i686-w64-mingw32-gcc.exe    -o CMakeFiles/cmTC_79ab0.dir/CheckSymbolExists.c.obj   -c /C/msys32/home/buildbot/slave/monero-static-win32/build/build/release/CMakeFiles/CMakeTmp/CheckSymbolExists.c
C:/msys32/home/buildbot/slave/monero-static-win32/build/build/release/CMakeFiles/CMakeTmp/CheckSymbolExists.c:2:10: fatal error: execinfo.h: No such file or directory

 #include <execinfo.h>

          ^~~~~~~~~~~~

compilation terminated.

make[2]: *** [CMakeFiles/cmTC_79ab0.dir/build.make:66: CMakeFiles/cmTC_79ab0.dir/CheckSymbolExists.c.obj] Error 1
make[2]: Leaving directory '/home/buildbot/slave/monero-static-win32/build/build/release/CMakeFiles/CMakeTmp'
make[1]: *** [Makefile:121: cmTC_79ab0/fast] Error 2
make[1]: Leaving directory '/home/buildbot/slave/monero-static-win32/build/build/release/CMakeFiles/CMakeTmp'

File C:/msys32/home/buildbot/slave/monero-static-win32/build/build/release/CMakeFiles/CMakeTmp/CheckSymbolExists.c:
/* */
#include <execinfo.h>

int main(int argc, char** argv)
{
  (void)argv;
#ifndef backtrace
  return ((int*)(&backtrace))[argc];
#else
  (void)argc;
  return 0;
#endif
}

Determining if the -Wl,-z,relro linker flag is supported failed with the following output:
Change Dir: C:/msys32/home/buildbot/slave/monero-static-win32/build/build/release/CMakeFiles/CMakeTmp

Run Build Command:"C:/msys32/usr/bin/make.exe" "cmTC_c256f/fast"
make[1]: Entering directory '/home/buildbot/slave/monero-static-win32/build/build/release/CMakeFiles/CMakeTmp'
/usr/bin/make -f CMakeFiles/cmTC_c256f.dir/build.make CMakeFiles/cmTC_c256f.dir/build
make[2]: Entering directory '/home/buildbot/slave/monero-static-win32/build/build/release/CMakeFiles/CMakeTmp'
Building C object CMakeFiles/cmTC_c256f.dir/CheckLinkerFlag.c.obj

/C/msys32/mingw32/bin/i686-w64-mingw32-gcc.exe   -Wl,-z,relro    -Wl,-z,relro -o CMakeFiles/cmTC_c256f.dir/CheckLinkerFlag.c.obj   -c /C/msys32/home/buildbot/slave/monero-static-win32/build/cmake/CheckLinkerFlag.c
Linking C executable cmTC_c256f.exe

/C/msys32/mingw32/bin/cmake.exe -E remove -f CMakeFiles/cmTC_c256f.dir/objects.a
ar cr CMakeFiles/cmTC_c256f.dir/objects.a "CMakeFiles/cmTC_c256f.dir/CheckLinkerFlag.c.obj" 
/C/msys32/mingw32/bin/i686-w64-mingw32-gcc.exe -Wl,-z,relro     -Wl,--whole-archive CMakeFiles/cmTC_c256f.dir/objects.a -Wl,--no-whole-archive  -o cmTC_c256f.exe -Wl,--major-image-version,0,--minor-image-version,0 -lkernel32 -luser32 -lgdi32 -lwinspool -lshell32 -lole32 -loleaut32 -luuid -lcomdlg32 -ladvapi32 
C:/msys32/mingw32/bin/../lib/gcc/i686-w64-mingw32/7.4.0/../../../../i686-w64-mingw32/bin/ld.exe: unrecognized option '-z'

C:/msys32/mingw32/bin/../lib/gcc/i686-w64-mingw32/7.4.0/../../../../i686-w64-mingw32/bin/ld.exe: use the --help option for usage information

collect2.exe: error: ld returned 1 exit status

make[2]: *** [CMakeFiles/cmTC_c256f.dir/build.make:88: cmTC_c256f.exe] Error 1
make[2]: Leaving directory '/home/buildbot/slave/monero-static-win32/build/build/release/CMakeFiles/CMakeTmp'
make[1]: *** [Makefile:121: cmTC_c256f/fast] Error 2
make[1]: Leaving directory '/home/buildbot/slave/monero-static-win32/build/build/release/CMakeFiles/CMakeTmp'


Determining if the -Wl,-z,now linker flag is supported failed with the following output:
Change Dir: C:/msys32/home/buildbot/slave/monero-static-win32/build/build/release/CMakeFiles/CMakeTmp

Run Build Command:"C:/msys32/usr/bin/make.exe" "cmTC_b8b2e/fast"
make[1]: Entering directory '/home/buildbot/slave/monero-static-win32/build/build/release/CMakeFiles/CMakeTmp'
/usr/bin/make -f CMakeFiles/cmTC_b8b2e.dir/build.make CMakeFiles/cmTC_b8b2e.dir/build
make[2]: Entering directory '/home/buildbot/slave/monero-static-win32/build/build/release/CMakeFiles/CMakeTmp'
Building C object CMakeFiles/cmTC_b8b2e.dir/CheckLinkerFlag.c.obj

/C/msys32/mingw32/bin/i686-w64-mingw32-gcc.exe   -Wl,-z,now    -Wl,-z,now -o CMakeFiles/cmTC_b8b2e.dir/CheckLinkerFlag.c.obj   -c /C/msys32/home/buildbot/slave/monero-static-win32/build/cmake/CheckLinkerFlag.c
Linking C executable cmTC_b8b2e.exe

/C/msys32/mingw32/bin/cmake.exe -E remove -f CMakeFiles/cmTC_b8b2e.dir/objects.a
ar cr CMakeFiles/cmTC_b8b2e.dir/objects.a "CMakeFiles/cmTC_b8b2e.dir/CheckLinkerFlag.c.obj" 
/C/msys32/mingw32/bin/i686-w64-mingw32-gcc.exe -Wl,-z,now     -Wl,--whole-archive CMakeFiles/cmTC_b8b2e.dir/objects.a -Wl,--no-whole-archive  -o cmTC_b8b2e.exe -Wl,--major-image-version,0,--minor-image-version,0 -lkernel32 -luser32 -lgdi32 -lwinspool -lshell32 -lole32 -loleaut32 -luuid -lcomdlg32 -ladvapi32 
C:/msys32/mingw32/bin/../lib/gcc/i686-w64-mingw32/7.4.0/../../../../i686-w64-mingw32/bin/ld.exe: unrecognized option '-z'

C:/msys32/mingw32/bin/../lib/gcc/i686-w64-mingw32/7.4.0/../../../../i686-w64-mingw32/bin/ld.exe: use the --help option for usage information

collect2.exe: error: ld returned 1 exit status

make[2]: *** [CMakeFiles/cmTC_b8b2e.dir/build.make:88: cmTC_b8b2e.exe] Error 1
make[2]: Leaving directory '/home/buildbot/slave/monero-static-win32/build/build/release/CMakeFiles/CMakeTmp'
make[1]: *** [Makefile:121: cmTC_b8b2e/fast] Error 2
make[1]: Leaving directory '/home/buildbot/slave/monero-static-win32/build/build/release/CMakeFiles/CMakeTmp'


Determining if the -Wl,-z,noexecstack linker flag is supported failed with the following output:
Change Dir: C:/msys32/home/buildbot/slave/monero-static-win32/build/build/release/CMakeFiles/CMakeTmp

Run Build Command:"C:/msys32/usr/bin/make.exe" "cmTC_0e8cf/fast"
make[1]: Entering directory '/home/buildbot/slave/monero-static-win32/build/build/release/CMakeFiles/CMakeTmp'
/usr/bin/make -f CMakeFiles/cmTC_0e8cf.dir/build.make CMakeFiles/cmTC_0e8cf.dir/build
make[2]: Entering directory '/home/buildbot/slave/monero-static-win32/build/build/release/CMakeFiles/CMakeTmp'
Building C object CMakeFiles/cmTC_0e8cf.dir/CheckLinkerFlag.c.obj

/C/msys32/mingw32/bin/i686-w64-mingw32-gcc.exe   -Wl,-z,noexecstack    -Wl,-z,noexecstack -o CMakeFiles/cmTC_0e8cf.dir/CheckLinkerFlag.c.obj   -c /C/msys32/home/buildbot/slave/monero-static-win32/build/cmake/CheckLinkerFlag.c
Linking C executable cmTC_0e8cf.exe

/C/msys32/mingw32/bin/cmake.exe -E remove -f CMakeFiles/cmTC_0e8cf.dir/objects.a
ar cr CMakeFiles/cmTC_0e8cf.dir/objects.a "CMakeFiles/cmTC_0e8cf.dir/CheckLinkerFlag.c.obj" 
/C/msys32/mingw32/bin/i686-w64-mingw32-gcc.exe -Wl,-z,noexecstack     -Wl,--whole-archive CMakeFiles/cmTC_0e8cf.dir/objects.a -Wl,--no-whole-archive  -o cmTC_0e8cf.exe -Wl,--major-image-version,0,--minor-image-version,0 -lkernel32 -luser32 -lgdi32 -lwinspool -lshell32 -lole32 -loleaut32 -luuid -lcomdlg32 -ladvapi32 
C:/msys32/mingw32/bin/../lib/gcc/i686-w64-mingw32/7.4.0/../../../../i686-w64-mingw32/bin/ld.exe: unrecognized option '-z'

C:/msys32/mingw32/bin/../lib/gcc/i686-w64-mingw32/7.4.0/../../../../i686-w64-mingw32/bin/ld.exe: use the --help option for usage information

collect2.exe: error: ld returned 1 exit status

make[2]: *** [CMakeFiles/cmTC_0e8cf.dir/build.make:88: cmTC_0e8cf.exe] Error 1
make[2]: Leaving directory '/home/buildbot/slave/monero-static-win32/build/build/release/CMakeFiles/CMakeTmp'
make[1]: *** [Makefile:121: cmTC_0e8cf/fast] Error 2
make[1]: Leaving directory '/home/buildbot/slave/monero-static-win32/build/build/release/CMakeFiles/CMakeTmp'


Determining if the -Wl,-z,noexecheap linker flag is supported failed with the following output:
Change Dir: C:/msys32/home/buildbot/slave/monero-static-win32/build/build/release/CMakeFiles/CMakeTmp

Run Build Command:"C:/msys32/usr/bin/make.exe" "cmTC_9245d/fast"
make[1]: Entering directory '/home/buildbot/slave/monero-static-win32/build/build/release/CMakeFiles/CMakeTmp'
/usr/bin/make -f CMakeFiles/cmTC_9245d.dir/build.make CMakeFiles/cmTC_9245d.dir/build
make[2]: Entering directory '/home/buildbot/slave/monero-static-win32/build/build/release/CMakeFiles/CMakeTmp'
Building C object CMakeFiles/cmTC_9245d.dir/CheckLinkerFlag.c.obj

/C/msys32/mingw32/bin/i686-w64-mingw32-gcc.exe   -Wl,-z,noexecheap    -Wl,-z,noexecheap -o CMakeFiles/cmTC_9245d.dir/CheckLinkerFlag.c.obj   -c /C/msys32/home/buildbot/slave/monero-static-win32/build/cmake/CheckLinkerFlag.c
Linking C executable cmTC_9245d.exe

/C/msys32/mingw32/bin/cmake.exe -E remove -f CMakeFiles/cmTC_9245d.dir/objects.a
ar cr CMakeFiles/cmTC_9245d.dir/objects.a "CMakeFiles/cmTC_9245d.dir/CheckLinkerFlag.c.obj" 
/C/msys32/mingw32/bin/i686-w64-mingw32-gcc.exe -Wl,-z,noexecheap     -Wl,--whole-archive CMakeFiles/cmTC_9245d.dir/objects.a -Wl,--no-whole-archive  -o cmTC_9245d.exe -Wl,--major-image-version,0,--minor-image-version,0 -lkernel32 -luser32 -lgdi32 -lwinspool -lshell32 -lole32 -loleaut32 -luuid -lcomdlg32 -ladvapi32 
C:/msys32/mingw32/bin/../lib/gcc/i686-w64-mingw32/7.4.0/../../../../i686-w64-mingw32/bin/ld.exe: unrecognized option '-z'

C:/msys32/mingw32/bin/../lib/gcc/i686-w64-mingw32/7.4.0/../../../../i686-w64-mingw32/bin/ld.exe: use the --help option for usage information

collect2.exe: error: ld returned 1 exit status

make[2]: *** [CMakeFiles/cmTC_9245d.dir/build.make:88: cmTC_9245d.exe] Error 1
make[2]: Leaving directory '/home/buildbot/slave/monero-static-win32/build/build/release/CMakeFiles/CMakeTmp'
make[1]: *** [Makefile:121: cmTC_9245d/fast] Error 2
make[1]: Leaving directory '/home/buildbot/slave/monero-static-win32/build/build/release/CMakeFiles/CMakeTmp'


Determining if the -Wl,--high-entropy-va linker flag is supported failed with the following output:
Change Dir: C:/msys32/home/buildbot/slave/monero-static-win32/build/build/release/CMakeFiles/CMakeTmp

Run Build Command:"C:/msys32/usr/bin/make.exe" "cmTC_27c29/fast"
make[1]: Entering directory '/home/buildbot/slave/monero-static-win32/build/build/release/CMakeFiles/CMakeTmp'
/usr/bin/make -f CMakeFiles/cmTC_27c29.dir/build.make CMakeFiles/cmTC_27c29.dir/build
make[2]: Entering directory '/home/buildbot/slave/monero-static-win32/build/build/release/CMakeFiles/CMakeTmp'
Building C object CMakeFiles/cmTC_27c29.dir/CheckLinkerFlag.c.obj

/C/msys32/mingw32/bin/i686-w64-mingw32-gcc.exe   -Wl,--high-entropy-va    -Wl,--high-entropy-va -o CMakeFiles/cmTC_27c29.dir/CheckLinkerFlag.c.obj   -c /C/msys32/home/buildbot/slave/monero-static-win32/build/cmake/CheckLinkerFlag.c
Linking C executable cmTC_27c29.exe

/C/msys32/mingw32/bin/cmake.exe -E remove -f CMakeFiles/cmTC_27c29.dir/objects.a
ar cr CMakeFiles/cmTC_27c29.dir/objects.a "CMakeFiles/cmTC_27c29.dir/CheckLinkerFlag.c.obj" 
/C/msys32/mingw32/bin/i686-w64-mingw32-gcc.exe -Wl,--high-entropy-va     -Wl,--whole-archive CMakeFiles/cmTC_27c29.dir/objects.a -Wl,--no-whole-archive  -o cmTC_27c29.exe -Wl,--major-image-version,0,--minor-image-version,0 -lkernel32 -luser32 -lgdi32 -lwinspool -lshell32 -lole32 -loleaut32 -luuid -lcomdlg32 -ladvapi32 
C:/msys32/mingw32/bin/../lib/gcc/i686-w64-mingw32/7.4.0/../../../../i686-w64-mingw32/bin/ld.exe: unrecognized option '--high-entropy-va'

C:/msys32/mingw32/bin/../lib/gcc/i686-w64-mingw32/7.4.0/../../../../i686-w64-mingw32/bin/ld.exe: use the --help option for usage information

collect2.exe: error: ld returned 1 exit status

make[2]: *** [CMakeFiles/cmTC_27c29.dir/build.make:88: cmTC_27c29.exe] Error 1
make[2]: Leaving directory '/home/buildbot/slave/monero-static-win32/build/build/release/CMakeFiles/CMakeTmp'
make[1]: *** [Makefile:121: cmTC_27c29/fast] Error 2
make[1]: Leaving directory '/home/buildbot/slave/monero-static-win32/build/build/release/CMakeFiles/CMakeTmp'


Determining if the function rl_copy_text exists failed with the following output:
Change Dir: C:/msys32/home/buildbot/slave/monero-static-win32/build/build/release/CMakeFiles/CMakeTmp

Run Build Command:"C:/msys32/usr/bin/make.exe" "cmTC_1b6b7/fast"
make[1]: Entering directory '/home/buildbot/slave/monero-static-win32/build/build/release/CMakeFiles/CMakeTmp'
/usr/bin/make -f CMakeFiles/cmTC_1b6b7.dir/build.make CMakeFiles/cmTC_1b6b7.dir/build
make[2]: Entering directory '/home/buildbot/slave/monero-static-win32/build/build/release/CMakeFiles/CMakeTmp'
Building C object CMakeFiles/cmTC_1b6b7.dir/CheckFunctionExists.c.obj

/C/msys32/mingw32/bin/i686-w64-mingw32-gcc.exe   -maes -march=i686 -fno-strict-aliasing -std=c11 -D_GNU_SOURCE -m32 -DWIN32_LEAN_AND_MEAN  -Wall -Wextra -Wpointer-arith -Wundef -Wvla -Wwrite-strings -Wno-error=extra -Wno-error=deprecated-declarations -Wno-unused-parameter -Wno-unused-variable -Wno-error=unused-variable -Wno-error=undef -Wno-error=uninitialized -Wlogical-op -Wno-error=maybe-uninitialized -Wno-error=cpp -Wno-error=unused-value -Wno-error=unused-but-set-variable -Waggregate-return -Wnested-externs -Wold-style-definition -Wstrict-prototypes  -fPIC  -U_FORTIFY_SOURCE -D_FORTIFY_SOURCE=1 -Wformat -Wformat-security -mmitigate-rop -fno-strict-aliasing -DCHECK_FUNCTION_EXISTS=rl_copy_text   -o CMakeFiles/cmTC_1b6b7.dir/CheckFunctionExists.c.obj   -c /C/msys32/mingw32/share/cmake-3.12/Modules/CheckFunctionExists.c
Linking C executable cmTC_1b6b7.exe

/C/msys32/mingw32/bin/cmake.exe -E remove -f CMakeFiles/cmTC_1b6b7.dir/objects.a
ar cr CMakeFiles/cmTC_1b6b7.dir/objects.a "CMakeFiles/cmTC_1b6b7.dir/CheckFunctionExists.c.obj" 
/C/msys32/mingw32/bin/i686-w64-mingw32-gcc.exe  -maes -march=i686 -fno-strict-aliasing -std=c11 -D_GNU_SOURCE -m32 -DWIN32_LEAN_AND_MEAN  -Wall -Wextra -Wpointer-arith -Wundef -Wvla -Wwrite-strings -Wno-error=extra -Wno-error=deprecated-declarations -Wno-unused-parameter -Wno-unused-variable -Wno-error=unused-variable -Wno-error=undef -Wno-error=uninitialized -Wlogical-op -Wno-error=maybe-uninitialized -Wno-error=cpp -Wno-error=unused-value -Wno-error=unused-but-set-variable -Waggregate-return -Wnested-externs -Wold-style-definition -Wstrict-prototypes  -fPIC  -U_FORTIFY_SOURCE -D_FORTIFY_SOURCE=1 -Wformat -Wformat-security -mmitigate-rop -fno-strict-aliasing -DCHECK_FUNCTION_EXISTS=rl_copy_text    -Wl,--whole-archive CMakeFiles/cmTC_1b6b7.dir/objects.a -Wl,--no-whole-archive  -o cmTC_1b6b7.exe -Wl,--major-image-version,0,--minor-image-version,0 /C/msys32/mingw32/lib/libreadline.a -lkernel32 -luser32 -lgdi32 -lwinspool -lshell32 -lole32 -loleaut32 -luuid -lcomdlg32 -ladvapi32 
C:/msys32/mingw32/lib/libreadline.a(terminal.o):(.text+0x1a6): undefined reference to `tgetnum'

C:/msys32/mingw32/lib/libreadline.a(terminal.o):(.text+0x2df): undefined reference to `tgetnum'

C:/msys32/mingw32/lib/libreadline.a(terminal.o):(.text+0x757): undefined reference to `tgetent'

C:/msys32/mingw32/lib/libreadline.a(terminal.o):(.text+0x793): undefined reference to `tgetstr'

C:/msys32/mingw32/lib/libreadline.a(terminal.o):(.text+0x7e6): undefined reference to `tgetflag'

C:/msys32/mingw32/lib/libreadline.a(terminal.o):(.text+0x833): undefined reference to `tgetflag'

C:/msys32/mingw32/lib/libreadline.a(terminal.o):(.text+0x948): undefined reference to `tgetflag'

C:/msys32/mingw32/lib/libreadline.a(terminal.o):(.text+0xb2c): undefined reference to `tputs'

C:/msys32/mingw32/lib/libreadline.a(terminal.o):(.text+0xc17): undefined reference to `tputs'

C:/msys32/mingw32/lib/libreadline.a(terminal.o):(.text+0xc59): undefined reference to `tputs'

C:/msys32/mingw32/lib/libreadline.a(terminal.o):(.text+0xcb7): undefined reference to `tputs'

C:/msys32/mingw32/lib/libreadline.a(terminal.o):(.text+0xcf8): undefined reference to `tputs'

C:/msys32/mingw32/lib/libreadline.a(terminal.o):(.text+0xd4a): more undefined references to `tputs' follow

collect2.exe: error: ld returned 1 exit status

make[2]: *** [CMakeFiles/cmTC_1b6b7.dir/build.make:89: cmTC_1b6b7.exe] Error 1
make[2]: Leaving directory '/home/buildbot/slave/monero-static-win32/build/build/release/CMakeFiles/CMakeTmp'
make[1]: *** [Makefile:121: cmTC_1b6b7/fast] Error 2
make[1]: Leaving directory '/home/buildbot/slave/monero-static-win32/build/build/release/CMakeFiles/CMakeTmp'


Determining if the function rl_filename_completion_function exists failed with the following output:
Change Dir: C:/msys32/home/buildbot/slave/monero-static-win32/build/build/release/CMakeFiles/CMakeTmp

Run Build Command:"C:/msys32/usr/bin/make.exe" "cmTC_8e8eb/fast"
make[1]: Entering directory '/home/buildbot/slave/monero-static-win32/build/build/release/CMakeFiles/CMakeTmp'
/usr/bin/make -f CMakeFiles/cmTC_8e8eb.dir/build.make CMakeFiles/cmTC_8e8eb.dir/build
make[2]: Entering directory '/home/buildbot/slave/monero-static-win32/build/build/release/CMakeFiles/CMakeTmp'
Building C object CMakeFiles/cmTC_8e8eb.dir/CheckFunctionExists.c.obj

/C/msys32/mingw32/bin/i686-w64-mingw32-gcc.exe   -maes -march=i686 -fno-strict-aliasing -std=c11 -D_GNU_SOURCE -m32 -DWIN32_LEAN_AND_MEAN  -Wall -Wextra -Wpointer-arith -Wundef -Wvla -Wwrite-strings -Wno-error=extra -Wno-error=deprecated-declarations -Wno-unused-parameter -Wno-unused-variable -Wno-error=unused-variable -Wno-error=undef -Wno-error=uninitialized -Wlogical-op -Wno-error=maybe-uninitialized -Wno-error=cpp -Wno-error=unused-value -Wno-error=unused-but-set-variable -Waggregate-return -Wnested-externs -Wold-style-definition -Wstrict-prototypes  -fPIC  -U_FORTIFY_SOURCE -D_FORTIFY_SOURCE=1 -Wformat -Wformat-security -mmitigate-rop -fno-strict-aliasing -DCHECK_FUNCTION_EXISTS=rl_filename_completion_function   -o CMakeFiles/cmTC_8e8eb.dir/CheckFunctionExists.c.obj   -c /C/msys32/mingw32/share/cmake-3.12/Modules/CheckFunctionExists.c
Linking C executable cmTC_8e8eb.exe

/C/msys32/mingw32/bin/cmake.exe -E remove -f CMakeFiles/cmTC_8e8eb.dir/objects.a
ar cr CMakeFiles/cmTC_8e8eb.dir/objects.a "CMakeFiles/cmTC_8e8eb.dir/CheckFunctionExists.c.obj" 
/C/msys32/mingw32/bin/i686-w64-mingw32-gcc.exe  -maes -march=i686 -fno-strict-aliasing -std=c11 -D_GNU_SOURCE -m32 -DWIN32_LEAN_AND_MEAN  -Wall -Wextra -Wpointer-arith -Wundef -Wvla -Wwrite-strings -Wno-error=extra -Wno-error=deprecated-declarations -Wno-unused-parameter -Wno-unused-variable -Wno-error=unused-variable -Wno-error=undef -Wno-error=uninitialized -Wlogical-op -Wno-error=maybe-uninitialized -Wno-error=cpp -Wno-error=unused-value -Wno-error=unused-but-set-variable -Waggregate-return -Wnested-externs -Wold-style-definition -Wstrict-prototypes  -fPIC  -U_FORTIFY_SOURCE -D_FORTIFY_SOURCE=1 -Wformat -Wformat-security -mmitigate-rop -fno-strict-aliasing -DCHECK_FUNCTION_EXISTS=rl_filename_completion_function    -Wl,--whole-archive CMakeFiles/cmTC_8e8eb.dir/objects.a -Wl,--no-whole-archive  -o cmTC_8e8eb.exe -Wl,--major-image-version,0,--minor-image-version,0 /C/msys32/mingw32/lib/libreadline.a -lkernel32 -luser32 -lgdi32 -lwinspool -lshell32 -lole32 -loleaut32 -luuid -lcomdlg32 -ladvapi32 
C:/msys32/mingw32/lib/libreadline.a(display.o):(.text+0x99f): undefined reference to `tputs'

C:/msys32/mingw32/lib/libreadline.a(display.o):(.text+0xa9a): undefined reference to `tputs'

C:/msys32/mingw32/lib/libreadline.a(display.o):(.text+0xaec): undefined reference to `tputs'

C:/msys32/mingw32/lib/libreadline.a(display.o):(.text+0x12e4): undefined reference to `tputs'

C:/msys32/mingw32/lib/libreadline.a(display.o):(.text+0x18b3): undefined reference to `tputs'

C:/msys32/mingw32/lib/libreadline.a(display.o):(.text+0x29ad): more undefined references to `tputs' follow

C:/msys32/mingw32/lib/libreadline.a(terminal.o):(.text+0x1a6): undefined reference to `tgetnum'

C:/msys32/mingw32/lib/libreadline.a(terminal.o):(.text+0x2df): undefined reference to `tgetnum'

C:/msys32/mingw32/lib/libreadline.a(terminal.o):(.text+0x757): undefined reference to `tgetent'

C:/msys32/mingw32/lib/libreadline.a(terminal.o):(.text+0x793): undefined reference to `tgetstr'

C:/msys32/mingw32/lib/libreadline.a(terminal.o):(.text+0x7e6): undefined reference to `tgetflag'

C:/msys32/mingw32/lib/libreadline.a(terminal.o):(.text+0x833): undefined reference to `tgetflag'

C:/msys32/mingw32/lib/libreadline.a(terminal.o):(.text+0x948): undefined reference to `tgetflag'

C:/msys32/mingw32/lib/libreadline.a(terminal.o):(.text+0xb2c): undefined reference to `tputs'

C:/msys32/mingw32/lib/libreadline.a(terminal.o):(.text+0xc17): undefined reference to `tputs'

C:/msys32/mingw32/lib/libreadline.a(terminal.o):(.text+0xc59): undefined reference to `tputs'

C:/msys32/mingw32/lib/libreadline.a(terminal.o):(.text+0xcb7): undefined reference to `tputs'

C:/msys32/mingw32/lib/libreadline.a(terminal.o):(.text+0xcf8): undefined reference to `tputs'

C:/msys32/mingw32/lib/libreadline.a(terminal.o):(.text+0xd4a): more undefined references to `tputs' follow

collect2.exe: error: ld returned 1 exit status

make[2]: *** [CMakeFiles/cmTC_8e8eb.dir/build.make:89: cmTC_8e8eb.exe] Error 1
make[2]: Leaving directory '/home/buildbot/slave/monero-static-win32/build/build/release/CMakeFiles/CMakeTmp'
make[1]: *** [Makefile:121: cmTC_8e8eb/fast] Error 2
make[1]: Leaving directory '/home/buildbot/slave/monero-static-win32/build/build/release/CMakeFiles/CMakeTmp'