(view as text)
Determining if the function memset_s exists in the c failed with the following output:
Change Dir: C:/msys32/home/buildbot/slave/monero-static-win32/build/build/release/CMakeFiles/CMakeTmp

Run Build Command:"C:/msys32/usr/bin/make.exe" "cmTC_86a1b/fast"
make[1]: Entering directory '/home/buildbot/slave/monero-static-win32/build/build/release/CMakeFiles/CMakeTmp'
/usr/bin/make -f CMakeFiles/cmTC_86a1b.dir/build.make CMakeFiles/cmTC_86a1b.dir/build
make[2]: Entering directory '/home/buildbot/slave/monero-static-win32/build/build/release/CMakeFiles/CMakeTmp'
Building C object CMakeFiles/cmTC_86a1b.dir/CheckFunctionExists.c.obj

/C/msys32/mingw32/bin/i686-w64-mingw32-gcc.exe   -DCHECK_FUNCTION_EXISTS=memset_s   -o CMakeFiles/cmTC_86a1b.dir/CheckFunctionExists.c.obj   -c /C/msys32/mingw32/share/cmake-3.12/Modules/CheckFunctionExists.c
Linking C executable cmTC_86a1b.exe

/C/msys32/mingw32/bin/cmake.exe -E remove -f CMakeFiles/cmTC_86a1b.dir/objects.a
ar cr CMakeFiles/cmTC_86a1b.dir/objects.a "CMakeFiles/cmTC_86a1b.dir/CheckFunctionExists.c.obj" 
/C/msys32/mingw32/bin/i686-w64-mingw32-gcc.exe  -DCHECK_FUNCTION_EXISTS=memset_s    -Wl,--whole-archive CMakeFiles/cmTC_86a1b.dir/objects.a -Wl,--no-whole-archive  -o cmTC_86a1b.exe -Wl,--major-image-version,0,--minor-image-version,0  -L/C/msys32/home/buildbot/slave/monero-static-win32/build/build/release/CMakeFiles/CMakeTmp/string.h -lc -lkernel32 -luser32 -lgdi32 -lwinspool -lshell32 -lole32 -loleaut32 -luuid -lcomdlg32 -ladvapi32 
C:/msys32/mingw32/bin/../lib/gcc/i686-w64-mingw32/7.4.0/../../../../i686-w64-mingw32/bin/ld.exe: cannot find -lc

collect2.exe: error: ld returned 1 exit status

make[2]: *** [CMakeFiles/cmTC_86a1b.dir/build.make:88: cmTC_86a1b.exe] Error 1
make[2]: Leaving directory '/home/buildbot/slave/monero-static-win32/build/build/release/CMakeFiles/CMakeTmp'
make[1]: *** [Makefile:121: cmTC_86a1b/fast] Error 2
make[1]: Leaving directory '/home/buildbot/slave/monero-static-win32/build/build/release/CMakeFiles/CMakeTmp'


Determining if the function explicit_bzero exists in the c failed with the following output:
Change Dir: C:/msys32/home/buildbot/slave/monero-static-win32/build/build/release/CMakeFiles/CMakeTmp

Run Build Command:"C:/msys32/usr/bin/make.exe" "cmTC_023c0/fast"
make[1]: Entering directory '/home/buildbot/slave/monero-static-win32/build/build/release/CMakeFiles/CMakeTmp'
/usr/bin/make -f CMakeFiles/cmTC_023c0.dir/build.make CMakeFiles/cmTC_023c0.dir/build
make[2]: Entering directory '/home/buildbot/slave/monero-static-win32/build/build/release/CMakeFiles/CMakeTmp'
Building C object CMakeFiles/cmTC_023c0.dir/CheckFunctionExists.c.obj

/C/msys32/mingw32/bin/i686-w64-mingw32-gcc.exe   -DCHECK_FUNCTION_EXISTS=explicit_bzero   -o CMakeFiles/cmTC_023c0.dir/CheckFunctionExists.c.obj   -c /C/msys32/mingw32/share/cmake-3.12/Modules/CheckFunctionExists.c
Linking C executable cmTC_023c0.exe

/C/msys32/mingw32/bin/cmake.exe -E remove -f CMakeFiles/cmTC_023c0.dir/objects.a
ar cr CMakeFiles/cmTC_023c0.dir/objects.a "CMakeFiles/cmTC_023c0.dir/CheckFunctionExists.c.obj" 
/C/msys32/mingw32/bin/i686-w64-mingw32-gcc.exe  -DCHECK_FUNCTION_EXISTS=explicit_bzero    -Wl,--whole-archive CMakeFiles/cmTC_023c0.dir/objects.a -Wl,--no-whole-archive  -o cmTC_023c0.exe -Wl,--major-image-version,0,--minor-image-version,0  -L/C/msys32/home/buildbot/slave/monero-static-win32/build/build/release/CMakeFiles/CMakeTmp/strings.h -lc -lkernel32 -luser32 -lgdi32 -lwinspool -lshell32 -lole32 -loleaut32 -luuid -lcomdlg32 -ladvapi32 
C:/msys32/mingw32/bin/../lib/gcc/i686-w64-mingw32/7.4.0/../../../../i686-w64-mingw32/bin/ld.exe: cannot find -lc

collect2.exe: error: ld returned 1 exit status

make[2]: *** [CMakeFiles/cmTC_023c0.dir/build.make:88: cmTC_023c0.exe] Error 1
make[2]: Leaving directory '/home/buildbot/slave/monero-static-win32/build/build/release/CMakeFiles/CMakeTmp'
make[1]: *** [Makefile:121: cmTC_023c0/fast] Error 2
make[1]: Leaving directory '/home/buildbot/slave/monero-static-win32/build/build/release/CMakeFiles/CMakeTmp'


Determining if the function strptime exists failed with the following output:
Change Dir: C:/msys32/home/buildbot/slave/monero-static-win32/build/build/release/CMakeFiles/CMakeTmp

Run Build Command:"C:/msys32/usr/bin/make.exe" "cmTC_2c0c1/fast"
make[1]: Entering directory '/home/buildbot/slave/monero-static-win32/build/build/release/CMakeFiles/CMakeTmp'
/usr/bin/make -f CMakeFiles/cmTC_2c0c1.dir/build.make CMakeFiles/cmTC_2c0c1.dir/build
make[2]: Entering directory '/home/buildbot/slave/monero-static-win32/build/build/release/CMakeFiles/CMakeTmp'
Building C object CMakeFiles/cmTC_2c0c1.dir/CheckFunctionExists.c.obj

/C/msys32/mingw32/bin/i686-w64-mingw32-gcc.exe   -DCHECK_FUNCTION_EXISTS=strptime   -o CMakeFiles/cmTC_2c0c1.dir/CheckFunctionExists.c.obj   -c /C/msys32/mingw32/share/cmake-3.12/Modules/CheckFunctionExists.c
Linking C executable cmTC_2c0c1.exe

/C/msys32/mingw32/bin/cmake.exe -E remove -f CMakeFiles/cmTC_2c0c1.dir/objects.a
ar cr CMakeFiles/cmTC_2c0c1.dir/objects.a "CMakeFiles/cmTC_2c0c1.dir/CheckFunctionExists.c.obj" 
/C/msys32/mingw32/bin/i686-w64-mingw32-gcc.exe  -DCHECK_FUNCTION_EXISTS=strptime    -Wl,--whole-archive CMakeFiles/cmTC_2c0c1.dir/objects.a -Wl,--no-whole-archive  -o cmTC_2c0c1.exe -Wl,--major-image-version,0,--minor-image-version,0 -lkernel32 -luser32 -lgdi32 -lwinspool -lshell32 -lole32 -loleaut32 -luuid -lcomdlg32 -ladvapi32 
CMakeFiles/cmTC_2c0c1.dir/objects.a(CheckFunctionExists.c.obj):CheckFunctionExists.c:(.text+0xc): undefined reference to `strptime'

collect2.exe: error: ld returned 1 exit status

make[2]: *** [CMakeFiles/cmTC_2c0c1.dir/build.make:88: cmTC_2c0c1.exe] Error 1
make[2]: Leaving directory '/home/buildbot/slave/monero-static-win32/build/build/release/CMakeFiles/CMakeTmp'
make[1]: *** [Makefile:121: cmTC_2c0c1/fast] Error 2
make[1]: Leaving directory '/home/buildbot/slave/monero-static-win32/build/build/release/CMakeFiles/CMakeTmp'


Determining if the include file arpa/inet.h exists failed with the following output:
Change Dir: C:/msys32/home/buildbot/slave/monero-static-win32/build/build/release/CMakeFiles/CMakeTmp

Run Build Command:"C:/msys32/usr/bin/make.exe" "cmTC_0a18c/fast"
make[1]: Entering directory '/home/buildbot/slave/monero-static-win32/build/build/release/CMakeFiles/CMakeTmp'
/usr/bin/make -f CMakeFiles/cmTC_0a18c.dir/build.make CMakeFiles/cmTC_0a18c.dir/build
make[2]: Entering directory '/home/buildbot/slave/monero-static-win32/build/build/release/CMakeFiles/CMakeTmp'
Building C object CMakeFiles/cmTC_0a18c.dir/CheckIncludeFile.c.obj

/C/msys32/mingw32/bin/i686-w64-mingw32-gcc.exe    -o CMakeFiles/cmTC_0a18c.dir/CheckIncludeFile.c.obj   -c /C/msys32/home/buildbot/slave/monero-static-win32/build/build/release/CMakeFiles/CMakeTmp/CheckIncludeFile.c
C:/msys32/home/buildbot/slave/monero-static-win32/build/build/release/CMakeFiles/CMakeTmp/CheckIncludeFile.c:1:10: fatal error: arpa/inet.h: No such file or directory

 #include <arpa/inet.h>

          ^~~~~~~~~~~~~

compilation terminated.

make[2]: *** [CMakeFiles/cmTC_0a18c.dir/build.make:66: CMakeFiles/cmTC_0a18c.dir/CheckIncludeFile.c.obj] Error 1
make[2]: Leaving directory '/home/buildbot/slave/monero-static-win32/build/build/release/CMakeFiles/CMakeTmp'
make[1]: *** [Makefile:121: cmTC_0a18c/fast] Error 2
make[1]: Leaving directory '/home/buildbot/slave/monero-static-win32/build/build/release/CMakeFiles/CMakeTmp'


Determining if the include file endian.h exists failed with the following output:
Change Dir: C:/msys32/home/buildbot/slave/monero-static-win32/build/build/release/CMakeFiles/CMakeTmp

Run Build Command:"C:/msys32/usr/bin/make.exe" "cmTC_ebc8d/fast"
make[1]: Entering directory '/home/buildbot/slave/monero-static-win32/build/build/release/CMakeFiles/CMakeTmp'
/usr/bin/make -f CMakeFiles/cmTC_ebc8d.dir/build.make CMakeFiles/cmTC_ebc8d.dir/build
make[2]: Entering directory '/home/buildbot/slave/monero-static-win32/build/build/release/CMakeFiles/CMakeTmp'
Building C object CMakeFiles/cmTC_ebc8d.dir/CheckIncludeFile.c.obj

/C/msys32/mingw32/bin/i686-w64-mingw32-gcc.exe    -o CMakeFiles/cmTC_ebc8d.dir/CheckIncludeFile.c.obj   -c /C/msys32/home/buildbot/slave/monero-static-win32/build/build/release/CMakeFiles/CMakeTmp/CheckIncludeFile.c
C:/msys32/home/buildbot/slave/monero-static-win32/build/build/release/CMakeFiles/CMakeTmp/CheckIncludeFile.c:1:10: fatal error: endian.h: No such file or directory

 #include <endian.h>

          ^~~~~~~~~~

compilation terminated.

make[2]: *** [CMakeFiles/cmTC_ebc8d.dir/build.make:66: CMakeFiles/cmTC_ebc8d.dir/CheckIncludeFile.c.obj] Error 1
make[2]: Leaving directory '/home/buildbot/slave/monero-static-win32/build/build/release/CMakeFiles/CMakeTmp'
make[1]: *** [Makefile:121: cmTC_ebc8d/fast] Error 2
make[1]: Leaving directory '/home/buildbot/slave/monero-static-win32/build/build/release/CMakeFiles/CMakeTmp'


Determining if the include file dlfcn.h exists failed with the following output:
Change Dir: C:/msys32/home/buildbot/slave/monero-static-win32/build/build/release/CMakeFiles/CMakeTmp

Run Build Command:"C:/msys32/usr/bin/make.exe" "cmTC_48eb4/fast"
make[1]: Entering directory '/home/buildbot/slave/monero-static-win32/build/build/release/CMakeFiles/CMakeTmp'
/usr/bin/make -f CMakeFiles/cmTC_48eb4.dir/build.make CMakeFiles/cmTC_48eb4.dir/build
make[2]: Entering directory '/home/buildbot/slave/monero-static-win32/build/build/release/CMakeFiles/CMakeTmp'
Building C object CMakeFiles/cmTC_48eb4.dir/CheckIncludeFile.c.obj

/C/msys32/mingw32/bin/i686-w64-mingw32-gcc.exe    -o CMakeFiles/cmTC_48eb4.dir/CheckIncludeFile.c.obj   -c /C/msys32/home/buildbot/slave/monero-static-win32/build/build/release/CMakeFiles/CMakeTmp/CheckIncludeFile.c
C:/msys32/home/buildbot/slave/monero-static-win32/build/build/release/CMakeFiles/CMakeTmp/CheckIncludeFile.c:1:10: fatal error: dlfcn.h: No such file or directory

 #include <dlfcn.h>

          ^~~~~~~~~

compilation terminated.

make[2]: *** [CMakeFiles/cmTC_48eb4.dir/build.make:66: CMakeFiles/cmTC_48eb4.dir/CheckIncludeFile.c.obj] Error 1
make[2]: Leaving directory '/home/buildbot/slave/monero-static-win32/build/build/release/CMakeFiles/CMakeTmp'
make[1]: *** [Makefile:121: cmTC_48eb4/fast] Error 2
make[1]: Leaving directory '/home/buildbot/slave/monero-static-win32/build/build/release/CMakeFiles/CMakeTmp'


Determining if the include file event.h exists failed with the following output:
Change Dir: C:/msys32/home/buildbot/slave/monero-static-win32/build/build/release/CMakeFiles/CMakeTmp

Run Build Command:"C:/msys32/usr/bin/make.exe" "cmTC_9712d/fast"
make[1]: Entering directory '/home/buildbot/slave/monero-static-win32/build/build/release/CMakeFiles/CMakeTmp'
/usr/bin/make -f CMakeFiles/cmTC_9712d.dir/build.make CMakeFiles/cmTC_9712d.dir/build
make[2]: Entering directory '/home/buildbot/slave/monero-static-win32/build/build/release/CMakeFiles/CMakeTmp'
Building C object CMakeFiles/cmTC_9712d.dir/CheckIncludeFile.c.obj

/C/msys32/mingw32/bin/i686-w64-mingw32-gcc.exe    -o CMakeFiles/cmTC_9712d.dir/CheckIncludeFile.c.obj   -c /C/msys32/home/buildbot/slave/monero-static-win32/build/build/release/CMakeFiles/CMakeTmp/CheckIncludeFile.c
C:/msys32/home/buildbot/slave/monero-static-win32/build/build/release/CMakeFiles/CMakeTmp/CheckIncludeFile.c:1:10: fatal error: event.h: No such file or directory

 #include <event.h>

          ^~~~~~~~~

compilation terminated.

make[2]: *** [CMakeFiles/cmTC_9712d.dir/build.make:66: CMakeFiles/cmTC_9712d.dir/CheckIncludeFile.c.obj] Error 1
make[2]: Leaving directory '/home/buildbot/slave/monero-static-win32/build/build/release/CMakeFiles/CMakeTmp'
make[1]: *** [Makefile:121: cmTC_9712d/fast] Error 2
make[1]: Leaving directory '/home/buildbot/slave/monero-static-win32/build/build/release/CMakeFiles/CMakeTmp'


Determining if the include file glob.h exists failed with the following output:
Change Dir: C:/msys32/home/buildbot/slave/monero-static-win32/build/build/release/CMakeFiles/CMakeTmp

Run Build Command:"C:/msys32/usr/bin/make.exe" "cmTC_d35c1/fast"
make[1]: Entering directory '/home/buildbot/slave/monero-static-win32/build/build/release/CMakeFiles/CMakeTmp'
/usr/bin/make -f CMakeFiles/cmTC_d35c1.dir/build.make CMakeFiles/cmTC_d35c1.dir/build
make[2]: Entering directory '/home/buildbot/slave/monero-static-win32/build/build/release/CMakeFiles/CMakeTmp'
Building C object CMakeFiles/cmTC_d35c1.dir/CheckIncludeFile.c.obj

/C/msys32/mingw32/bin/i686-w64-mingw32-gcc.exe    -o CMakeFiles/cmTC_d35c1.dir/CheckIncludeFile.c.obj   -c /C/msys32/home/buildbot/slave/monero-static-win32/build/build/release/CMakeFiles/CMakeTmp/CheckIncludeFile.c
C:/msys32/home/buildbot/slave/monero-static-win32/build/build/release/CMakeFiles/CMakeTmp/CheckIncludeFile.c:1:10: fatal error: glob.h: No such file or directory

 #include <glob.h>

          ^~~~~~~~

compilation terminated.

make[2]: *** [CMakeFiles/cmTC_d35c1.dir/build.make:66: CMakeFiles/cmTC_d35c1.dir/CheckIncludeFile.c.obj] Error 1
make[2]: Leaving directory '/home/buildbot/slave/monero-static-win32/build/build/release/CMakeFiles/CMakeTmp'
make[1]: *** [Makefile:121: cmTC_d35c1/fast] Error 2
make[1]: Leaving directory '/home/buildbot/slave/monero-static-win32/build/build/release/CMakeFiles/CMakeTmp'


Determining if the include file grp.h exists failed with the following output:
Change Dir: C:/msys32/home/buildbot/slave/monero-static-win32/build/build/release/CMakeFiles/CMakeTmp

Run Build Command:"C:/msys32/usr/bin/make.exe" "cmTC_362be/fast"
make[1]: Entering directory '/home/buildbot/slave/monero-static-win32/build/build/release/CMakeFiles/CMakeTmp'
/usr/bin/make -f CMakeFiles/cmTC_362be.dir/build.make CMakeFiles/cmTC_362be.dir/build
make[2]: Entering directory '/home/buildbot/slave/monero-static-win32/build/build/release/CMakeFiles/CMakeTmp'
Building C object CMakeFiles/cmTC_362be.dir/CheckIncludeFile.c.obj

/C/msys32/mingw32/bin/i686-w64-mingw32-gcc.exe    -o CMakeFiles/cmTC_362be.dir/CheckIncludeFile.c.obj   -c /C/msys32/home/buildbot/slave/monero-static-win32/build/build/release/CMakeFiles/CMakeTmp/CheckIncludeFile.c
C:/msys32/home/buildbot/slave/monero-static-win32/build/build/release/CMakeFiles/CMakeTmp/CheckIncludeFile.c:1:10: fatal error: grp.h: No such file or directory

 #include <grp.h>

          ^~~~~~~

compilation terminated.

make[2]: *** [CMakeFiles/cmTC_362be.dir/build.make:66: CMakeFiles/cmTC_362be.dir/CheckIncludeFile.c.obj] Error 1
make[2]: Leaving directory '/home/buildbot/slave/monero-static-win32/build/build/release/CMakeFiles/CMakeTmp'
make[1]: *** [Makefile:121: cmTC_362be/fast] Error 2
make[1]: Leaving directory '/home/buildbot/slave/monero-static-win32/build/build/release/CMakeFiles/CMakeTmp'


Determining if the include file login_cap.h exists failed with the following output:
Change Dir: C:/msys32/home/buildbot/slave/monero-static-win32/build/build/release/CMakeFiles/CMakeTmp

Run Build Command:"C:/msys32/usr/bin/make.exe" "cmTC_743e4/fast"
make[1]: Entering directory '/home/buildbot/slave/monero-static-win32/build/build/release/CMakeFiles/CMakeTmp'
/usr/bin/make -f CMakeFiles/cmTC_743e4.dir/build.make CMakeFiles/cmTC_743e4.dir/build
make[2]: Entering directory '/home/buildbot/slave/monero-static-win32/build/build/release/CMakeFiles/CMakeTmp'
Building C object CMakeFiles/cmTC_743e4.dir/CheckIncludeFile.c.obj

/C/msys32/mingw32/bin/i686-w64-mingw32-gcc.exe    -o CMakeFiles/cmTC_743e4.dir/CheckIncludeFile.c.obj   -c /C/msys32/home/buildbot/slave/monero-static-win32/build/build/release/CMakeFiles/CMakeTmp/CheckIncludeFile.c
C:/msys32/home/buildbot/slave/monero-static-win32/build/build/release/CMakeFiles/CMakeTmp/CheckIncludeFile.c:1:10: fatal error: login_cap.h: No such file or directory

 #include <login_cap.h>

          ^~~~~~~~~~~~~

compilation terminated.

make[2]: *** [CMakeFiles/cmTC_743e4.dir/build.make:66: CMakeFiles/cmTC_743e4.dir/CheckIncludeFile.c.obj] Error 1
make[2]: Leaving directory '/home/buildbot/slave/monero-static-win32/build/build/release/CMakeFiles/CMakeTmp'
make[1]: *** [Makefile:121: cmTC_743e4/fast] Error 2
make[1]: Leaving directory '/home/buildbot/slave/monero-static-win32/build/build/release/CMakeFiles/CMakeTmp'


Determining if the include file netdb.h exists failed with the following output:
Change Dir: C:/msys32/home/buildbot/slave/monero-static-win32/build/build/release/CMakeFiles/CMakeTmp

Run Build Command:"C:/msys32/usr/bin/make.exe" "cmTC_3dc6b/fast"
make[1]: Entering directory '/home/buildbot/slave/monero-static-win32/build/build/release/CMakeFiles/CMakeTmp'
/usr/bin/make -f CMakeFiles/cmTC_3dc6b.dir/build.make CMakeFiles/cmTC_3dc6b.dir/build
make[2]: Entering directory '/home/buildbot/slave/monero-static-win32/build/build/release/CMakeFiles/CMakeTmp'
Building C object CMakeFiles/cmTC_3dc6b.dir/CheckIncludeFile.c.obj

/C/msys32/mingw32/bin/i686-w64-mingw32-gcc.exe    -o CMakeFiles/cmTC_3dc6b.dir/CheckIncludeFile.c.obj   -c /C/msys32/home/buildbot/slave/monero-static-win32/build/build/release/CMakeFiles/CMakeTmp/CheckIncludeFile.c
C:/msys32/home/buildbot/slave/monero-static-win32/build/build/release/CMakeFiles/CMakeTmp/CheckIncludeFile.c:1:10: fatal error: netdb.h: No such file or directory

 #include <netdb.h>

          ^~~~~~~~~

compilation terminated.

make[2]: *** [CMakeFiles/cmTC_3dc6b.dir/build.make:66: CMakeFiles/cmTC_3dc6b.dir/CheckIncludeFile.c.obj] Error 1
make[2]: Leaving directory '/home/buildbot/slave/monero-static-win32/build/build/release/CMakeFiles/CMakeTmp'
make[1]: *** [Makefile:121: cmTC_3dc6b/fast] Error 2
make[1]: Leaving directory '/home/buildbot/slave/monero-static-win32/build/build/release/CMakeFiles/CMakeTmp'


Determining if the include file netinet/in.h exists failed with the following output:
Change Dir: C:/msys32/home/buildbot/slave/monero-static-win32/build/build/release/CMakeFiles/CMakeTmp

Run Build Command:"C:/msys32/usr/bin/make.exe" "cmTC_a57ca/fast"
make[1]: Entering directory '/home/buildbot/slave/monero-static-win32/build/build/release/CMakeFiles/CMakeTmp'
/usr/bin/make -f CMakeFiles/cmTC_a57ca.dir/build.make CMakeFiles/cmTC_a57ca.dir/build
make[2]: Entering directory '/home/buildbot/slave/monero-static-win32/build/build/release/CMakeFiles/CMakeTmp'
Building C object CMakeFiles/cmTC_a57ca.dir/CheckIncludeFile.c.obj

/C/msys32/mingw32/bin/i686-w64-mingw32-gcc.exe    -o CMakeFiles/cmTC_a57ca.dir/CheckIncludeFile.c.obj   -c /C/msys32/home/buildbot/slave/monero-static-win32/build/build/release/CMakeFiles/CMakeTmp/CheckIncludeFile.c
C:/msys32/home/buildbot/slave/monero-static-win32/build/build/release/CMakeFiles/CMakeTmp/CheckIncludeFile.c:1:10: fatal error: netinet/in.h: No such file or directory

 #include <netinet/in.h>

          ^~~~~~~~~~~~~~

compilation terminated.

make[2]: *** [CMakeFiles/cmTC_a57ca.dir/build.make:66: CMakeFiles/cmTC_a57ca.dir/CheckIncludeFile.c.obj] Error 1
make[2]: Leaving directory '/home/buildbot/slave/monero-static-win32/build/build/release/CMakeFiles/CMakeTmp'
make[1]: *** [Makefile:121: cmTC_a57ca/fast] Error 2
make[1]: Leaving directory '/home/buildbot/slave/monero-static-win32/build/build/release/CMakeFiles/CMakeTmp'


Determining if the include file pwd.h exists failed with the following output:
Change Dir: C:/msys32/home/buildbot/slave/monero-static-win32/build/build/release/CMakeFiles/CMakeTmp

Run Build Command:"C:/msys32/usr/bin/make.exe" "cmTC_d0775/fast"
make[1]: Entering directory '/home/buildbot/slave/monero-static-win32/build/build/release/CMakeFiles/CMakeTmp'
/usr/bin/make -f CMakeFiles/cmTC_d0775.dir/build.make CMakeFiles/cmTC_d0775.dir/build
make[2]: Entering directory '/home/buildbot/slave/monero-static-win32/build/build/release/CMakeFiles/CMakeTmp'
Building C object CMakeFiles/cmTC_d0775.dir/CheckIncludeFile.c.obj

/C/msys32/mingw32/bin/i686-w64-mingw32-gcc.exe    -o CMakeFiles/cmTC_d0775.dir/CheckIncludeFile.c.obj   -c /C/msys32/home/buildbot/slave/monero-static-win32/build/build/release/CMakeFiles/CMakeTmp/CheckIncludeFile.c
C:/msys32/home/buildbot/slave/monero-static-win32/build/build/release/CMakeFiles/CMakeTmp/CheckIncludeFile.c:1:10: fatal error: pwd.h: No such file or directory

 #include <pwd.h>

          ^~~~~~~

compilation terminated.

make[2]: *** [CMakeFiles/cmTC_d0775.dir/build.make:66: CMakeFiles/cmTC_d0775.dir/CheckIncludeFile.c.obj] Error 1
make[2]: Leaving directory '/home/buildbot/slave/monero-static-win32/build/build/release/CMakeFiles/CMakeTmp'
make[1]: *** [Makefile:121: cmTC_d0775/fast] Error 2
make[1]: Leaving directory '/home/buildbot/slave/monero-static-win32/build/build/release/CMakeFiles/CMakeTmp'


Determining if the include file sys/resource.h exists failed with the following output:
Change Dir: C:/msys32/home/buildbot/slave/monero-static-win32/build/build/release/CMakeFiles/CMakeTmp

Run Build Command:"C:/msys32/usr/bin/make.exe" "cmTC_1db2a/fast"
make[1]: Entering directory '/home/buildbot/slave/monero-static-win32/build/build/release/CMakeFiles/CMakeTmp'
/usr/bin/make -f CMakeFiles/cmTC_1db2a.dir/build.make CMakeFiles/cmTC_1db2a.dir/build
make[2]: Entering directory '/home/buildbot/slave/monero-static-win32/build/build/release/CMakeFiles/CMakeTmp'
Building C object CMakeFiles/cmTC_1db2a.dir/CheckIncludeFile.c.obj

/C/msys32/mingw32/bin/i686-w64-mingw32-gcc.exe    -o CMakeFiles/cmTC_1db2a.dir/CheckIncludeFile.c.obj   -c /C/msys32/home/buildbot/slave/monero-static-win32/build/build/release/CMakeFiles/CMakeTmp/CheckIncludeFile.c
C:/msys32/home/buildbot/slave/monero-static-win32/build/build/release/CMakeFiles/CMakeTmp/CheckIncludeFile.c:1:10: fatal error: sys/resource.h: No such file or directory

 #include <sys/resource.h>

          ^~~~~~~~~~~~~~~~

compilation terminated.

make[2]: *** [CMakeFiles/cmTC_1db2a.dir/build.make:66: CMakeFiles/cmTC_1db2a.dir/CheckIncludeFile.c.obj] Error 1
make[2]: Leaving directory '/home/buildbot/slave/monero-static-win32/build/build/release/CMakeFiles/CMakeTmp'
make[1]: *** [Makefile:121: cmTC_1db2a/fast] Error 2
make[1]: Leaving directory '/home/buildbot/slave/monero-static-win32/build/build/release/CMakeFiles/CMakeTmp'


Determining if the include file sys/sha2.h exists failed with the following output:
Change Dir: C:/msys32/home/buildbot/slave/monero-static-win32/build/build/release/CMakeFiles/CMakeTmp

Run Build Command:"C:/msys32/usr/bin/make.exe" "cmTC_5d709/fast"
make[1]: Entering directory '/home/buildbot/slave/monero-static-win32/build/build/release/CMakeFiles/CMakeTmp'
/usr/bin/make -f CMakeFiles/cmTC_5d709.dir/build.make CMakeFiles/cmTC_5d709.dir/build
make[2]: Entering directory '/home/buildbot/slave/monero-static-win32/build/build/release/CMakeFiles/CMakeTmp'
Building C object CMakeFiles/cmTC_5d709.dir/CheckIncludeFile.c.obj

/C/msys32/mingw32/bin/i686-w64-mingw32-gcc.exe    -o CMakeFiles/cmTC_5d709.dir/CheckIncludeFile.c.obj   -c /C/msys32/home/buildbot/slave/monero-static-win32/build/build/release/CMakeFiles/CMakeTmp/CheckIncludeFile.c
C:/msys32/home/buildbot/slave/monero-static-win32/build/build/release/CMakeFiles/CMakeTmp/CheckIncludeFile.c:1:10: fatal error: sys/sha2.h: No such file or directory

 #include <sys/sha2.h>

          ^~~~~~~~~~~~

compilation terminated.

make[2]: *** [CMakeFiles/cmTC_5d709.dir/build.make:66: CMakeFiles/cmTC_5d709.dir/CheckIncludeFile.c.obj] Error 1
make[2]: Leaving directory '/home/buildbot/slave/monero-static-win32/build/build/release/CMakeFiles/CMakeTmp'
make[1]: *** [Makefile:121: cmTC_5d709/fast] Error 2
make[1]: Leaving directory '/home/buildbot/slave/monero-static-win32/build/build/release/CMakeFiles/CMakeTmp'


Determining if the include file sys/socket.h exists failed with the following output:
Change Dir: C:/msys32/home/buildbot/slave/monero-static-win32/build/build/release/CMakeFiles/CMakeTmp

Run Build Command:"C:/msys32/usr/bin/make.exe" "cmTC_5b489/fast"
make[1]: Entering directory '/home/buildbot/slave/monero-static-win32/build/build/release/CMakeFiles/CMakeTmp'
/usr/bin/make -f CMakeFiles/cmTC_5b489.dir/build.make CMakeFiles/cmTC_5b489.dir/build
make[2]: Entering directory '/home/buildbot/slave/monero-static-win32/build/build/release/CMakeFiles/CMakeTmp'
Building C object CMakeFiles/cmTC_5b489.dir/CheckIncludeFile.c.obj

/C/msys32/mingw32/bin/i686-w64-mingw32-gcc.exe    -o CMakeFiles/cmTC_5b489.dir/CheckIncludeFile.c.obj   -c /C/msys32/home/buildbot/slave/monero-static-win32/build/build/release/CMakeFiles/CMakeTmp/CheckIncludeFile.c
C:/msys32/home/buildbot/slave/monero-static-win32/build/build/release/CMakeFiles/CMakeTmp/CheckIncludeFile.c:1:10: fatal error: sys/socket.h: No such file or directory

 #include <sys/socket.h>

          ^~~~~~~~~~~~~~

compilation terminated.

make[2]: *** [CMakeFiles/cmTC_5b489.dir/build.make:66: CMakeFiles/cmTC_5b489.dir/CheckIncludeFile.c.obj] Error 1
make[2]: Leaving directory '/home/buildbot/slave/monero-static-win32/build/build/release/CMakeFiles/CMakeTmp'
make[1]: *** [Makefile:121: cmTC_5b489/fast] Error 2
make[1]: Leaving directory '/home/buildbot/slave/monero-static-win32/build/build/release/CMakeFiles/CMakeTmp'


Determining if the include file sys/sysctl.h exists failed with the following output:
Change Dir: C:/msys32/home/buildbot/slave/monero-static-win32/build/build/release/CMakeFiles/CMakeTmp

Run Build Command:"C:/msys32/usr/bin/make.exe" "cmTC_b7978/fast"
make[1]: Entering directory '/home/buildbot/slave/monero-static-win32/build/build/release/CMakeFiles/CMakeTmp'
/usr/bin/make -f CMakeFiles/cmTC_b7978.dir/build.make CMakeFiles/cmTC_b7978.dir/build
make[2]: Entering directory '/home/buildbot/slave/monero-static-win32/build/build/release/CMakeFiles/CMakeTmp'
Building C object CMakeFiles/cmTC_b7978.dir/CheckIncludeFile.c.obj

/C/msys32/mingw32/bin/i686-w64-mingw32-gcc.exe    -o CMakeFiles/cmTC_b7978.dir/CheckIncludeFile.c.obj   -c /C/msys32/home/buildbot/slave/monero-static-win32/build/build/release/CMakeFiles/CMakeTmp/CheckIncludeFile.c
C:/msys32/home/buildbot/slave/monero-static-win32/build/build/release/CMakeFiles/CMakeTmp/CheckIncludeFile.c:1:10: fatal error: sys/sysctl.h: No such file or directory

 #include <sys/sysctl.h>

          ^~~~~~~~~~~~~~

compilation terminated.

make[2]: *** [CMakeFiles/cmTC_b7978.dir/build.make:66: CMakeFiles/cmTC_b7978.dir/CheckIncludeFile.c.obj] Error 1
make[2]: Leaving directory '/home/buildbot/slave/monero-static-win32/build/build/release/CMakeFiles/CMakeTmp'
make[1]: *** [Makefile:121: cmTC_b7978/fast] Error 2
make[1]: Leaving directory '/home/buildbot/slave/monero-static-win32/build/build/release/CMakeFiles/CMakeTmp'


Determining if the include file sys/uio.h exists failed with the following output:
Change Dir: C:/msys32/home/buildbot/slave/monero-static-win32/build/build/release/CMakeFiles/CMakeTmp

Run Build Command:"C:/msys32/usr/bin/make.exe" "cmTC_9b4f9/fast"
make[1]: Entering directory '/home/buildbot/slave/monero-static-win32/build/build/release/CMakeFiles/CMakeTmp'
/usr/bin/make -f CMakeFiles/cmTC_9b4f9.dir/build.make CMakeFiles/cmTC_9b4f9.dir/build
make[2]: Entering directory '/home/buildbot/slave/monero-static-win32/build/build/release/CMakeFiles/CMakeTmp'
Building C object CMakeFiles/cmTC_9b4f9.dir/CheckIncludeFile.c.obj

/C/msys32/mingw32/bin/i686-w64-mingw32-gcc.exe    -o CMakeFiles/cmTC_9b4f9.dir/CheckIncludeFile.c.obj   -c /C/msys32/home/buildbot/slave/monero-static-win32/build/build/release/CMakeFiles/CMakeTmp/CheckIncludeFile.c
C:/msys32/home/buildbot/slave/monero-static-win32/build/build/release/CMakeFiles/CMakeTmp/CheckIncludeFile.c:1:10: fatal error: sys/uio.h: No such file or directory

 #include <sys/uio.h>

          ^~~~~~~~~~~

compilation terminated.

make[2]: *** [CMakeFiles/cmTC_9b4f9.dir/build.make:66: CMakeFiles/cmTC_9b4f9.dir/CheckIncludeFile.c.obj] Error 1
make[2]: Leaving directory '/home/buildbot/slave/monero-static-win32/build/build/release/CMakeFiles/CMakeTmp'
make[1]: *** [Makefile:121: cmTC_9b4f9/fast] Error 2
make[1]: Leaving directory '/home/buildbot/slave/monero-static-win32/build/build/release/CMakeFiles/CMakeTmp'


Determining if the include file sys/un.h exists failed with the following output:
Change Dir: C:/msys32/home/buildbot/slave/monero-static-win32/build/build/release/CMakeFiles/CMakeTmp

Run Build Command:"C:/msys32/usr/bin/make.exe" "cmTC_136db/fast"
make[1]: Entering directory '/home/buildbot/slave/monero-static-win32/build/build/release/CMakeFiles/CMakeTmp'
/usr/bin/make -f CMakeFiles/cmTC_136db.dir/build.make CMakeFiles/cmTC_136db.dir/build
make[2]: Entering directory '/home/buildbot/slave/monero-static-win32/build/build/release/CMakeFiles/CMakeTmp'
Building C object CMakeFiles/cmTC_136db.dir/CheckIncludeFile.c.obj

/C/msys32/mingw32/bin/i686-w64-mingw32-gcc.exe    -o CMakeFiles/cmTC_136db.dir/CheckIncludeFile.c.obj   -c /C/msys32/home/buildbot/slave/monero-static-win32/build/build/release/CMakeFiles/CMakeTmp/CheckIncludeFile.c
C:/msys32/home/buildbot/slave/monero-static-win32/build/build/release/CMakeFiles/CMakeTmp/CheckIncludeFile.c:1:10: fatal error: sys/un.h: No such file or directory

 #include <sys/un.h>

          ^~~~~~~~~~

compilation terminated.

make[2]: *** [CMakeFiles/cmTC_136db.dir/build.make:66: CMakeFiles/cmTC_136db.dir/CheckIncludeFile.c.obj] Error 1
make[2]: Leaving directory '/home/buildbot/slave/monero-static-win32/build/build/release/CMakeFiles/CMakeTmp'
make[1]: *** [Makefile:121: cmTC_136db/fast] Error 2
make[1]: Leaving directory '/home/buildbot/slave/monero-static-win32/build/build/release/CMakeFiles/CMakeTmp'


Determining if the include file sys/wait.h exists failed with the following output:
Change Dir: C:/msys32/home/buildbot/slave/monero-static-win32/build/build/release/CMakeFiles/CMakeTmp

Run Build Command:"C:/msys32/usr/bin/make.exe" "cmTC_32561/fast"
make[1]: Entering directory '/home/buildbot/slave/monero-static-win32/build/build/release/CMakeFiles/CMakeTmp'
/usr/bin/make -f CMakeFiles/cmTC_32561.dir/build.make CMakeFiles/cmTC_32561.dir/build
make[2]: Entering directory '/home/buildbot/slave/monero-static-win32/build/build/release/CMakeFiles/CMakeTmp'
Building C object CMakeFiles/cmTC_32561.dir/CheckIncludeFile.c.obj

/C/msys32/mingw32/bin/i686-w64-mingw32-gcc.exe    -o CMakeFiles/cmTC_32561.dir/CheckIncludeFile.c.obj   -c /C/msys32/home/buildbot/slave/monero-static-win32/build/build/release/CMakeFiles/CMakeTmp/CheckIncludeFile.c
C:/msys32/home/buildbot/slave/monero-static-win32/build/build/release/CMakeFiles/CMakeTmp/CheckIncludeFile.c:1:10: fatal error: sys/wait.h: No such file or directory

 #include <sys/wait.h>

          ^~~~~~~~~~~~

compilation terminated.

make[2]: *** [CMakeFiles/cmTC_32561.dir/build.make:66: CMakeFiles/cmTC_32561.dir/CheckIncludeFile.c.obj] Error 1
make[2]: Leaving directory '/home/buildbot/slave/monero-static-win32/build/build/release/CMakeFiles/CMakeTmp'
make[1]: *** [Makefile:121: cmTC_32561/fast] Error 2
make[1]: Leaving directory '/home/buildbot/slave/monero-static-win32/build/build/release/CMakeFiles/CMakeTmp'


Determining if the include file syslog.h exists failed with the following output:
Change Dir: C:/msys32/home/buildbot/slave/monero-static-win32/build/build/release/CMakeFiles/CMakeTmp

Run Build Command:"C:/msys32/usr/bin/make.exe" "cmTC_65599/fast"
make[1]: Entering directory '/home/buildbot/slave/monero-static-win32/build/build/release/CMakeFiles/CMakeTmp'
/usr/bin/make -f CMakeFiles/cmTC_65599.dir/build.make CMakeFiles/cmTC_65599.dir/build
make[2]: Entering directory '/home/buildbot/slave/monero-static-win32/build/build/release/CMakeFiles/CMakeTmp'
Building C object CMakeFiles/cmTC_65599.dir/CheckIncludeFile.c.obj

/C/msys32/mingw32/bin/i686-w64-mingw32-gcc.exe    -o CMakeFiles/cmTC_65599.dir/CheckIncludeFile.c.obj   -c /C/msys32/home/buildbot/slave/monero-static-win32/build/build/release/CMakeFiles/CMakeTmp/CheckIncludeFile.c
C:/msys32/home/buildbot/slave/monero-static-win32/build/build/release/CMakeFiles/CMakeTmp/CheckIncludeFile.c:1:10: fatal error: syslog.h: No such file or directory

 #include <syslog.h>

          ^~~~~~~~~~

compilation terminated.

make[2]: *** [CMakeFiles/cmTC_65599.dir/build.make:66: CMakeFiles/cmTC_65599.dir/CheckIncludeFile.c.obj] Error 1
make[2]: Leaving directory '/home/buildbot/slave/monero-static-win32/build/build/release/CMakeFiles/CMakeTmp'
make[1]: *** [Makefile:121: cmTC_65599/fast] Error 2
make[1]: Leaving directory '/home/buildbot/slave/monero-static-win32/build/build/release/CMakeFiles/CMakeTmp'


Determining if the include file vfork.h exists failed with the following output:
Change Dir: C:/msys32/home/buildbot/slave/monero-static-win32/build/build/release/CMakeFiles/CMakeTmp

Run Build Command:"C:/msys32/usr/bin/make.exe" "cmTC_caf6e/fast"
make[1]: Entering directory '/home/buildbot/slave/monero-static-win32/build/build/release/CMakeFiles/CMakeTmp'
/usr/bin/make -f CMakeFiles/cmTC_caf6e.dir/build.make CMakeFiles/cmTC_caf6e.dir/build
make[2]: Entering directory '/home/buildbot/slave/monero-static-win32/build/build/release/CMakeFiles/CMakeTmp'
Building C object CMakeFiles/cmTC_caf6e.dir/CheckIncludeFile.c.obj

/C/msys32/mingw32/bin/i686-w64-mingw32-gcc.exe    -o CMakeFiles/cmTC_caf6e.dir/CheckIncludeFile.c.obj   -c /C/msys32/home/buildbot/slave/monero-static-win32/build/build/release/CMakeFiles/CMakeTmp/CheckIncludeFile.c
C:/msys32/home/buildbot/slave/monero-static-win32/build/build/release/CMakeFiles/CMakeTmp/CheckIncludeFile.c:1:10: fatal error: vfork.h: No such file or directory

 #include <vfork.h>

          ^~~~~~~~~

compilation terminated.

make[2]: *** [CMakeFiles/cmTC_caf6e.dir/build.make:66: CMakeFiles/cmTC_caf6e.dir/CheckIncludeFile.c.obj] Error 1
make[2]: Leaving directory '/home/buildbot/slave/monero-static-win32/build/build/release/CMakeFiles/CMakeTmp'
make[1]: *** [Makefile:121: cmTC_caf6e/fast] Error 2
make[1]: Leaving directory '/home/buildbot/slave/monero-static-win32/build/build/release/CMakeFiles/CMakeTmp'


Determining if the function arc4random exists failed with the following output:
Change Dir: C:/msys32/home/buildbot/slave/monero-static-win32/build/build/release/CMakeFiles/CMakeTmp

Run Build Command:"C:/msys32/usr/bin/make.exe" "cmTC_fb46a/fast"
make[1]: Entering directory '/home/buildbot/slave/monero-static-win32/build/build/release/CMakeFiles/CMakeTmp'
/usr/bin/make -f CMakeFiles/cmTC_fb46a.dir/build.make CMakeFiles/cmTC_fb46a.dir/build
make[2]: Entering directory '/home/buildbot/slave/monero-static-win32/build/build/release/CMakeFiles/CMakeTmp'
Building C object CMakeFiles/cmTC_fb46a.dir/CheckFunctionExists.c.obj

/C/msys32/mingw32/bin/i686-w64-mingw32-gcc.exe   -DCHECK_FUNCTION_EXISTS=arc4random   -o CMakeFiles/cmTC_fb46a.dir/CheckFunctionExists.c.obj   -c /C/msys32/mingw32/share/cmake-3.12/Modules/CheckFunctionExists.c
Linking C executable cmTC_fb46a.exe

/C/msys32/mingw32/bin/cmake.exe -E remove -f CMakeFiles/cmTC_fb46a.dir/objects.a
ar cr CMakeFiles/cmTC_fb46a.dir/objects.a "CMakeFiles/cmTC_fb46a.dir/CheckFunctionExists.c.obj" 
/C/msys32/mingw32/bin/i686-w64-mingw32-gcc.exe  -DCHECK_FUNCTION_EXISTS=arc4random    -Wl,--whole-archive CMakeFiles/cmTC_fb46a.dir/objects.a -Wl,--no-whole-archive  -o cmTC_fb46a.exe -Wl,--major-image-version,0,--minor-image-version,0 -liphlpapi -lws2_32 -lkernel32 -luser32 -lgdi32 -lwinspool -lshell32 -lole32 -loleaut32 -luuid -lcomdlg32 -ladvapi32 
CMakeFiles/cmTC_fb46a.dir/objects.a(CheckFunctionExists.c.obj):CheckFunctionExists.c:(.text+0xc): undefined reference to `arc4random'

collect2.exe: error: ld returned 1 exit status

make[2]: *** [CMakeFiles/cmTC_fb46a.dir/build.make:88: cmTC_fb46a.exe] Error 1
make[2]: Leaving directory '/home/buildbot/slave/monero-static-win32/build/build/release/CMakeFiles/CMakeTmp'
make[1]: *** [Makefile:121: cmTC_fb46a/fast] Error 2
make[1]: Leaving directory '/home/buildbot/slave/monero-static-win32/build/build/release/CMakeFiles/CMakeTmp'


Determining if the function arc4random_uniform exists failed with the following output:
Change Dir: C:/msys32/home/buildbot/slave/monero-static-win32/build/build/release/CMakeFiles/CMakeTmp

Run Build Command:"C:/msys32/usr/bin/make.exe" "cmTC_0de3f/fast"
make[1]: Entering directory '/home/buildbot/slave/monero-static-win32/build/build/release/CMakeFiles/CMakeTmp'
/usr/bin/make -f CMakeFiles/cmTC_0de3f.dir/build.make CMakeFiles/cmTC_0de3f.dir/build
make[2]: Entering directory '/home/buildbot/slave/monero-static-win32/build/build/release/CMakeFiles/CMakeTmp'
Building C object CMakeFiles/cmTC_0de3f.dir/CheckFunctionExists.c.obj

/C/msys32/mingw32/bin/i686-w64-mingw32-gcc.exe   -DCHECK_FUNCTION_EXISTS=arc4random_uniform   -o CMakeFiles/cmTC_0de3f.dir/CheckFunctionExists.c.obj   -c /C/msys32/mingw32/share/cmake-3.12/Modules/CheckFunctionExists.c
Linking C executable cmTC_0de3f.exe

/C/msys32/mingw32/bin/cmake.exe -E remove -f CMakeFiles/cmTC_0de3f.dir/objects.a
ar cr CMakeFiles/cmTC_0de3f.dir/objects.a "CMakeFiles/cmTC_0de3f.dir/CheckFunctionExists.c.obj" 
/C/msys32/mingw32/bin/i686-w64-mingw32-gcc.exe  -DCHECK_FUNCTION_EXISTS=arc4random_uniform    -Wl,--whole-archive CMakeFiles/cmTC_0de3f.dir/objects.a -Wl,--no-whole-archive  -o cmTC_0de3f.exe -Wl,--major-image-version,0,--minor-image-version,0 -liphlpapi -lws2_32 -lkernel32 -luser32 -lgdi32 -lwinspool -lshell32 -lole32 -loleaut32 -luuid -lcomdlg32 -ladvapi32 
CMakeFiles/cmTC_0de3f.dir/objects.a(CheckFunctionExists.c.obj):CheckFunctionExists.c:(.text+0xc): undefined reference to `arc4random_uniform'

collect2.exe: error: ld returned 1 exit status

make[2]: *** [CMakeFiles/cmTC_0de3f.dir/build.make:88: cmTC_0de3f.exe] Error 1
make[2]: Leaving directory '/home/buildbot/slave/monero-static-win32/build/build/release/CMakeFiles/CMakeTmp'
make[1]: *** [Makefile:121: cmTC_0de3f/fast] Error 2
make[1]: Leaving directory '/home/buildbot/slave/monero-static-win32/build/build/release/CMakeFiles/CMakeTmp'


Determining if the function chown exists failed with the following output:
Change Dir: C:/msys32/home/buildbot/slave/monero-static-win32/build/build/release/CMakeFiles/CMakeTmp

Run Build Command:"C:/msys32/usr/bin/make.exe" "cmTC_3b7d0/fast"
make[1]: Entering directory '/home/buildbot/slave/monero-static-win32/build/build/release/CMakeFiles/CMakeTmp'
/usr/bin/make -f CMakeFiles/cmTC_3b7d0.dir/build.make CMakeFiles/cmTC_3b7d0.dir/build
make[2]: Entering directory '/home/buildbot/slave/monero-static-win32/build/build/release/CMakeFiles/CMakeTmp'
Building C object CMakeFiles/cmTC_3b7d0.dir/CheckFunctionExists.c.obj

/C/msys32/mingw32/bin/i686-w64-mingw32-gcc.exe   -DCHECK_FUNCTION_EXISTS=chown   -o CMakeFiles/cmTC_3b7d0.dir/CheckFunctionExists.c.obj   -c /C/msys32/mingw32/share/cmake-3.12/Modules/CheckFunctionExists.c
Linking C executable cmTC_3b7d0.exe

/C/msys32/mingw32/bin/cmake.exe -E remove -f CMakeFiles/cmTC_3b7d0.dir/objects.a
ar cr CMakeFiles/cmTC_3b7d0.dir/objects.a "CMakeFiles/cmTC_3b7d0.dir/CheckFunctionExists.c.obj" 
/C/msys32/mingw32/bin/i686-w64-mingw32-gcc.exe  -DCHECK_FUNCTION_EXISTS=chown    -Wl,--whole-archive CMakeFiles/cmTC_3b7d0.dir/objects.a -Wl,--no-whole-archive  -o cmTC_3b7d0.exe -Wl,--major-image-version,0,--minor-image-version,0 -liphlpapi -lws2_32 -lkernel32 -luser32 -lgdi32 -lwinspool -lshell32 -lole32 -loleaut32 -luuid -lcomdlg32 -ladvapi32 
CMakeFiles/cmTC_3b7d0.dir/objects.a(CheckFunctionExists.c.obj):CheckFunctionExists.c:(.text+0xc): undefined reference to `chown'

collect2.exe: error: ld returned 1 exit status

make[2]: *** [CMakeFiles/cmTC_3b7d0.dir/build.make:88: cmTC_3b7d0.exe] Error 1
make[2]: Leaving directory '/home/buildbot/slave/monero-static-win32/build/build/release/CMakeFiles/CMakeTmp'
make[1]: *** [Makefile:121: cmTC_3b7d0/fast] Error 2
make[1]: Leaving directory '/home/buildbot/slave/monero-static-win32/build/build/release/CMakeFiles/CMakeTmp'


Determining if the function chroot exists failed with the following output:
Change Dir: C:/msys32/home/buildbot/slave/monero-static-win32/build/build/release/CMakeFiles/CMakeTmp

Run Build Command:"C:/msys32/usr/bin/make.exe" "cmTC_ba84d/fast"
make[1]: Entering directory '/home/buildbot/slave/monero-static-win32/build/build/release/CMakeFiles/CMakeTmp'
/usr/bin/make -f CMakeFiles/cmTC_ba84d.dir/build.make CMakeFiles/cmTC_ba84d.dir/build
make[2]: Entering directory '/home/buildbot/slave/monero-static-win32/build/build/release/CMakeFiles/CMakeTmp'
Building C object CMakeFiles/cmTC_ba84d.dir/CheckFunctionExists.c.obj

/C/msys32/mingw32/bin/i686-w64-mingw32-gcc.exe   -DCHECK_FUNCTION_EXISTS=chroot   -o CMakeFiles/cmTC_ba84d.dir/CheckFunctionExists.c.obj   -c /C/msys32/mingw32/share/cmake-3.12/Modules/CheckFunctionExists.c
Linking C executable cmTC_ba84d.exe

/C/msys32/mingw32/bin/cmake.exe -E remove -f CMakeFiles/cmTC_ba84d.dir/objects.a
ar cr CMakeFiles/cmTC_ba84d.dir/objects.a "CMakeFiles/cmTC_ba84d.dir/CheckFunctionExists.c.obj" 
/C/msys32/mingw32/bin/i686-w64-mingw32-gcc.exe  -DCHECK_FUNCTION_EXISTS=chroot    -Wl,--whole-archive CMakeFiles/cmTC_ba84d.dir/objects.a -Wl,--no-whole-archive  -o cmTC_ba84d.exe -Wl,--major-image-version,0,--minor-image-version,0 -liphlpapi -lws2_32 -lkernel32 -luser32 -lgdi32 -lwinspool -lshell32 -lole32 -loleaut32 -luuid -lcomdlg32 -ladvapi32 
CMakeFiles/cmTC_ba84d.dir/objects.a(CheckFunctionExists.c.obj):CheckFunctionExists.c:(.text+0xc): undefined reference to `chroot'

collect2.exe: error: ld returned 1 exit status

make[2]: *** [CMakeFiles/cmTC_ba84d.dir/build.make:88: cmTC_ba84d.exe] Error 1
make[2]: Leaving directory '/home/buildbot/slave/monero-static-win32/build/build/release/CMakeFiles/CMakeTmp'
make[1]: *** [Makefile:121: cmTC_ba84d/fast] Error 2
make[1]: Leaving directory '/home/buildbot/slave/monero-static-win32/build/build/release/CMakeFiles/CMakeTmp'


Determining if the function ctime_r exists failed with the following output:
Change Dir: C:/msys32/home/buildbot/slave/monero-static-win32/build/build/release/CMakeFiles/CMakeTmp

Run Build Command:"C:/msys32/usr/bin/make.exe" "cmTC_a4afa/fast"
make[1]: Entering directory '/home/buildbot/slave/monero-static-win32/build/build/release/CMakeFiles/CMakeTmp'
/usr/bin/make -f CMakeFiles/cmTC_a4afa.dir/build.make CMakeFiles/cmTC_a4afa.dir/build
make[2]: Entering directory '/home/buildbot/slave/monero-static-win32/build/build/release/CMakeFiles/CMakeTmp'
Building C object CMakeFiles/cmTC_a4afa.dir/CheckFunctionExists.c.obj

/C/msys32/mingw32/bin/i686-w64-mingw32-gcc.exe   -DCHECK_FUNCTION_EXISTS=ctime_r   -o CMakeFiles/cmTC_a4afa.dir/CheckFunctionExists.c.obj   -c /C/msys32/mingw32/share/cmake-3.12/Modules/CheckFunctionExists.c
Linking C executable cmTC_a4afa.exe

/C/msys32/mingw32/bin/cmake.exe -E remove -f CMakeFiles/cmTC_a4afa.dir/objects.a
ar cr CMakeFiles/cmTC_a4afa.dir/objects.a "CMakeFiles/cmTC_a4afa.dir/CheckFunctionExists.c.obj" 
/C/msys32/mingw32/bin/i686-w64-mingw32-gcc.exe  -DCHECK_FUNCTION_EXISTS=ctime_r    -Wl,--whole-archive CMakeFiles/cmTC_a4afa.dir/objects.a -Wl,--no-whole-archive  -o cmTC_a4afa.exe -Wl,--major-image-version,0,--minor-image-version,0 -liphlpapi -lws2_32 -lkernel32 -luser32 -lgdi32 -lwinspool -lshell32 -lole32 -loleaut32 -luuid -lcomdlg32 -ladvapi32 
CMakeFiles/cmTC_a4afa.dir/objects.a(CheckFunctionExists.c.obj):CheckFunctionExists.c:(.text+0xc): undefined reference to `ctime_r'

collect2.exe: error: ld returned 1 exit status

make[2]: *** [CMakeFiles/cmTC_a4afa.dir/build.make:88: cmTC_a4afa.exe] Error 1
make[2]: Leaving directory '/home/buildbot/slave/monero-static-win32/build/build/release/CMakeFiles/CMakeTmp'
make[1]: *** [Makefile:121: cmTC_a4afa/fast] Error 2
make[1]: Leaving directory '/home/buildbot/slave/monero-static-win32/build/build/release/CMakeFiles/CMakeTmp'


Determining if the function daemon exists failed with the following output:
Change Dir: C:/msys32/home/buildbot/slave/monero-static-win32/build/build/release/CMakeFiles/CMakeTmp

Run Build Command:"C:/msys32/usr/bin/make.exe" "cmTC_a1d4a/fast"
make[1]: Entering directory '/home/buildbot/slave/monero-static-win32/build/build/release/CMakeFiles/CMakeTmp'
/usr/bin/make -f CMakeFiles/cmTC_a1d4a.dir/build.make CMakeFiles/cmTC_a1d4a.dir/build
make[2]: Entering directory '/home/buildbot/slave/monero-static-win32/build/build/release/CMakeFiles/CMakeTmp'
Building C object CMakeFiles/cmTC_a1d4a.dir/CheckFunctionExists.c.obj

/C/msys32/mingw32/bin/i686-w64-mingw32-gcc.exe   -DCHECK_FUNCTION_EXISTS=daemon   -o CMakeFiles/cmTC_a1d4a.dir/CheckFunctionExists.c.obj   -c /C/msys32/mingw32/share/cmake-3.12/Modules/CheckFunctionExists.c
Linking C executable cmTC_a1d4a.exe

/C/msys32/mingw32/bin/cmake.exe -E remove -f CMakeFiles/cmTC_a1d4a.dir/objects.a
ar cr CMakeFiles/cmTC_a1d4a.dir/objects.a "CMakeFiles/cmTC_a1d4a.dir/CheckFunctionExists.c.obj" 
/C/msys32/mingw32/bin/i686-w64-mingw32-gcc.exe  -DCHECK_FUNCTION_EXISTS=daemon    -Wl,--whole-archive CMakeFiles/cmTC_a1d4a.dir/objects.a -Wl,--no-whole-archive  -o cmTC_a1d4a.exe -Wl,--major-image-version,0,--minor-image-version,0 -liphlpapi -lws2_32 -lkernel32 -luser32 -lgdi32 -lwinspool -lshell32 -lole32 -loleaut32 -luuid -lcomdlg32 -ladvapi32 
CMakeFiles/cmTC_a1d4a.dir/objects.a(CheckFunctionExists.c.obj):CheckFunctionExists.c:(.text+0xc): undefined reference to `daemon'

collect2.exe: error: ld returned 1 exit status

make[2]: *** [CMakeFiles/cmTC_a1d4a.dir/build.make:88: cmTC_a1d4a.exe] Error 1
make[2]: Leaving directory '/home/buildbot/slave/monero-static-win32/build/build/release/CMakeFiles/CMakeTmp'
make[1]: *** [Makefile:121: cmTC_a1d4a/fast] Error 2
make[1]: Leaving directory '/home/buildbot/slave/monero-static-win32/build/build/release/CMakeFiles/CMakeTmp'


Determining if the function endprotoent exists failed with the following output:
Change Dir: C:/msys32/home/buildbot/slave/monero-static-win32/build/build/release/CMakeFiles/CMakeTmp

Run Build Command:"C:/msys32/usr/bin/make.exe" "cmTC_623fe/fast"
make[1]: Entering directory '/home/buildbot/slave/monero-static-win32/build/build/release/CMakeFiles/CMakeTmp'
/usr/bin/make -f CMakeFiles/cmTC_623fe.dir/build.make CMakeFiles/cmTC_623fe.dir/build
make[2]: Entering directory '/home/buildbot/slave/monero-static-win32/build/build/release/CMakeFiles/CMakeTmp'
Building C object CMakeFiles/cmTC_623fe.dir/CheckFunctionExists.c.obj

/C/msys32/mingw32/bin/i686-w64-mingw32-gcc.exe   -DCHECK_FUNCTION_EXISTS=endprotoent   -o CMakeFiles/cmTC_623fe.dir/CheckFunctionExists.c.obj   -c /C/msys32/mingw32/share/cmake-3.12/Modules/CheckFunctionExists.c
Linking C executable cmTC_623fe.exe

/C/msys32/mingw32/bin/cmake.exe -E remove -f CMakeFiles/cmTC_623fe.dir/objects.a
ar cr CMakeFiles/cmTC_623fe.dir/objects.a "CMakeFiles/cmTC_623fe.dir/CheckFunctionExists.c.obj" 
/C/msys32/mingw32/bin/i686-w64-mingw32-gcc.exe  -DCHECK_FUNCTION_EXISTS=endprotoent    -Wl,--whole-archive CMakeFiles/cmTC_623fe.dir/objects.a -Wl,--no-whole-archive  -o cmTC_623fe.exe -Wl,--major-image-version,0,--minor-image-version,0 -liphlpapi -lws2_32 -lkernel32 -luser32 -lgdi32 -lwinspool -lshell32 -lole32 -loleaut32 -luuid -lcomdlg32 -ladvapi32 
CMakeFiles/cmTC_623fe.dir/objects.a(CheckFunctionExists.c.obj):CheckFunctionExists.c:(.text+0xc): undefined reference to `endprotoent'

collect2.exe: error: ld returned 1 exit status

make[2]: *** [CMakeFiles/cmTC_623fe.dir/build.make:88: cmTC_623fe.exe] Error 1
make[2]: Leaving directory '/home/buildbot/slave/monero-static-win32/build/build/release/CMakeFiles/CMakeTmp'
make[1]: *** [Makefile:121: cmTC_623fe/fast] Error 2
make[1]: Leaving directory '/home/buildbot/slave/monero-static-win32/build/build/release/CMakeFiles/CMakeTmp'


Determining if the function endservent exists failed with the following output:
Change Dir: C:/msys32/home/buildbot/slave/monero-static-win32/build/build/release/CMakeFiles/CMakeTmp

Run Build Command:"C:/msys32/usr/bin/make.exe" "cmTC_1410e/fast"
make[1]: Entering directory '/home/buildbot/slave/monero-static-win32/build/build/release/CMakeFiles/CMakeTmp'
/usr/bin/make -f CMakeFiles/cmTC_1410e.dir/build.make CMakeFiles/cmTC_1410e.dir/build
make[2]: Entering directory '/home/buildbot/slave/monero-static-win32/build/build/release/CMakeFiles/CMakeTmp'
Building C object CMakeFiles/cmTC_1410e.dir/CheckFunctionExists.c.obj

/C/msys32/mingw32/bin/i686-w64-mingw32-gcc.exe   -DCHECK_FUNCTION_EXISTS=endservent   -o CMakeFiles/cmTC_1410e.dir/CheckFunctionExists.c.obj   -c /C/msys32/mingw32/share/cmake-3.12/Modules/CheckFunctionExists.c
Linking C executable cmTC_1410e.exe

/C/msys32/mingw32/bin/cmake.exe -E remove -f CMakeFiles/cmTC_1410e.dir/objects.a
ar cr CMakeFiles/cmTC_1410e.dir/objects.a "CMakeFiles/cmTC_1410e.dir/CheckFunctionExists.c.obj" 
/C/msys32/mingw32/bin/i686-w64-mingw32-gcc.exe  -DCHECK_FUNCTION_EXISTS=endservent    -Wl,--whole-archive CMakeFiles/cmTC_1410e.dir/objects.a -Wl,--no-whole-archive  -o cmTC_1410e.exe -Wl,--major-image-version,0,--minor-image-version,0 -liphlpapi -lws2_32 -lkernel32 -luser32 -lgdi32 -lwinspool -lshell32 -lole32 -loleaut32 -luuid -lcomdlg32 -ladvapi32 
CMakeFiles/cmTC_1410e.dir/objects.a(CheckFunctionExists.c.obj):CheckFunctionExists.c:(.text+0xc): undefined reference to `endservent'

collect2.exe: error: ld returned 1 exit status

make[2]: *** [CMakeFiles/cmTC_1410e.dir/build.make:88: cmTC_1410e.exe] Error 1
make[2]: Leaving directory '/home/buildbot/slave/monero-static-win32/build/build/release/CMakeFiles/CMakeTmp'
make[1]: *** [Makefile:121: cmTC_1410e/fast] Error 2
make[1]: Leaving directory '/home/buildbot/slave/monero-static-win32/build/build/release/CMakeFiles/CMakeTmp'


Determining if the function fork exists failed with the following output:
Change Dir: C:/msys32/home/buildbot/slave/monero-static-win32/build/build/release/CMakeFiles/CMakeTmp

Run Build Command:"C:/msys32/usr/bin/make.exe" "cmTC_d3329/fast"
make[1]: Entering directory '/home/buildbot/slave/monero-static-win32/build/build/release/CMakeFiles/CMakeTmp'
/usr/bin/make -f CMakeFiles/cmTC_d3329.dir/build.make CMakeFiles/cmTC_d3329.dir/build
make[2]: Entering directory '/home/buildbot/slave/monero-static-win32/build/build/release/CMakeFiles/CMakeTmp'
Building C object CMakeFiles/cmTC_d3329.dir/CheckFunctionExists.c.obj

/C/msys32/mingw32/bin/i686-w64-mingw32-gcc.exe   -DCHECK_FUNCTION_EXISTS=fork   -o CMakeFiles/cmTC_d3329.dir/CheckFunctionExists.c.obj   -c /C/msys32/mingw32/share/cmake-3.12/Modules/CheckFunctionExists.c
<command-line>:0:23: warning: conflicting types for built-in function 'fork' [-Wbuiltin-declaration-mismatch]

C:/msys32/mingw32/share/cmake-3.12/Modules/CheckFunctionExists.c:7:3: note: in expansion of macro 'CHECK_FUNCTION_EXISTS'

   CHECK_FUNCTION_EXISTS(void);

   ^~~~~~~~~~~~~~~~~~~~~

Linking C executable cmTC_d3329.exe

/C/msys32/mingw32/bin/cmake.exe -E remove -f CMakeFiles/cmTC_d3329.dir/objects.a
ar cr CMakeFiles/cmTC_d3329.dir/objects.a "CMakeFiles/cmTC_d3329.dir/CheckFunctionExists.c.obj" 
/C/msys32/mingw32/bin/i686-w64-mingw32-gcc.exe  -DCHECK_FUNCTION_EXISTS=fork    -Wl,--whole-archive CMakeFiles/cmTC_d3329.dir/objects.a -Wl,--no-whole-archive  -o cmTC_d3329.exe -Wl,--major-image-version,0,--minor-image-version,0 -liphlpapi -lws2_32 -lkernel32 -luser32 -lgdi32 -lwinspool -lshell32 -lole32 -loleaut32 -luuid -lcomdlg32 -ladvapi32 
CMakeFiles/cmTC_d3329.dir/objects.a(CheckFunctionExists.c.obj):CheckFunctionExists.c:(.text+0xc): undefined reference to `fork'

collect2.exe: error: ld returned 1 exit status

make[2]: *** [CMakeFiles/cmTC_d3329.dir/build.make:88: cmTC_d3329.exe] Error 1
make[2]: Leaving directory '/home/buildbot/slave/monero-static-win32/build/build/release/CMakeFiles/CMakeTmp'
make[1]: *** [Makefile:121: cmTC_d3329/fast] Error 2
make[1]: Leaving directory '/home/buildbot/slave/monero-static-win32/build/build/release/CMakeFiles/CMakeTmp'


Determining if the function fsync exists failed with the following output:
Change Dir: C:/msys32/home/buildbot/slave/monero-static-win32/build/build/release/CMakeFiles/CMakeTmp

Run Build Command:"C:/msys32/usr/bin/make.exe" "cmTC_c451d/fast"
make[1]: Entering directory '/home/buildbot/slave/monero-static-win32/build/build/release/CMakeFiles/CMakeTmp'
/usr/bin/make -f CMakeFiles/cmTC_c451d.dir/build.make CMakeFiles/cmTC_c451d.dir/build
make[2]: Entering directory '/home/buildbot/slave/monero-static-win32/build/build/release/CMakeFiles/CMakeTmp'
Building C object CMakeFiles/cmTC_c451d.dir/CheckFunctionExists.c.obj

/C/msys32/mingw32/bin/i686-w64-mingw32-gcc.exe   -DCHECK_FUNCTION_EXISTS=fsync   -o CMakeFiles/cmTC_c451d.dir/CheckFunctionExists.c.obj   -c /C/msys32/mingw32/share/cmake-3.12/Modules/CheckFunctionExists.c
Linking C executable cmTC_c451d.exe

/C/msys32/mingw32/bin/cmake.exe -E remove -f CMakeFiles/cmTC_c451d.dir/objects.a
ar cr CMakeFiles/cmTC_c451d.dir/objects.a "CMakeFiles/cmTC_c451d.dir/CheckFunctionExists.c.obj" 
/C/msys32/mingw32/bin/i686-w64-mingw32-gcc.exe  -DCHECK_FUNCTION_EXISTS=fsync    -Wl,--whole-archive CMakeFiles/cmTC_c451d.dir/objects.a -Wl,--no-whole-archive  -o cmTC_c451d.exe -Wl,--major-image-version,0,--minor-image-version,0 -liphlpapi -lws2_32 -lkernel32 -luser32 -lgdi32 -lwinspool -lshell32 -lole32 -loleaut32 -luuid -lcomdlg32 -ladvapi32 
CMakeFiles/cmTC_c451d.dir/objects.a(CheckFunctionExists.c.obj):CheckFunctionExists.c:(.text+0xc): undefined reference to `fsync'

collect2.exe: error: ld returned 1 exit status

make[2]: *** [CMakeFiles/cmTC_c451d.dir/build.make:88: cmTC_c451d.exe] Error 1
make[2]: Leaving directory '/home/buildbot/slave/monero-static-win32/build/build/release/CMakeFiles/CMakeTmp'
make[1]: *** [Makefile:121: cmTC_c451d/fast] Error 2
make[1]: Leaving directory '/home/buildbot/slave/monero-static-win32/build/build/release/CMakeFiles/CMakeTmp'


Determining if the function getauxval exists failed with the following output:
Change Dir: C:/msys32/home/buildbot/slave/monero-static-win32/build/build/release/CMakeFiles/CMakeTmp

Run Build Command:"C:/msys32/usr/bin/make.exe" "cmTC_1e62c/fast"
make[1]: Entering directory '/home/buildbot/slave/monero-static-win32/build/build/release/CMakeFiles/CMakeTmp'
/usr/bin/make -f CMakeFiles/cmTC_1e62c.dir/build.make CMakeFiles/cmTC_1e62c.dir/build
make[2]: Entering directory '/home/buildbot/slave/monero-static-win32/build/build/release/CMakeFiles/CMakeTmp'
Building C object CMakeFiles/cmTC_1e62c.dir/CheckFunctionExists.c.obj

/C/msys32/mingw32/bin/i686-w64-mingw32-gcc.exe   -DCHECK_FUNCTION_EXISTS=getauxval   -o CMakeFiles/cmTC_1e62c.dir/CheckFunctionExists.c.obj   -c /C/msys32/mingw32/share/cmake-3.12/Modules/CheckFunctionExists.c
Linking C executable cmTC_1e62c.exe

/C/msys32/mingw32/bin/cmake.exe -E remove -f CMakeFiles/cmTC_1e62c.dir/objects.a
ar cr CMakeFiles/cmTC_1e62c.dir/objects.a "CMakeFiles/cmTC_1e62c.dir/CheckFunctionExists.c.obj" 
/C/msys32/mingw32/bin/i686-w64-mingw32-gcc.exe  -DCHECK_FUNCTION_EXISTS=getauxval    -Wl,--whole-archive CMakeFiles/cmTC_1e62c.dir/objects.a -Wl,--no-whole-archive  -o cmTC_1e62c.exe -Wl,--major-image-version,0,--minor-image-version,0 -liphlpapi -lws2_32 -lkernel32 -luser32 -lgdi32 -lwinspool -lshell32 -lole32 -loleaut32 -luuid -lcomdlg32 -ladvapi32 
CMakeFiles/cmTC_1e62c.dir/objects.a(CheckFunctionExists.c.obj):CheckFunctionExists.c:(.text+0xc): undefined reference to `getauxval'

collect2.exe: error: ld returned 1 exit status

make[2]: *** [CMakeFiles/cmTC_1e62c.dir/build.make:88: cmTC_1e62c.exe] Error 1
make[2]: Leaving directory '/home/buildbot/slave/monero-static-win32/build/build/release/CMakeFiles/CMakeTmp'
make[1]: *** [Makefile:121: cmTC_1e62c/fast] Error 2
make[1]: Leaving directory '/home/buildbot/slave/monero-static-win32/build/build/release/CMakeFiles/CMakeTmp'


Determining if the function getentropy exists failed with the following output:
Change Dir: C:/msys32/home/buildbot/slave/monero-static-win32/build/build/release/CMakeFiles/CMakeTmp

Run Build Command:"C:/msys32/usr/bin/make.exe" "cmTC_1a460/fast"
make[1]: Entering directory '/home/buildbot/slave/monero-static-win32/build/build/release/CMakeFiles/CMakeTmp'
/usr/bin/make -f CMakeFiles/cmTC_1a460.dir/build.make CMakeFiles/cmTC_1a460.dir/build
make[2]: Entering directory '/home/buildbot/slave/monero-static-win32/build/build/release/CMakeFiles/CMakeTmp'
Building C object CMakeFiles/cmTC_1a460.dir/CheckFunctionExists.c.obj

/C/msys32/mingw32/bin/i686-w64-mingw32-gcc.exe   -DCHECK_FUNCTION_EXISTS=getentropy   -o CMakeFiles/cmTC_1a460.dir/CheckFunctionExists.c.obj   -c /C/msys32/mingw32/share/cmake-3.12/Modules/CheckFunctionExists.c
Linking C executable cmTC_1a460.exe

/C/msys32/mingw32/bin/cmake.exe -E remove -f CMakeFiles/cmTC_1a460.dir/objects.a
ar cr CMakeFiles/cmTC_1a460.dir/objects.a "CMakeFiles/cmTC_1a460.dir/CheckFunctionExists.c.obj" 
/C/msys32/mingw32/bin/i686-w64-mingw32-gcc.exe  -DCHECK_FUNCTION_EXISTS=getentropy    -Wl,--whole-archive CMakeFiles/cmTC_1a460.dir/objects.a -Wl,--no-whole-archive  -o cmTC_1a460.exe -Wl,--major-image-version,0,--minor-image-version,0 -liphlpapi -lws2_32 -lkernel32 -luser32 -lgdi32 -lwinspool -lshell32 -lole32 -loleaut32 -luuid -lcomdlg32 -ladvapi32 
CMakeFiles/cmTC_1a460.dir/objects.a(CheckFunctionExists.c.obj):CheckFunctionExists.c:(.text+0xc): undefined reference to `getentropy'

collect2.exe: error: ld returned 1 exit status

make[2]: *** [CMakeFiles/cmTC_1a460.dir/build.make:88: cmTC_1a460.exe] Error 1
make[2]: Leaving directory '/home/buildbot/slave/monero-static-win32/build/build/release/CMakeFiles/CMakeTmp'
make[1]: *** [Makefile:121: cmTC_1a460/fast] Error 2
make[1]: Leaving directory '/home/buildbot/slave/monero-static-win32/build/build/release/CMakeFiles/CMakeTmp'


Determining if the function getpwnam exists failed with the following output:
Change Dir: C:/msys32/home/buildbot/slave/monero-static-win32/build/build/release/CMakeFiles/CMakeTmp

Run Build Command:"C:/msys32/usr/bin/make.exe" "cmTC_0aac8/fast"
make[1]: Entering directory '/home/buildbot/slave/monero-static-win32/build/build/release/CMakeFiles/CMakeTmp'
/usr/bin/make -f CMakeFiles/cmTC_0aac8.dir/build.make CMakeFiles/cmTC_0aac8.dir/build
make[2]: Entering directory '/home/buildbot/slave/monero-static-win32/build/build/release/CMakeFiles/CMakeTmp'
Building C object CMakeFiles/cmTC_0aac8.dir/CheckFunctionExists.c.obj

/C/msys32/mingw32/bin/i686-w64-mingw32-gcc.exe   -DCHECK_FUNCTION_EXISTS=getpwnam   -o CMakeFiles/cmTC_0aac8.dir/CheckFunctionExists.c.obj   -c /C/msys32/mingw32/share/cmake-3.12/Modules/CheckFunctionExists.c
Linking C executable cmTC_0aac8.exe

/C/msys32/mingw32/bin/cmake.exe -E remove -f CMakeFiles/cmTC_0aac8.dir/objects.a
ar cr CMakeFiles/cmTC_0aac8.dir/objects.a "CMakeFiles/cmTC_0aac8.dir/CheckFunctionExists.c.obj" 
/C/msys32/mingw32/bin/i686-w64-mingw32-gcc.exe  -DCHECK_FUNCTION_EXISTS=getpwnam    -Wl,--whole-archive CMakeFiles/cmTC_0aac8.dir/objects.a -Wl,--no-whole-archive  -o cmTC_0aac8.exe -Wl,--major-image-version,0,--minor-image-version,0 -liphlpapi -lws2_32 -lkernel32 -luser32 -lgdi32 -lwinspool -lshell32 -lole32 -loleaut32 -luuid -lcomdlg32 -ladvapi32 
CMakeFiles/cmTC_0aac8.dir/objects.a(CheckFunctionExists.c.obj):CheckFunctionExists.c:(.text+0xc): undefined reference to `getpwnam'

collect2.exe: error: ld returned 1 exit status

make[2]: *** [CMakeFiles/cmTC_0aac8.dir/build.make:88: cmTC_0aac8.exe] Error 1
make[2]: Leaving directory '/home/buildbot/slave/monero-static-win32/build/build/release/CMakeFiles/CMakeTmp'
make[1]: *** [Makefile:121: cmTC_0aac8/fast] Error 2
make[1]: Leaving directory '/home/buildbot/slave/monero-static-win32/build/build/release/CMakeFiles/CMakeTmp'


Determining if the function getrlimit exists failed with the following output:
Change Dir: C:/msys32/home/buildbot/slave/monero-static-win32/build/build/release/CMakeFiles/CMakeTmp

Run Build Command:"C:/msys32/usr/bin/make.exe" "cmTC_471c2/fast"
make[1]: Entering directory '/home/buildbot/slave/monero-static-win32/build/build/release/CMakeFiles/CMakeTmp'
/usr/bin/make -f CMakeFiles/cmTC_471c2.dir/build.make CMakeFiles/cmTC_471c2.dir/build
make[2]: Entering directory '/home/buildbot/slave/monero-static-win32/build/build/release/CMakeFiles/CMakeTmp'
Building C object CMakeFiles/cmTC_471c2.dir/CheckFunctionExists.c.obj

/C/msys32/mingw32/bin/i686-w64-mingw32-gcc.exe   -DCHECK_FUNCTION_EXISTS=getrlimit   -o CMakeFiles/cmTC_471c2.dir/CheckFunctionExists.c.obj   -c /C/msys32/mingw32/share/cmake-3.12/Modules/CheckFunctionExists.c
Linking C executable cmTC_471c2.exe

/C/msys32/mingw32/bin/cmake.exe -E remove -f CMakeFiles/cmTC_471c2.dir/objects.a
ar cr CMakeFiles/cmTC_471c2.dir/objects.a "CMakeFiles/cmTC_471c2.dir/CheckFunctionExists.c.obj" 
/C/msys32/mingw32/bin/i686-w64-mingw32-gcc.exe  -DCHECK_FUNCTION_EXISTS=getrlimit    -Wl,--whole-archive CMakeFiles/cmTC_471c2.dir/objects.a -Wl,--no-whole-archive  -o cmTC_471c2.exe -Wl,--major-image-version,0,--minor-image-version,0 -liphlpapi -lws2_32 -lkernel32 -luser32 -lgdi32 -lwinspool -lshell32 -lole32 -loleaut32 -luuid -lcomdlg32 -ladvapi32 
CMakeFiles/cmTC_471c2.dir/objects.a(CheckFunctionExists.c.obj):CheckFunctionExists.c:(.text+0xc): undefined reference to `getrlimit'

collect2.exe: error: ld returned 1 exit status

make[2]: *** [CMakeFiles/cmTC_471c2.dir/build.make:88: cmTC_471c2.exe] Error 1
make[2]: Leaving directory '/home/buildbot/slave/monero-static-win32/build/build/release/CMakeFiles/CMakeTmp'
make[1]: *** [Makefile:121: cmTC_471c2/fast] Error 2
make[1]: Leaving directory '/home/buildbot/slave/monero-static-win32/build/build/release/CMakeFiles/CMakeTmp'


Determining if the function glob exists failed with the following output:
Change Dir: C:/msys32/home/buildbot/slave/monero-static-win32/build/build/release/CMakeFiles/CMakeTmp

Run Build Command:"C:/msys32/usr/bin/make.exe" "cmTC_8b66f/fast"
make[1]: Entering directory '/home/buildbot/slave/monero-static-win32/build/build/release/CMakeFiles/CMakeTmp'
/usr/bin/make -f CMakeFiles/cmTC_8b66f.dir/build.make CMakeFiles/cmTC_8b66f.dir/build
make[2]: Entering directory '/home/buildbot/slave/monero-static-win32/build/build/release/CMakeFiles/CMakeTmp'
Building C object CMakeFiles/cmTC_8b66f.dir/CheckFunctionExists.c.obj

/C/msys32/mingw32/bin/i686-w64-mingw32-gcc.exe   -DCHECK_FUNCTION_EXISTS=glob   -o CMakeFiles/cmTC_8b66f.dir/CheckFunctionExists.c.obj   -c /C/msys32/mingw32/share/cmake-3.12/Modules/CheckFunctionExists.c
Linking C executable cmTC_8b66f.exe

/C/msys32/mingw32/bin/cmake.exe -E remove -f CMakeFiles/cmTC_8b66f.dir/objects.a
ar cr CMakeFiles/cmTC_8b66f.dir/objects.a "CMakeFiles/cmTC_8b66f.dir/CheckFunctionExists.c.obj" 
/C/msys32/mingw32/bin/i686-w64-mingw32-gcc.exe  -DCHECK_FUNCTION_EXISTS=glob    -Wl,--whole-archive CMakeFiles/cmTC_8b66f.dir/objects.a -Wl,--no-whole-archive  -o cmTC_8b66f.exe -Wl,--major-image-version,0,--minor-image-version,0 -liphlpapi -lws2_32 -lkernel32 -luser32 -lgdi32 -lwinspool -lshell32 -lole32 -loleaut32 -luuid -lcomdlg32 -ladvapi32 
CMakeFiles/cmTC_8b66f.dir/objects.a(CheckFunctionExists.c.obj):CheckFunctionExists.c:(.text+0xc): undefined reference to `glob'

collect2.exe: error: ld returned 1 exit status

make[2]: *** [CMakeFiles/cmTC_8b66f.dir/build.make:88: cmTC_8b66f.exe] Error 1
make[2]: Leaving directory '/home/buildbot/slave/monero-static-win32/build/build/release/CMakeFiles/CMakeTmp'
make[1]: *** [Makefile:121: cmTC_8b66f/fast] Error 2
make[1]: Leaving directory '/home/buildbot/slave/monero-static-win32/build/build/release/CMakeFiles/CMakeTmp'


Determining if the function gmtime_r exists failed with the following output:
Change Dir: C:/msys32/home/buildbot/slave/monero-static-win32/build/build/release/CMakeFiles/CMakeTmp

Run Build Command:"C:/msys32/usr/bin/make.exe" "cmTC_fc817/fast"
make[1]: Entering directory '/home/buildbot/slave/monero-static-win32/build/build/release/CMakeFiles/CMakeTmp'
/usr/bin/make -f CMakeFiles/cmTC_fc817.dir/build.make CMakeFiles/cmTC_fc817.dir/build
make[2]: Entering directory '/home/buildbot/slave/monero-static-win32/build/build/release/CMakeFiles/CMakeTmp'
Building C object CMakeFiles/cmTC_fc817.dir/CheckFunctionExists.c.obj

/C/msys32/mingw32/bin/i686-w64-mingw32-gcc.exe   -DCHECK_FUNCTION_EXISTS=gmtime_r   -o CMakeFiles/cmTC_fc817.dir/CheckFunctionExists.c.obj   -c /C/msys32/mingw32/share/cmake-3.12/Modules/CheckFunctionExists.c
Linking C executable cmTC_fc817.exe

/C/msys32/mingw32/bin/cmake.exe -E remove -f CMakeFiles/cmTC_fc817.dir/objects.a
ar cr CMakeFiles/cmTC_fc817.dir/objects.a "CMakeFiles/cmTC_fc817.dir/CheckFunctionExists.c.obj" 
/C/msys32/mingw32/bin/i686-w64-mingw32-gcc.exe  -DCHECK_FUNCTION_EXISTS=gmtime_r    -Wl,--whole-archive CMakeFiles/cmTC_fc817.dir/objects.a -Wl,--no-whole-archive  -o cmTC_fc817.exe -Wl,--major-image-version,0,--minor-image-version,0 -liphlpapi -lws2_32 -lkernel32 -luser32 -lgdi32 -lwinspool -lshell32 -lole32 -loleaut32 -luuid -lcomdlg32 -ladvapi32 
CMakeFiles/cmTC_fc817.dir/objects.a(CheckFunctionExists.c.obj):CheckFunctionExists.c:(.text+0xc): undefined reference to `gmtime_r'

collect2.exe: error: ld returned 1 exit status

make[2]: *** [CMakeFiles/cmTC_fc817.dir/build.make:88: cmTC_fc817.exe] Error 1
make[2]: Leaving directory '/home/buildbot/slave/monero-static-win32/build/build/release/CMakeFiles/CMakeTmp'
make[1]: *** [Makefile:121: cmTC_fc817/fast] Error 2
make[1]: Leaving directory '/home/buildbot/slave/monero-static-win32/build/build/release/CMakeFiles/CMakeTmp'


Determining if the function fcntl exists failed with the following output:
Change Dir: C:/msys32/home/buildbot/slave/monero-static-win32/build/build/release/CMakeFiles/CMakeTmp

Run Build Command:"C:/msys32/usr/bin/make.exe" "cmTC_27a26/fast"
make[1]: Entering directory '/home/buildbot/slave/monero-static-win32/build/build/release/CMakeFiles/CMakeTmp'
/usr/bin/make -f CMakeFiles/cmTC_27a26.dir/build.make CMakeFiles/cmTC_27a26.dir/build
make[2]: Entering directory '/home/buildbot/slave/monero-static-win32/build/build/release/CMakeFiles/CMakeTmp'
Building C object CMakeFiles/cmTC_27a26.dir/CheckFunctionExists.c.obj

/C/msys32/mingw32/bin/i686-w64-mingw32-gcc.exe   -DCHECK_FUNCTION_EXISTS=fcntl   -o CMakeFiles/cmTC_27a26.dir/CheckFunctionExists.c.obj   -c /C/msys32/mingw32/share/cmake-3.12/Modules/CheckFunctionExists.c
Linking C executable cmTC_27a26.exe

/C/msys32/mingw32/bin/cmake.exe -E remove -f CMakeFiles/cmTC_27a26.dir/objects.a
ar cr CMakeFiles/cmTC_27a26.dir/objects.a "CMakeFiles/cmTC_27a26.dir/CheckFunctionExists.c.obj" 
/C/msys32/mingw32/bin/i686-w64-mingw32-gcc.exe  -DCHECK_FUNCTION_EXISTS=fcntl    -Wl,--whole-archive CMakeFiles/cmTC_27a26.dir/objects.a -Wl,--no-whole-archive  -o cmTC_27a26.exe -Wl,--major-image-version,0,--minor-image-version,0 -liphlpapi -lws2_32 -lkernel32 -luser32 -lgdi32 -lwinspool -lshell32 -lole32 -loleaut32 -luuid -lcomdlg32 -ladvapi32 
CMakeFiles/cmTC_27a26.dir/objects.a(CheckFunctionExists.c.obj):CheckFunctionExists.c:(.text+0xc): undefined reference to `fcntl'

collect2.exe: error: ld returned 1 exit status

make[2]: *** [CMakeFiles/cmTC_27a26.dir/build.make:88: cmTC_27a26.exe] Error 1
make[2]: Leaving directory '/home/buildbot/slave/monero-static-win32/build/build/release/CMakeFiles/CMakeTmp'
make[1]: *** [Makefile:121: cmTC_27a26/fast] Error 2
make[1]: Leaving directory '/home/buildbot/slave/monero-static-win32/build/build/release/CMakeFiles/CMakeTmp'


Determining if the function inet_aton exists failed with the following output:
Change Dir: C:/msys32/home/buildbot/slave/monero-static-win32/build/build/release/CMakeFiles/CMakeTmp

Run Build Command:"C:/msys32/usr/bin/make.exe" "cmTC_c3165/fast"
make[1]: Entering directory '/home/buildbot/slave/monero-static-win32/build/build/release/CMakeFiles/CMakeTmp'
/usr/bin/make -f CMakeFiles/cmTC_c3165.dir/build.make CMakeFiles/cmTC_c3165.dir/build
make[2]: Entering directory '/home/buildbot/slave/monero-static-win32/build/build/release/CMakeFiles/CMakeTmp'
Building C object CMakeFiles/cmTC_c3165.dir/CheckFunctionExists.c.obj

/C/msys32/mingw32/bin/i686-w64-mingw32-gcc.exe   -DCHECK_FUNCTION_EXISTS=inet_aton   -o CMakeFiles/cmTC_c3165.dir/CheckFunctionExists.c.obj   -c /C/msys32/mingw32/share/cmake-3.12/Modules/CheckFunctionExists.c
Linking C executable cmTC_c3165.exe

/C/msys32/mingw32/bin/cmake.exe -E remove -f CMakeFiles/cmTC_c3165.dir/objects.a
ar cr CMakeFiles/cmTC_c3165.dir/objects.a "CMakeFiles/cmTC_c3165.dir/CheckFunctionExists.c.obj" 
/C/msys32/mingw32/bin/i686-w64-mingw32-gcc.exe  -DCHECK_FUNCTION_EXISTS=inet_aton    -Wl,--whole-archive CMakeFiles/cmTC_c3165.dir/objects.a -Wl,--no-whole-archive  -o cmTC_c3165.exe -Wl,--major-image-version,0,--minor-image-version,0 -liphlpapi -lws2_32 -lkernel32 -luser32 -lgdi32 -lwinspool -lshell32 -lole32 -loleaut32 -luuid -lcomdlg32 -ladvapi32 
CMakeFiles/cmTC_c3165.dir/objects.a(CheckFunctionExists.c.obj):CheckFunctionExists.c:(.text+0xc): undefined reference to `inet_aton'

collect2.exe: error: ld returned 1 exit status

make[2]: *** [CMakeFiles/cmTC_c3165.dir/build.make:88: cmTC_c3165.exe] Error 1
make[2]: Leaving directory '/home/buildbot/slave/monero-static-win32/build/build/release/CMakeFiles/CMakeTmp'
make[1]: *** [Makefile:121: cmTC_c3165/fast] Error 2
make[1]: Leaving directory '/home/buildbot/slave/monero-static-win32/build/build/release/CMakeFiles/CMakeTmp'


Determining if the function inet_ntop exists failed with the following output:
Change Dir: C:/msys32/home/buildbot/slave/monero-static-win32/build/build/release/CMakeFiles/CMakeTmp

Run Build Command:"C:/msys32/usr/bin/make.exe" "cmTC_c2191/fast"
make[1]: Entering directory '/home/buildbot/slave/monero-static-win32/build/build/release/CMakeFiles/CMakeTmp'
/usr/bin/make -f CMakeFiles/cmTC_c2191.dir/build.make CMakeFiles/cmTC_c2191.dir/build
make[2]: Entering directory '/home/buildbot/slave/monero-static-win32/build/build/release/CMakeFiles/CMakeTmp'
Building C object CMakeFiles/cmTC_c2191.dir/CheckFunctionExists.c.obj

/C/msys32/mingw32/bin/i686-w64-mingw32-gcc.exe   -DCHECK_FUNCTION_EXISTS=inet_ntop   -o CMakeFiles/cmTC_c2191.dir/CheckFunctionExists.c.obj   -c /C/msys32/mingw32/share/cmake-3.12/Modules/CheckFunctionExists.c
Linking C executable cmTC_c2191.exe

/C/msys32/mingw32/bin/cmake.exe -E remove -f CMakeFiles/cmTC_c2191.dir/objects.a
ar cr CMakeFiles/cmTC_c2191.dir/objects.a "CMakeFiles/cmTC_c2191.dir/CheckFunctionExists.c.obj" 
/C/msys32/mingw32/bin/i686-w64-mingw32-gcc.exe  -DCHECK_FUNCTION_EXISTS=inet_ntop    -Wl,--whole-archive CMakeFiles/cmTC_c2191.dir/objects.a -Wl,--no-whole-archive  -o cmTC_c2191.exe -Wl,--major-image-version,0,--minor-image-version,0 -liphlpapi -lws2_32 -lkernel32 -luser32 -lgdi32 -lwinspool -lshell32 -lole32 -loleaut32 -luuid -lcomdlg32 -ladvapi32 
CMakeFiles/cmTC_c2191.dir/objects.a(CheckFunctionExists.c.obj):CheckFunctionExists.c:(.text+0xc): undefined reference to `inet_ntop'

collect2.exe: error: ld returned 1 exit status

make[2]: *** [CMakeFiles/cmTC_c2191.dir/build.make:88: cmTC_c2191.exe] Error 1
make[2]: Leaving directory '/home/buildbot/slave/monero-static-win32/build/build/release/CMakeFiles/CMakeTmp'
make[1]: *** [Makefile:121: cmTC_c2191/fast] Error 2
make[1]: Leaving directory '/home/buildbot/slave/monero-static-win32/build/build/release/CMakeFiles/CMakeTmp'


Determining if the function inet_pton exists failed with the following output:
Change Dir: C:/msys32/home/buildbot/slave/monero-static-win32/build/build/release/CMakeFiles/CMakeTmp

Run Build Command:"C:/msys32/usr/bin/make.exe" "cmTC_ef7d9/fast"
make[1]: Entering directory '/home/buildbot/slave/monero-static-win32/build/build/release/CMakeFiles/CMakeTmp'
/usr/bin/make -f CMakeFiles/cmTC_ef7d9.dir/build.make CMakeFiles/cmTC_ef7d9.dir/build
make[2]: Entering directory '/home/buildbot/slave/monero-static-win32/build/build/release/CMakeFiles/CMakeTmp'
Building C object CMakeFiles/cmTC_ef7d9.dir/CheckFunctionExists.c.obj

/C/msys32/mingw32/bin/i686-w64-mingw32-gcc.exe   -DCHECK_FUNCTION_EXISTS=inet_pton   -o CMakeFiles/cmTC_ef7d9.dir/CheckFunctionExists.c.obj   -c /C/msys32/mingw32/share/cmake-3.12/Modules/CheckFunctionExists.c
Linking C executable cmTC_ef7d9.exe

/C/msys32/mingw32/bin/cmake.exe -E remove -f CMakeFiles/cmTC_ef7d9.dir/objects.a
ar cr CMakeFiles/cmTC_ef7d9.dir/objects.a "CMakeFiles/cmTC_ef7d9.dir/CheckFunctionExists.c.obj" 
/C/msys32/mingw32/bin/i686-w64-mingw32-gcc.exe  -DCHECK_FUNCTION_EXISTS=inet_pton    -Wl,--whole-archive CMakeFiles/cmTC_ef7d9.dir/objects.a -Wl,--no-whole-archive  -o cmTC_ef7d9.exe -Wl,--major-image-version,0,--minor-image-version,0 -liphlpapi -lws2_32 -lkernel32 -luser32 -lgdi32 -lwinspool -lshell32 -lole32 -loleaut32 -luuid -lcomdlg32 -ladvapi32 
CMakeFiles/cmTC_ef7d9.dir/objects.a(CheckFunctionExists.c.obj):CheckFunctionExists.c:(.text+0xc): undefined reference to `inet_pton'

collect2.exe: error: ld returned 1 exit status

make[2]: *** [CMakeFiles/cmTC_ef7d9.dir/build.make:88: cmTC_ef7d9.exe] Error 1
make[2]: Leaving directory '/home/buildbot/slave/monero-static-win32/build/build/release/CMakeFiles/CMakeTmp'
make[1]: *** [Makefile:121: cmTC_ef7d9/fast] Error 2
make[1]: Leaving directory '/home/buildbot/slave/monero-static-win32/build/build/release/CMakeFiles/CMakeTmp'


Determining if the function initgroups exists failed with the following output:
Change Dir: C:/msys32/home/buildbot/slave/monero-static-win32/build/build/release/CMakeFiles/CMakeTmp

Run Build Command:"C:/msys32/usr/bin/make.exe" "cmTC_62344/fast"
make[1]: Entering directory '/home/buildbot/slave/monero-static-win32/build/build/release/CMakeFiles/CMakeTmp'
/usr/bin/make -f CMakeFiles/cmTC_62344.dir/build.make CMakeFiles/cmTC_62344.dir/build
make[2]: Entering directory '/home/buildbot/slave/monero-static-win32/build/build/release/CMakeFiles/CMakeTmp'
Building C object CMakeFiles/cmTC_62344.dir/CheckFunctionExists.c.obj

/C/msys32/mingw32/bin/i686-w64-mingw32-gcc.exe   -DCHECK_FUNCTION_EXISTS=initgroups   -o CMakeFiles/cmTC_62344.dir/CheckFunctionExists.c.obj   -c /C/msys32/mingw32/share/cmake-3.12/Modules/CheckFunctionExists.c
Linking C executable cmTC_62344.exe

/C/msys32/mingw32/bin/cmake.exe -E remove -f CMakeFiles/cmTC_62344.dir/objects.a
ar cr CMakeFiles/cmTC_62344.dir/objects.a "CMakeFiles/cmTC_62344.dir/CheckFunctionExists.c.obj" 
/C/msys32/mingw32/bin/i686-w64-mingw32-gcc.exe  -DCHECK_FUNCTION_EXISTS=initgroups    -Wl,--whole-archive CMakeFiles/cmTC_62344.dir/objects.a -Wl,--no-whole-archive  -o cmTC_62344.exe -Wl,--major-image-version,0,--minor-image-version,0 -liphlpapi -lws2_32 -lkernel32 -luser32 -lgdi32 -lwinspool -lshell32 -lole32 -loleaut32 -luuid -lcomdlg32 -ladvapi32 
CMakeFiles/cmTC_62344.dir/objects.a(CheckFunctionExists.c.obj):CheckFunctionExists.c:(.text+0xc): undefined reference to `initgroups'

collect2.exe: error: ld returned 1 exit status

make[2]: *** [CMakeFiles/cmTC_62344.dir/build.make:88: cmTC_62344.exe] Error 1
make[2]: Leaving directory '/home/buildbot/slave/monero-static-win32/build/build/release/CMakeFiles/CMakeTmp'
make[1]: *** [Makefile:121: cmTC_62344/fast] Error 2
make[1]: Leaving directory '/home/buildbot/slave/monero-static-win32/build/build/release/CMakeFiles/CMakeTmp'


Determining if the function ioctlsocket exists failed with the following output:
Change Dir: C:/msys32/home/buildbot/slave/monero-static-win32/build/build/release/CMakeFiles/CMakeTmp

Run Build Command:"C:/msys32/usr/bin/make.exe" "cmTC_86d07/fast"
make[1]: Entering directory '/home/buildbot/slave/monero-static-win32/build/build/release/CMakeFiles/CMakeTmp'
/usr/bin/make -f CMakeFiles/cmTC_86d07.dir/build.make CMakeFiles/cmTC_86d07.dir/build
make[2]: Entering directory '/home/buildbot/slave/monero-static-win32/build/build/release/CMakeFiles/CMakeTmp'
Building C object CMakeFiles/cmTC_86d07.dir/CheckFunctionExists.c.obj

/C/msys32/mingw32/bin/i686-w64-mingw32-gcc.exe   -DCHECK_FUNCTION_EXISTS=ioctlsocket   -o CMakeFiles/cmTC_86d07.dir/CheckFunctionExists.c.obj   -c /C/msys32/mingw32/share/cmake-3.12/Modules/CheckFunctionExists.c
Linking C executable cmTC_86d07.exe

/C/msys32/mingw32/bin/cmake.exe -E remove -f CMakeFiles/cmTC_86d07.dir/objects.a
ar cr CMakeFiles/cmTC_86d07.dir/objects.a "CMakeFiles/cmTC_86d07.dir/CheckFunctionExists.c.obj" 
/C/msys32/mingw32/bin/i686-w64-mingw32-gcc.exe  -DCHECK_FUNCTION_EXISTS=ioctlsocket    -Wl,--whole-archive CMakeFiles/cmTC_86d07.dir/objects.a -Wl,--no-whole-archive  -o cmTC_86d07.exe -Wl,--major-image-version,0,--minor-image-version,0 -liphlpapi -lws2_32 -lkernel32 -luser32 -lgdi32 -lwinspool -lshell32 -lole32 -loleaut32 -luuid -lcomdlg32 -ladvapi32 
CMakeFiles/cmTC_86d07.dir/objects.a(CheckFunctionExists.c.obj):CheckFunctionExists.c:(.text+0xc): undefined reference to `ioctlsocket'

collect2.exe: error: ld returned 1 exit status

make[2]: *** [CMakeFiles/cmTC_86d07.dir/build.make:88: cmTC_86d07.exe] Error 1
make[2]: Leaving directory '/home/buildbot/slave/monero-static-win32/build/build/release/CMakeFiles/CMakeTmp'
make[1]: *** [Makefile:121: cmTC_86d07/fast] Error 2
make[1]: Leaving directory '/home/buildbot/slave/monero-static-win32/build/build/release/CMakeFiles/CMakeTmp'


Determining if the function kill exists failed with the following output:
Change Dir: C:/msys32/home/buildbot/slave/monero-static-win32/build/build/release/CMakeFiles/CMakeTmp

Run Build Command:"C:/msys32/usr/bin/make.exe" "cmTC_74db6/fast"
make[1]: Entering directory '/home/buildbot/slave/monero-static-win32/build/build/release/CMakeFiles/CMakeTmp'
/usr/bin/make -f CMakeFiles/cmTC_74db6.dir/build.make CMakeFiles/cmTC_74db6.dir/build
make[2]: Entering directory '/home/buildbot/slave/monero-static-win32/build/build/release/CMakeFiles/CMakeTmp'
Building C object CMakeFiles/cmTC_74db6.dir/CheckFunctionExists.c.obj

/C/msys32/mingw32/bin/i686-w64-mingw32-gcc.exe   -DCHECK_FUNCTION_EXISTS=kill   -o CMakeFiles/cmTC_74db6.dir/CheckFunctionExists.c.obj   -c /C/msys32/mingw32/share/cmake-3.12/Modules/CheckFunctionExists.c
Linking C executable cmTC_74db6.exe

/C/msys32/mingw32/bin/cmake.exe -E remove -f CMakeFiles/cmTC_74db6.dir/objects.a
ar cr CMakeFiles/cmTC_74db6.dir/objects.a "CMakeFiles/cmTC_74db6.dir/CheckFunctionExists.c.obj" 
/C/msys32/mingw32/bin/i686-w64-mingw32-gcc.exe  -DCHECK_FUNCTION_EXISTS=kill    -Wl,--whole-archive CMakeFiles/cmTC_74db6.dir/objects.a -Wl,--no-whole-archive  -o cmTC_74db6.exe -Wl,--major-image-version,0,--minor-image-version,0 -liphlpapi -lws2_32 -lkernel32 -luser32 -lgdi32 -lwinspool -lshell32 -lole32 -loleaut32 -luuid -lcomdlg32 -ladvapi32 
CMakeFiles/cmTC_74db6.dir/objects.a(CheckFunctionExists.c.obj):CheckFunctionExists.c:(.text+0xc): undefined reference to `kill'

collect2.exe: error: ld returned 1 exit status

make[2]: *** [CMakeFiles/cmTC_74db6.dir/build.make:88: cmTC_74db6.exe] Error 1
make[2]: Leaving directory '/home/buildbot/slave/monero-static-win32/build/build/release/CMakeFiles/CMakeTmp'
make[1]: *** [Makefile:121: cmTC_74db6/fast] Error 2
make[1]: Leaving directory '/home/buildbot/slave/monero-static-win32/build/build/release/CMakeFiles/CMakeTmp'


Determining if the function localtime_r exists failed with the following output:
Change Dir: C:/msys32/home/buildbot/slave/monero-static-win32/build/build/release/CMakeFiles/CMakeTmp

Run Build Command:"C:/msys32/usr/bin/make.exe" "cmTC_7d2b8/fast"
make[1]: Entering directory '/home/buildbot/slave/monero-static-win32/build/build/release/CMakeFiles/CMakeTmp'
/usr/bin/make -f CMakeFiles/cmTC_7d2b8.dir/build.make CMakeFiles/cmTC_7d2b8.dir/build
make[2]: Entering directory '/home/buildbot/slave/monero-static-win32/build/build/release/CMakeFiles/CMakeTmp'
Building C object CMakeFiles/cmTC_7d2b8.dir/CheckFunctionExists.c.obj

/C/msys32/mingw32/bin/i686-w64-mingw32-gcc.exe   -DCHECK_FUNCTION_EXISTS=localtime_r   -o CMakeFiles/cmTC_7d2b8.dir/CheckFunctionExists.c.obj   -c /C/msys32/mingw32/share/cmake-3.12/Modules/CheckFunctionExists.c
Linking C executable cmTC_7d2b8.exe

/C/msys32/mingw32/bin/cmake.exe -E remove -f CMakeFiles/cmTC_7d2b8.dir/objects.a
ar cr CMakeFiles/cmTC_7d2b8.dir/objects.a "CMakeFiles/cmTC_7d2b8.dir/CheckFunctionExists.c.obj" 
/C/msys32/mingw32/bin/i686-w64-mingw32-gcc.exe  -DCHECK_FUNCTION_EXISTS=localtime_r    -Wl,--whole-archive CMakeFiles/cmTC_7d2b8.dir/objects.a -Wl,--no-whole-archive  -o cmTC_7d2b8.exe -Wl,--major-image-version,0,--minor-image-version,0 -liphlpapi -lws2_32 -lkernel32 -luser32 -lgdi32 -lwinspool -lshell32 -lole32 -loleaut32 -luuid -lcomdlg32 -ladvapi32 
CMakeFiles/cmTC_7d2b8.dir/objects.a(CheckFunctionExists.c.obj):CheckFunctionExists.c:(.text+0xc): undefined reference to `localtime_r'

collect2.exe: error: ld returned 1 exit status

make[2]: *** [CMakeFiles/cmTC_7d2b8.dir/build.make:88: cmTC_7d2b8.exe] Error 1
make[2]: Leaving directory '/home/buildbot/slave/monero-static-win32/build/build/release/CMakeFiles/CMakeTmp'
make[1]: *** [Makefile:121: cmTC_7d2b8/fast] Error 2
make[1]: Leaving directory '/home/buildbot/slave/monero-static-win32/build/build/release/CMakeFiles/CMakeTmp'


Determining if the function random exists failed with the following output:
Change Dir: C:/msys32/home/buildbot/slave/monero-static-win32/build/build/release/CMakeFiles/CMakeTmp

Run Build Command:"C:/msys32/usr/bin/make.exe" "cmTC_a5ca8/fast"
make[1]: Entering directory '/home/buildbot/slave/monero-static-win32/build/build/release/CMakeFiles/CMakeTmp'
/usr/bin/make -f CMakeFiles/cmTC_a5ca8.dir/build.make CMakeFiles/cmTC_a5ca8.dir/build
make[2]: Entering directory '/home/buildbot/slave/monero-static-win32/build/build/release/CMakeFiles/CMakeTmp'
Building C object CMakeFiles/cmTC_a5ca8.dir/CheckFunctionExists.c.obj

/C/msys32/mingw32/bin/i686-w64-mingw32-gcc.exe   -DCHECK_FUNCTION_EXISTS=random   -o CMakeFiles/cmTC_a5ca8.dir/CheckFunctionExists.c.obj   -c /C/msys32/mingw32/share/cmake-3.12/Modules/CheckFunctionExists.c
Linking C executable cmTC_a5ca8.exe

/C/msys32/mingw32/bin/cmake.exe -E remove -f CMakeFiles/cmTC_a5ca8.dir/objects.a
ar cr CMakeFiles/cmTC_a5ca8.dir/objects.a "CMakeFiles/cmTC_a5ca8.dir/CheckFunctionExists.c.obj" 
/C/msys32/mingw32/bin/i686-w64-mingw32-gcc.exe  -DCHECK_FUNCTION_EXISTS=random    -Wl,--whole-archive CMakeFiles/cmTC_a5ca8.dir/objects.a -Wl,--no-whole-archive  -o cmTC_a5ca8.exe -Wl,--major-image-version,0,--minor-image-version,0 -liphlpapi -lws2_32 -lkernel32 -luser32 -lgdi32 -lwinspool -lshell32 -lole32 -loleaut32 -luuid -lcomdlg32 -ladvapi32 
CMakeFiles/cmTC_a5ca8.dir/objects.a(CheckFunctionExists.c.obj):CheckFunctionExists.c:(.text+0xc): undefined reference to `random'

collect2.exe: error: ld returned 1 exit status

make[2]: *** [CMakeFiles/cmTC_a5ca8.dir/build.make:88: cmTC_a5ca8.exe] Error 1
make[2]: Leaving directory '/home/buildbot/slave/monero-static-win32/build/build/release/CMakeFiles/CMakeTmp'
make[1]: *** [Makefile:121: cmTC_a5ca8/fast] Error 2
make[1]: Leaving directory '/home/buildbot/slave/monero-static-win32/build/build/release/CMakeFiles/CMakeTmp'


Determining if the function reallocarray exists failed with the following output:
Change Dir: C:/msys32/home/buildbot/slave/monero-static-win32/build/build/release/CMakeFiles/CMakeTmp

Run Build Command:"C:/msys32/usr/bin/make.exe" "cmTC_4c7a2/fast"
make[1]: Entering directory '/home/buildbot/slave/monero-static-win32/build/build/release/CMakeFiles/CMakeTmp'
/usr/bin/make -f CMakeFiles/cmTC_4c7a2.dir/build.make CMakeFiles/cmTC_4c7a2.dir/build
make[2]: Entering directory '/home/buildbot/slave/monero-static-win32/build/build/release/CMakeFiles/CMakeTmp'
Building C object CMakeFiles/cmTC_4c7a2.dir/CheckFunctionExists.c.obj

/C/msys32/mingw32/bin/i686-w64-mingw32-gcc.exe   -DCHECK_FUNCTION_EXISTS=reallocarray   -o CMakeFiles/cmTC_4c7a2.dir/CheckFunctionExists.c.obj   -c /C/msys32/mingw32/share/cmake-3.12/Modules/CheckFunctionExists.c
Linking C executable cmTC_4c7a2.exe

/C/msys32/mingw32/bin/cmake.exe -E remove -f CMakeFiles/cmTC_4c7a2.dir/objects.a
ar cr CMakeFiles/cmTC_4c7a2.dir/objects.a "CMakeFiles/cmTC_4c7a2.dir/CheckFunctionExists.c.obj" 
/C/msys32/mingw32/bin/i686-w64-mingw32-gcc.exe  -DCHECK_FUNCTION_EXISTS=reallocarray    -Wl,--whole-archive CMakeFiles/cmTC_4c7a2.dir/objects.a -Wl,--no-whole-archive  -o cmTC_4c7a2.exe -Wl,--major-image-version,0,--minor-image-version,0 -liphlpapi -lws2_32 -lkernel32 -luser32 -lgdi32 -lwinspool -lshell32 -lole32 -loleaut32 -luuid -lcomdlg32 -ladvapi32 
CMakeFiles/cmTC_4c7a2.dir/objects.a(CheckFunctionExists.c.obj):CheckFunctionExists.c:(.text+0xc): undefined reference to `reallocarray'

collect2.exe: error: ld returned 1 exit status

make[2]: *** [CMakeFiles/cmTC_4c7a2.dir/build.make:88: cmTC_4c7a2.exe] Error 1
make[2]: Leaving directory '/home/buildbot/slave/monero-static-win32/build/build/release/CMakeFiles/CMakeTmp'
make[1]: *** [Makefile:121: cmTC_4c7a2/fast] Error 2
make[1]: Leaving directory '/home/buildbot/slave/monero-static-win32/build/build/release/CMakeFiles/CMakeTmp'


Determining if the function recvmsg exists failed with the following output:
Change Dir: C:/msys32/home/buildbot/slave/monero-static-win32/build/build/release/CMakeFiles/CMakeTmp

Run Build Command:"C:/msys32/usr/bin/make.exe" "cmTC_3dd03/fast"
make[1]: Entering directory '/home/buildbot/slave/monero-static-win32/build/build/release/CMakeFiles/CMakeTmp'
/usr/bin/make -f CMakeFiles/cmTC_3dd03.dir/build.make CMakeFiles/cmTC_3dd03.dir/build
make[2]: Entering directory '/home/buildbot/slave/monero-static-win32/build/build/release/CMakeFiles/CMakeTmp'
Building C object CMakeFiles/cmTC_3dd03.dir/CheckFunctionExists.c.obj

/C/msys32/mingw32/bin/i686-w64-mingw32-gcc.exe   -DCHECK_FUNCTION_EXISTS=recvmsg   -o CMakeFiles/cmTC_3dd03.dir/CheckFunctionExists.c.obj   -c /C/msys32/mingw32/share/cmake-3.12/Modules/CheckFunctionExists.c
Linking C executable cmTC_3dd03.exe

/C/msys32/mingw32/bin/cmake.exe -E remove -f CMakeFiles/cmTC_3dd03.dir/objects.a
ar cr CMakeFiles/cmTC_3dd03.dir/objects.a "CMakeFiles/cmTC_3dd03.dir/CheckFunctionExists.c.obj" 
/C/msys32/mingw32/bin/i686-w64-mingw32-gcc.exe  -DCHECK_FUNCTION_EXISTS=recvmsg    -Wl,--whole-archive CMakeFiles/cmTC_3dd03.dir/objects.a -Wl,--no-whole-archive  -o cmTC_3dd03.exe -Wl,--major-image-version,0,--minor-image-version,0 -liphlpapi -lws2_32 -lkernel32 -luser32 -lgdi32 -lwinspool -lshell32 -lole32 -loleaut32 -luuid -lcomdlg32 -ladvapi32 
CMakeFiles/cmTC_3dd03.dir/objects.a(CheckFunctionExists.c.obj):CheckFunctionExists.c:(.text+0xc): undefined reference to `recvmsg'

collect2.exe: error: ld returned 1 exit status

make[2]: *** [CMakeFiles/cmTC_3dd03.dir/build.make:88: cmTC_3dd03.exe] Error 1
make[2]: Leaving directory '/home/buildbot/slave/monero-static-win32/build/build/release/CMakeFiles/CMakeTmp'
make[1]: *** [Makefile:121: cmTC_3dd03/fast] Error 2
make[1]: Leaving directory '/home/buildbot/slave/monero-static-win32/build/build/release/CMakeFiles/CMakeTmp'


Determining if the function sbrk exists failed with the following output:
Change Dir: C:/msys32/home/buildbot/slave/monero-static-win32/build/build/release/CMakeFiles/CMakeTmp

Run Build Command:"C:/msys32/usr/bin/make.exe" "cmTC_47406/fast"
make[1]: Entering directory '/home/buildbot/slave/monero-static-win32/build/build/release/CMakeFiles/CMakeTmp'
/usr/bin/make -f CMakeFiles/cmTC_47406.dir/build.make CMakeFiles/cmTC_47406.dir/build
make[2]: Entering directory '/home/buildbot/slave/monero-static-win32/build/build/release/CMakeFiles/CMakeTmp'
Building C object CMakeFiles/cmTC_47406.dir/CheckFunctionExists.c.obj

/C/msys32/mingw32/bin/i686-w64-mingw32-gcc.exe   -DCHECK_FUNCTION_EXISTS=sbrk   -o CMakeFiles/cmTC_47406.dir/CheckFunctionExists.c.obj   -c /C/msys32/mingw32/share/cmake-3.12/Modules/CheckFunctionExists.c
Linking C executable cmTC_47406.exe

/C/msys32/mingw32/bin/cmake.exe -E remove -f CMakeFiles/cmTC_47406.dir/objects.a
ar cr CMakeFiles/cmTC_47406.dir/objects.a "CMakeFiles/cmTC_47406.dir/CheckFunctionExists.c.obj" 
/C/msys32/mingw32/bin/i686-w64-mingw32-gcc.exe  -DCHECK_FUNCTION_EXISTS=sbrk    -Wl,--whole-archive CMakeFiles/cmTC_47406.dir/objects.a -Wl,--no-whole-archive  -o cmTC_47406.exe -Wl,--major-image-version,0,--minor-image-version,0 -liphlpapi -lws2_32 -lkernel32 -luser32 -lgdi32 -lwinspool -lshell32 -lole32 -loleaut32 -luuid -lcomdlg32 -ladvapi32 
CMakeFiles/cmTC_47406.dir/objects.a(CheckFunctionExists.c.obj):CheckFunctionExists.c:(.text+0xc): undefined reference to `sbrk'

collect2.exe: error: ld returned 1 exit status

make[2]: *** [CMakeFiles/cmTC_47406.dir/build.make:88: cmTC_47406.exe] Error 1
make[2]: Leaving directory '/home/buildbot/slave/monero-static-win32/build/build/release/CMakeFiles/CMakeTmp'
make[1]: *** [Makefile:121: cmTC_47406/fast] Error 2
make[1]: Leaving directory '/home/buildbot/slave/monero-static-win32/build/build/release/CMakeFiles/CMakeTmp'


Determining if the function sendmsg exists failed with the following output:
Change Dir: C:/msys32/home/buildbot/slave/monero-static-win32/build/build/release/CMakeFiles/CMakeTmp

Run Build Command:"C:/msys32/usr/bin/make.exe" "cmTC_6de34/fast"
make[1]: Entering directory '/home/buildbot/slave/monero-static-win32/build/build/release/CMakeFiles/CMakeTmp'
/usr/bin/make -f CMakeFiles/cmTC_6de34.dir/build.make CMakeFiles/cmTC_6de34.dir/build
make[2]: Entering directory '/home/buildbot/slave/monero-static-win32/build/build/release/CMakeFiles/CMakeTmp'
Building C object CMakeFiles/cmTC_6de34.dir/CheckFunctionExists.c.obj

/C/msys32/mingw32/bin/i686-w64-mingw32-gcc.exe   -DCHECK_FUNCTION_EXISTS=sendmsg   -o CMakeFiles/cmTC_6de34.dir/CheckFunctionExists.c.obj   -c /C/msys32/mingw32/share/cmake-3.12/Modules/CheckFunctionExists.c
Linking C executable cmTC_6de34.exe

/C/msys32/mingw32/bin/cmake.exe -E remove -f CMakeFiles/cmTC_6de34.dir/objects.a
ar cr CMakeFiles/cmTC_6de34.dir/objects.a "CMakeFiles/cmTC_6de34.dir/CheckFunctionExists.c.obj" 
/C/msys32/mingw32/bin/i686-w64-mingw32-gcc.exe  -DCHECK_FUNCTION_EXISTS=sendmsg    -Wl,--whole-archive CMakeFiles/cmTC_6de34.dir/objects.a -Wl,--no-whole-archive  -o cmTC_6de34.exe -Wl,--major-image-version,0,--minor-image-version,0 -liphlpapi -lws2_32 -lkernel32 -luser32 -lgdi32 -lwinspool -lshell32 -lole32 -loleaut32 -luuid -lcomdlg32 -ladvapi32 
CMakeFiles/cmTC_6de34.dir/objects.a(CheckFunctionExists.c.obj):CheckFunctionExists.c:(.text+0xc): undefined reference to `sendmsg'

collect2.exe: error: ld returned 1 exit status

make[2]: *** [CMakeFiles/cmTC_6de34.dir/build.make:88: cmTC_6de34.exe] Error 1
make[2]: Leaving directory '/home/buildbot/slave/monero-static-win32/build/build/release/CMakeFiles/CMakeTmp'
make[1]: *** [Makefile:121: cmTC_6de34/fast] Error 2
make[1]: Leaving directory '/home/buildbot/slave/monero-static-win32/build/build/release/CMakeFiles/CMakeTmp'


Determining if the function setregid exists failed with the following output:
Change Dir: C:/msys32/home/buildbot/slave/monero-static-win32/build/build/release/CMakeFiles/CMakeTmp

Run Build Command:"C:/msys32/usr/bin/make.exe" "cmTC_fdc72/fast"
make[1]: Entering directory '/home/buildbot/slave/monero-static-win32/build/build/release/CMakeFiles/CMakeTmp'
/usr/bin/make -f CMakeFiles/cmTC_fdc72.dir/build.make CMakeFiles/cmTC_fdc72.dir/build
make[2]: Entering directory '/home/buildbot/slave/monero-static-win32/build/build/release/CMakeFiles/CMakeTmp'
Building C object CMakeFiles/cmTC_fdc72.dir/CheckFunctionExists.c.obj

/C/msys32/mingw32/bin/i686-w64-mingw32-gcc.exe   -DCHECK_FUNCTION_EXISTS=setregid   -o CMakeFiles/cmTC_fdc72.dir/CheckFunctionExists.c.obj   -c /C/msys32/mingw32/share/cmake-3.12/Modules/CheckFunctionExists.c
Linking C executable cmTC_fdc72.exe

/C/msys32/mingw32/bin/cmake.exe -E remove -f CMakeFiles/cmTC_fdc72.dir/objects.a
ar cr CMakeFiles/cmTC_fdc72.dir/objects.a "CMakeFiles/cmTC_fdc72.dir/CheckFunctionExists.c.obj" 
/C/msys32/mingw32/bin/i686-w64-mingw32-gcc.exe  -DCHECK_FUNCTION_EXISTS=setregid    -Wl,--whole-archive CMakeFiles/cmTC_fdc72.dir/objects.a -Wl,--no-whole-archive  -o cmTC_fdc72.exe -Wl,--major-image-version,0,--minor-image-version,0 -liphlpapi -lws2_32 -lkernel32 -luser32 -lgdi32 -lwinspool -lshell32 -lole32 -loleaut32 -luuid -lcomdlg32 -ladvapi32 
CMakeFiles/cmTC_fdc72.dir/objects.a(CheckFunctionExists.c.obj):CheckFunctionExists.c:(.text+0xc): undefined reference to `setregid'

collect2.exe: error: ld returned 1 exit status

make[2]: *** [CMakeFiles/cmTC_fdc72.dir/build.make:88: cmTC_fdc72.exe] Error 1
make[2]: Leaving directory '/home/buildbot/slave/monero-static-win32/build/build/release/CMakeFiles/CMakeTmp'
make[1]: *** [Makefile:121: cmTC_fdc72/fast] Error 2
make[1]: Leaving directory '/home/buildbot/slave/monero-static-win32/build/build/release/CMakeFiles/CMakeTmp'


Determining if the function setresgid exists failed with the following output:
Change Dir: C:/msys32/home/buildbot/slave/monero-static-win32/build/build/release/CMakeFiles/CMakeTmp

Run Build Command:"C:/msys32/usr/bin/make.exe" "cmTC_7bdd1/fast"
make[1]: Entering directory '/home/buildbot/slave/monero-static-win32/build/build/release/CMakeFiles/CMakeTmp'
/usr/bin/make -f CMakeFiles/cmTC_7bdd1.dir/build.make CMakeFiles/cmTC_7bdd1.dir/build
make[2]: Entering directory '/home/buildbot/slave/monero-static-win32/build/build/release/CMakeFiles/CMakeTmp'
Building C object CMakeFiles/cmTC_7bdd1.dir/CheckFunctionExists.c.obj

/C/msys32/mingw32/bin/i686-w64-mingw32-gcc.exe   -DCHECK_FUNCTION_EXISTS=setresgid   -o CMakeFiles/cmTC_7bdd1.dir/CheckFunctionExists.c.obj   -c /C/msys32/mingw32/share/cmake-3.12/Modules/CheckFunctionExists.c
Linking C executable cmTC_7bdd1.exe

/C/msys32/mingw32/bin/cmake.exe -E remove -f CMakeFiles/cmTC_7bdd1.dir/objects.a
ar cr CMakeFiles/cmTC_7bdd1.dir/objects.a "CMakeFiles/cmTC_7bdd1.dir/CheckFunctionExists.c.obj" 
/C/msys32/mingw32/bin/i686-w64-mingw32-gcc.exe  -DCHECK_FUNCTION_EXISTS=setresgid    -Wl,--whole-archive CMakeFiles/cmTC_7bdd1.dir/objects.a -Wl,--no-whole-archive  -o cmTC_7bdd1.exe -Wl,--major-image-version,0,--minor-image-version,0 -liphlpapi -lws2_32 -lkernel32 -luser32 -lgdi32 -lwinspool -lshell32 -lole32 -loleaut32 -luuid -lcomdlg32 -ladvapi32 
CMakeFiles/cmTC_7bdd1.dir/objects.a(CheckFunctionExists.c.obj):CheckFunctionExists.c:(.text+0xc): undefined reference to `setresgid'

collect2.exe: error: ld returned 1 exit status

make[2]: *** [CMakeFiles/cmTC_7bdd1.dir/build.make:88: cmTC_7bdd1.exe] Error 1
make[2]: Leaving directory '/home/buildbot/slave/monero-static-win32/build/build/release/CMakeFiles/CMakeTmp'
make[1]: *** [Makefile:121: cmTC_7bdd1/fast] Error 2
make[1]: Leaving directory '/home/buildbot/slave/monero-static-win32/build/build/release/CMakeFiles/CMakeTmp'


Determining if the function setresuid exists failed with the following output:
Change Dir: C:/msys32/home/buildbot/slave/monero-static-win32/build/build/release/CMakeFiles/CMakeTmp

Run Build Command:"C:/msys32/usr/bin/make.exe" "cmTC_189ed/fast"
make[1]: Entering directory '/home/buildbot/slave/monero-static-win32/build/build/release/CMakeFiles/CMakeTmp'
/usr/bin/make -f CMakeFiles/cmTC_189ed.dir/build.make CMakeFiles/cmTC_189ed.dir/build
make[2]: Entering directory '/home/buildbot/slave/monero-static-win32/build/build/release/CMakeFiles/CMakeTmp'
Building C object CMakeFiles/cmTC_189ed.dir/CheckFunctionExists.c.obj

/C/msys32/mingw32/bin/i686-w64-mingw32-gcc.exe   -DCHECK_FUNCTION_EXISTS=setresuid   -o CMakeFiles/cmTC_189ed.dir/CheckFunctionExists.c.obj   -c /C/msys32/mingw32/share/cmake-3.12/Modules/CheckFunctionExists.c
Linking C executable cmTC_189ed.exe

/C/msys32/mingw32/bin/cmake.exe -E remove -f CMakeFiles/cmTC_189ed.dir/objects.a
ar cr CMakeFiles/cmTC_189ed.dir/objects.a "CMakeFiles/cmTC_189ed.dir/CheckFunctionExists.c.obj" 
/C/msys32/mingw32/bin/i686-w64-mingw32-gcc.exe  -DCHECK_FUNCTION_EXISTS=setresuid    -Wl,--whole-archive CMakeFiles/cmTC_189ed.dir/objects.a -Wl,--no-whole-archive  -o cmTC_189ed.exe -Wl,--major-image-version,0,--minor-image-version,0 -liphlpapi -lws2_32 -lkernel32 -luser32 -lgdi32 -lwinspool -lshell32 -lole32 -loleaut32 -luuid -lcomdlg32 -ladvapi32 
CMakeFiles/cmTC_189ed.dir/objects.a(CheckFunctionExists.c.obj):CheckFunctionExists.c:(.text+0xc): undefined reference to `setresuid'

collect2.exe: error: ld returned 1 exit status

make[2]: *** [CMakeFiles/cmTC_189ed.dir/build.make:88: cmTC_189ed.exe] Error 1
make[2]: Leaving directory '/home/buildbot/slave/monero-static-win32/build/build/release/CMakeFiles/CMakeTmp'
make[1]: *** [Makefile:121: cmTC_189ed/fast] Error 2
make[1]: Leaving directory '/home/buildbot/slave/monero-static-win32/build/build/release/CMakeFiles/CMakeTmp'


Determining if the function setreuid exists failed with the following output:
Change Dir: C:/msys32/home/buildbot/slave/monero-static-win32/build/build/release/CMakeFiles/CMakeTmp

Run Build Command:"C:/msys32/usr/bin/make.exe" "cmTC_8e260/fast"
make[1]: Entering directory '/home/buildbot/slave/monero-static-win32/build/build/release/CMakeFiles/CMakeTmp'
/usr/bin/make -f CMakeFiles/cmTC_8e260.dir/build.make CMakeFiles/cmTC_8e260.dir/build
make[2]: Entering directory '/home/buildbot/slave/monero-static-win32/build/build/release/CMakeFiles/CMakeTmp'
Building C object CMakeFiles/cmTC_8e260.dir/CheckFunctionExists.c.obj

/C/msys32/mingw32/bin/i686-w64-mingw32-gcc.exe   -DCHECK_FUNCTION_EXISTS=setreuid   -o CMakeFiles/cmTC_8e260.dir/CheckFunctionExists.c.obj   -c /C/msys32/mingw32/share/cmake-3.12/Modules/CheckFunctionExists.c
Linking C executable cmTC_8e260.exe

/C/msys32/mingw32/bin/cmake.exe -E remove -f CMakeFiles/cmTC_8e260.dir/objects.a
ar cr CMakeFiles/cmTC_8e260.dir/objects.a "CMakeFiles/cmTC_8e260.dir/CheckFunctionExists.c.obj" 
/C/msys32/mingw32/bin/i686-w64-mingw32-gcc.exe  -DCHECK_FUNCTION_EXISTS=setreuid    -Wl,--whole-archive CMakeFiles/cmTC_8e260.dir/objects.a -Wl,--no-whole-archive  -o cmTC_8e260.exe -Wl,--major-image-version,0,--minor-image-version,0 -liphlpapi -lws2_32 -lkernel32 -luser32 -lgdi32 -lwinspool -lshell32 -lole32 -loleaut32 -luuid -lcomdlg32 -ladvapi32 
CMakeFiles/cmTC_8e260.dir/objects.a(CheckFunctionExists.c.obj):CheckFunctionExists.c:(.text+0xc): undefined reference to `setreuid'

collect2.exe: error: ld returned 1 exit status

make[2]: *** [CMakeFiles/cmTC_8e260.dir/build.make:88: cmTC_8e260.exe] Error 1
make[2]: Leaving directory '/home/buildbot/slave/monero-static-win32/build/build/release/CMakeFiles/CMakeTmp'
make[1]: *** [Makefile:121: cmTC_8e260/fast] Error 2
make[1]: Leaving directory '/home/buildbot/slave/monero-static-win32/build/build/release/CMakeFiles/CMakeTmp'


Determining if the function setrlimit exists failed with the following output:
Change Dir: C:/msys32/home/buildbot/slave/monero-static-win32/build/build/release/CMakeFiles/CMakeTmp

Run Build Command:"C:/msys32/usr/bin/make.exe" "cmTC_bf078/fast"
make[1]: Entering directory '/home/buildbot/slave/monero-static-win32/build/build/release/CMakeFiles/CMakeTmp'
/usr/bin/make -f CMakeFiles/cmTC_bf078.dir/build.make CMakeFiles/cmTC_bf078.dir/build
make[2]: Entering directory '/home/buildbot/slave/monero-static-win32/build/build/release/CMakeFiles/CMakeTmp'
Building C object CMakeFiles/cmTC_bf078.dir/CheckFunctionExists.c.obj

/C/msys32/mingw32/bin/i686-w64-mingw32-gcc.exe   -DCHECK_FUNCTION_EXISTS=setrlimit   -o CMakeFiles/cmTC_bf078.dir/CheckFunctionExists.c.obj   -c /C/msys32/mingw32/share/cmake-3.12/Modules/CheckFunctionExists.c
Linking C executable cmTC_bf078.exe

/C/msys32/mingw32/bin/cmake.exe -E remove -f CMakeFiles/cmTC_bf078.dir/objects.a
ar cr CMakeFiles/cmTC_bf078.dir/objects.a "CMakeFiles/cmTC_bf078.dir/CheckFunctionExists.c.obj" 
/C/msys32/mingw32/bin/i686-w64-mingw32-gcc.exe  -DCHECK_FUNCTION_EXISTS=setrlimit    -Wl,--whole-archive CMakeFiles/cmTC_bf078.dir/objects.a -Wl,--no-whole-archive  -o cmTC_bf078.exe -Wl,--major-image-version,0,--minor-image-version,0 -liphlpapi -lws2_32 -lkernel32 -luser32 -lgdi32 -lwinspool -lshell32 -lole32 -loleaut32 -luuid -lcomdlg32 -ladvapi32 
CMakeFiles/cmTC_bf078.dir/objects.a(CheckFunctionExists.c.obj):CheckFunctionExists.c:(.text+0xc): undefined reference to `setrlimit'

collect2.exe: error: ld returned 1 exit status

make[2]: *** [CMakeFiles/cmTC_bf078.dir/build.make:88: cmTC_bf078.exe] Error 1
make[2]: Leaving directory '/home/buildbot/slave/monero-static-win32/build/build/release/CMakeFiles/CMakeTmp'
make[1]: *** [Makefile:121: cmTC_bf078/fast] Error 2
make[1]: Leaving directory '/home/buildbot/slave/monero-static-win32/build/build/release/CMakeFiles/CMakeTmp'


Determining if the function setsid exists failed with the following output:
Change Dir: C:/msys32/home/buildbot/slave/monero-static-win32/build/build/release/CMakeFiles/CMakeTmp

Run Build Command:"C:/msys32/usr/bin/make.exe" "cmTC_4e2d7/fast"
make[1]: Entering directory '/home/buildbot/slave/monero-static-win32/build/build/release/CMakeFiles/CMakeTmp'
/usr/bin/make -f CMakeFiles/cmTC_4e2d7.dir/build.make CMakeFiles/cmTC_4e2d7.dir/build
make[2]: Entering directory '/home/buildbot/slave/monero-static-win32/build/build/release/CMakeFiles/CMakeTmp'
Building C object CMakeFiles/cmTC_4e2d7.dir/CheckFunctionExists.c.obj

/C/msys32/mingw32/bin/i686-w64-mingw32-gcc.exe   -DCHECK_FUNCTION_EXISTS=setsid   -o CMakeFiles/cmTC_4e2d7.dir/CheckFunctionExists.c.obj   -c /C/msys32/mingw32/share/cmake-3.12/Modules/CheckFunctionExists.c
Linking C executable cmTC_4e2d7.exe

/C/msys32/mingw32/bin/cmake.exe -E remove -f CMakeFiles/cmTC_4e2d7.dir/objects.a
ar cr CMakeFiles/cmTC_4e2d7.dir/objects.a "CMakeFiles/cmTC_4e2d7.dir/CheckFunctionExists.c.obj" 
/C/msys32/mingw32/bin/i686-w64-mingw32-gcc.exe  -DCHECK_FUNCTION_EXISTS=setsid    -Wl,--whole-archive CMakeFiles/cmTC_4e2d7.dir/objects.a -Wl,--no-whole-archive  -o cmTC_4e2d7.exe -Wl,--major-image-version,0,--minor-image-version,0 -liphlpapi -lws2_32 -lkernel32 -luser32 -lgdi32 -lwinspool -lshell32 -lole32 -loleaut32 -luuid -lcomdlg32 -ladvapi32 
CMakeFiles/cmTC_4e2d7.dir/objects.a(CheckFunctionExists.c.obj):CheckFunctionExists.c:(.text+0xc): undefined reference to `setsid'

collect2.exe: error: ld returned 1 exit status

make[2]: *** [CMakeFiles/cmTC_4e2d7.dir/build.make:88: cmTC_4e2d7.exe] Error 1
make[2]: Leaving directory '/home/buildbot/slave/monero-static-win32/build/build/release/CMakeFiles/CMakeTmp'
make[1]: *** [Makefile:121: cmTC_4e2d7/fast] Error 2
make[1]: Leaving directory '/home/buildbot/slave/monero-static-win32/build/build/release/CMakeFiles/CMakeTmp'


Determining if the function setusercontent exists failed with the following output:
Change Dir: C:/msys32/home/buildbot/slave/monero-static-win32/build/build/release/CMakeFiles/CMakeTmp

Run Build Command:"C:/msys32/usr/bin/make.exe" "cmTC_b8938/fast"
make[1]: Entering directory '/home/buildbot/slave/monero-static-win32/build/build/release/CMakeFiles/CMakeTmp'
/usr/bin/make -f CMakeFiles/cmTC_b8938.dir/build.make CMakeFiles/cmTC_b8938.dir/build
make[2]: Entering directory '/home/buildbot/slave/monero-static-win32/build/build/release/CMakeFiles/CMakeTmp'
Building C object CMakeFiles/cmTC_b8938.dir/CheckFunctionExists.c.obj

/C/msys32/mingw32/bin/i686-w64-mingw32-gcc.exe   -DCHECK_FUNCTION_EXISTS=setusercontent   -o CMakeFiles/cmTC_b8938.dir/CheckFunctionExists.c.obj   -c /C/msys32/mingw32/share/cmake-3.12/Modules/CheckFunctionExists.c
Linking C executable cmTC_b8938.exe

/C/msys32/mingw32/bin/cmake.exe -E remove -f CMakeFiles/cmTC_b8938.dir/objects.a
ar cr CMakeFiles/cmTC_b8938.dir/objects.a "CMakeFiles/cmTC_b8938.dir/CheckFunctionExists.c.obj" 
/C/msys32/mingw32/bin/i686-w64-mingw32-gcc.exe  -DCHECK_FUNCTION_EXISTS=setusercontent    -Wl,--whole-archive CMakeFiles/cmTC_b8938.dir/objects.a -Wl,--no-whole-archive  -o cmTC_b8938.exe -Wl,--major-image-version,0,--minor-image-version,0 -liphlpapi -lws2_32 -lkernel32 -luser32 -lgdi32 -lwinspool -lshell32 -lole32 -loleaut32 -luuid -lcomdlg32 -ladvapi32 
CMakeFiles/cmTC_b8938.dir/objects.a(CheckFunctionExists.c.obj):CheckFunctionExists.c:(.text+0xc): undefined reference to `setusercontent'

collect2.exe: error: ld returned 1 exit status

make[2]: *** [CMakeFiles/cmTC_b8938.dir/build.make:88: cmTC_b8938.exe] Error 1
make[2]: Leaving directory '/home/buildbot/slave/monero-static-win32/build/build/release/CMakeFiles/CMakeTmp'
make[1]: *** [Makefile:121: cmTC_b8938/fast] Error 2
make[1]: Leaving directory '/home/buildbot/slave/monero-static-win32/build/build/release/CMakeFiles/CMakeTmp'


Determining if the function sigprocmask exists failed with the following output:
Change Dir: C:/msys32/home/buildbot/slave/monero-static-win32/build/build/release/CMakeFiles/CMakeTmp

Run Build Command:"C:/msys32/usr/bin/make.exe" "cmTC_d0059/fast"
make[1]: Entering directory '/home/buildbot/slave/monero-static-win32/build/build/release/CMakeFiles/CMakeTmp'
/usr/bin/make -f CMakeFiles/cmTC_d0059.dir/build.make CMakeFiles/cmTC_d0059.dir/build
make[2]: Entering directory '/home/buildbot/slave/monero-static-win32/build/build/release/CMakeFiles/CMakeTmp'
Building C object CMakeFiles/cmTC_d0059.dir/CheckFunctionExists.c.obj

/C/msys32/mingw32/bin/i686-w64-mingw32-gcc.exe   -DCHECK_FUNCTION_EXISTS=sigprocmask   -o CMakeFiles/cmTC_d0059.dir/CheckFunctionExists.c.obj   -c /C/msys32/mingw32/share/cmake-3.12/Modules/CheckFunctionExists.c
Linking C executable cmTC_d0059.exe

/C/msys32/mingw32/bin/cmake.exe -E remove -f CMakeFiles/cmTC_d0059.dir/objects.a
ar cr CMakeFiles/cmTC_d0059.dir/objects.a "CMakeFiles/cmTC_d0059.dir/CheckFunctionExists.c.obj" 
/C/msys32/mingw32/bin/i686-w64-mingw32-gcc.exe  -DCHECK_FUNCTION_EXISTS=sigprocmask    -Wl,--whole-archive CMakeFiles/cmTC_d0059.dir/objects.a -Wl,--no-whole-archive  -o cmTC_d0059.exe -Wl,--major-image-version,0,--minor-image-version,0 -liphlpapi -lws2_32 -lkernel32 -luser32 -lgdi32 -lwinspool -lshell32 -lole32 -loleaut32 -luuid -lcomdlg32 -ladvapi32 
CMakeFiles/cmTC_d0059.dir/objects.a(CheckFunctionExists.c.obj):CheckFunctionExists.c:(.text+0xc): undefined reference to `sigprocmask'

collect2.exe: error: ld returned 1 exit status

make[2]: *** [CMakeFiles/cmTC_d0059.dir/build.make:88: cmTC_d0059.exe] Error 1
make[2]: Leaving directory '/home/buildbot/slave/monero-static-win32/build/build/release/CMakeFiles/CMakeTmp'
make[1]: *** [Makefile:121: cmTC_d0059/fast] Error 2
make[1]: Leaving directory '/home/buildbot/slave/monero-static-win32/build/build/release/CMakeFiles/CMakeTmp'


Determining if the function socketpair exists failed with the following output:
Change Dir: C:/msys32/home/buildbot/slave/monero-static-win32/build/build/release/CMakeFiles/CMakeTmp


Run Build Command:"C:/msys32/usr/bin/make.exe" "cmTC_23432/fast"
make[1]: Entering directory '/home/buildbot/slave/monero-static-win32/build/build/release/CMakeFiles/CMakeTmp'
/usr/bin/make -f CMakeFiles/cmTC_23432.dir/build.make CMakeFiles/cmTC_23432.dir/build
make[2]: Entering directory '/home/buildbot/slave/monero-static-win32/build/build/release/CMakeFiles/CMakeTmp'
Building C object CMakeFiles/cmTC_23432.dir/CheckFunctionExists.c.obj

/C/msys32/mingw32/bin/i686-w64-mingw32-gcc.exe   -DCHECK_FUNCTION_EXISTS=socketpair   -o CMakeFiles/cmTC_23432.dir/CheckFunctionExists.c.obj   -c /C/msys32/mingw32/share/cmake-3.12/Modules/CheckFunctionExists.c
Linking C executable cmTC_23432.exe

/C/msys32/mingw32/bin/cmake.exe -E remove -f CMakeFiles/cmTC_23432.dir/objects.a
ar cr CMakeFiles/cmTC_23432.dir/objects.a "CMakeFiles/cmTC_23432.dir/CheckFunctionExists.c.obj" 
/C/msys32/mingw32/bin/i686-w64-mingw32-gcc.exe  -DCHECK_FUNCTION_EXISTS=socketpair    -Wl,--whole-archive CMakeFiles/cmTC_23432.dir/objects.a -Wl,--no-whole-archive  -o cmTC_23432.exe -Wl,--major-image-version,0,--minor-image-version,0 -liphlpapi -lws2_32 -lkernel32 -luser32 -lgdi32 -lwinspool -lshell32 -lole32 -loleaut32 -luuid -lcomdlg32 -ladvapi32 
CMakeFiles/cmTC_23432.dir/objects.a(CheckFunctionExists.c.obj):CheckFunctionExists.c:(.text+0xc): undefined reference to `socketpair'

collect2.exe: error: ld returned 1 exit status

make[2]: *** [CMakeFiles/cmTC_23432.dir/build.make:88: cmTC_23432.exe] Error 1
make[2]: Leaving directory '/home/buildbot/slave/monero-static-win32/build/build/release/CMakeFiles/CMakeTmp'
make[1]: *** [Makefile:121: cmTC_23432/fast] Error 2
make[1]: Leaving directory '/home/buildbot/slave/monero-static-win32/build/build/release/CMakeFiles/CMakeTmp'


Determining if the function srandom exists failed with the following output:
Change Dir: C:/msys32/home/buildbot/slave/monero-static-win32/build/build/release/CMakeFiles/CMakeTmp

Run Build Command:"C:/msys32/usr/bin/make.exe" "cmTC_43120/fast"
make[1]: Entering directory '/home/buildbot/slave/monero-static-win32/build/build/release/CMakeFiles/CMakeTmp'
/usr/bin/make -f CMakeFiles/cmTC_43120.dir/build.make CMakeFiles/cmTC_43120.dir/build
make[2]: Entering directory '/home/buildbot/slave/monero-static-win32/build/build/release/CMakeFiles/CMakeTmp'
Building C object CMakeFiles/cmTC_43120.dir/CheckFunctionExists.c.obj

/C/msys32/mingw32/bin/i686-w64-mingw32-gcc.exe   -DCHECK_FUNCTION_EXISTS=srandom   -o CMakeFiles/cmTC_43120.dir/CheckFunctionExists.c.obj   -c /C/msys32/mingw32/share/cmake-3.12/Modules/CheckFunctionExists.c
Linking C executable cmTC_43120.exe

/C/msys32/mingw32/bin/cmake.exe -E remove -f CMakeFiles/cmTC_43120.dir/objects.a
ar cr CMakeFiles/cmTC_43120.dir/objects.a "CMakeFiles/cmTC_43120.dir/CheckFunctionExists.c.obj" 
/C/msys32/mingw32/bin/i686-w64-mingw32-gcc.exe  -DCHECK_FUNCTION_EXISTS=srandom    -Wl,--whole-archive CMakeFiles/cmTC_43120.dir/objects.a -Wl,--no-whole-archive  -o cmTC_43120.exe -Wl,--major-image-version,0,--minor-image-version,0 -liphlpapi -lws2_32 -lkernel32 -luser32 -lgdi32 -lwinspool -lshell32 -lole32 -loleaut32 -luuid -lcomdlg32 -ladvapi32 
CMakeFiles/cmTC_43120.dir/objects.a(CheckFunctionExists.c.obj):CheckFunctionExists.c:(.text+0xc): undefined reference to `srandom'

collect2.exe: error: ld returned 1 exit status

make[2]: *** [CMakeFiles/cmTC_43120.dir/build.make:88: cmTC_43120.exe] Error 1
make[2]: Leaving directory '/home/buildbot/slave/monero-static-win32/build/build/release/CMakeFiles/CMakeTmp'
make[1]: *** [Makefile:121: cmTC_43120/fast] Error 2
make[1]: Leaving directory '/home/buildbot/slave/monero-static-win32/build/build/release/CMakeFiles/CMakeTmp'


Determining if the function strsep exists failed with the following output:
Change Dir: C:/msys32/home/buildbot/slave/monero-static-win32/build/build/release/CMakeFiles/CMakeTmp

Run Build Command:"C:/msys32/usr/bin/make.exe" "cmTC_ad508/fast"
make[1]: Entering directory '/home/buildbot/slave/monero-static-win32/build/build/release/CMakeFiles/CMakeTmp'
/usr/bin/make -f CMakeFiles/cmTC_ad508.dir/build.make CMakeFiles/cmTC_ad508.dir/build
make[2]: Entering directory '/home/buildbot/slave/monero-static-win32/build/build/release/CMakeFiles/CMakeTmp'
Building C object CMakeFiles/cmTC_ad508.dir/CheckFunctionExists.c.obj

/C/msys32/mingw32/bin/i686-w64-mingw32-gcc.exe   -DCHECK_FUNCTION_EXISTS=strsep   -o CMakeFiles/cmTC_ad508.dir/CheckFunctionExists.c.obj   -c /C/msys32/mingw32/share/cmake-3.12/Modules/CheckFunctionExists.c
Linking C executable cmTC_ad508.exe

/C/msys32/mingw32/bin/cmake.exe -E remove -f CMakeFiles/cmTC_ad508.dir/objects.a
ar cr CMakeFiles/cmTC_ad508.dir/objects.a "CMakeFiles/cmTC_ad508.dir/CheckFunctionExists.c.obj" 
/C/msys32/mingw32/bin/i686-w64-mingw32-gcc.exe  -DCHECK_FUNCTION_EXISTS=strsep    -Wl,--whole-archive CMakeFiles/cmTC_ad508.dir/objects.a -Wl,--no-whole-archive  -o cmTC_ad508.exe -Wl,--major-image-version,0,--minor-image-version,0 -liphlpapi -lws2_32 -lkernel32 -luser32 -lgdi32 -lwinspool -lshell32 -lole32 -loleaut32 -luuid -lcomdlg32 -ladvapi32 
CMakeFiles/cmTC_ad508.dir/objects.a(CheckFunctionExists.c.obj):CheckFunctionExists.c:(.text+0xc): undefined reference to `strsep'

collect2.exe: error: ld returned 1 exit status

make[2]: *** [CMakeFiles/cmTC_ad508.dir/build.make:88: cmTC_ad508.exe] Error 1
make[2]: Leaving directory '/home/buildbot/slave/monero-static-win32/build/build/release/CMakeFiles/CMakeTmp'
make[1]: *** [Makefile:121: cmTC_ad508/fast] Error 2
make[1]: Leaving directory '/home/buildbot/slave/monero-static-win32/build/build/release/CMakeFiles/CMakeTmp'


Determining if the function strlcat exists failed with the following output:
Change Dir: C:/msys32/home/buildbot/slave/monero-static-win32/build/build/release/CMakeFiles/CMakeTmp

Run Build Command:"C:/msys32/usr/bin/make.exe" "cmTC_7c16e/fast"
make[1]: Entering directory '/home/buildbot/slave/monero-static-win32/build/build/release/CMakeFiles/CMakeTmp'
/usr/bin/make -f CMakeFiles/cmTC_7c16e.dir/build.make CMakeFiles/cmTC_7c16e.dir/build
make[2]: Entering directory '/home/buildbot/slave/monero-static-win32/build/build/release/CMakeFiles/CMakeTmp'
Building C object CMakeFiles/cmTC_7c16e.dir/CheckFunctionExists.c.obj

/C/msys32/mingw32/bin/i686-w64-mingw32-gcc.exe   -DCHECK_FUNCTION_EXISTS=strlcat   -o CMakeFiles/cmTC_7c16e.dir/CheckFunctionExists.c.obj   -c /C/msys32/mingw32/share/cmake-3.12/Modules/CheckFunctionExists.c
Linking C executable cmTC_7c16e.exe

/C/msys32/mingw32/bin/cmake.exe -E remove -f CMakeFiles/cmTC_7c16e.dir/objects.a
ar cr CMakeFiles/cmTC_7c16e.dir/objects.a "CMakeFiles/cmTC_7c16e.dir/CheckFunctionExists.c.obj" 
/C/msys32/mingw32/bin/i686-w64-mingw32-gcc.exe  -DCHECK_FUNCTION_EXISTS=strlcat    -Wl,--whole-archive CMakeFiles/cmTC_7c16e.dir/objects.a -Wl,--no-whole-archive  -o cmTC_7c16e.exe -Wl,--major-image-version,0,--minor-image-version,0 -liphlpapi -lws2_32 -lkernel32 -luser32 -lgdi32 -lwinspool -lshell32 -lole32 -loleaut32 -luuid -lcomdlg32 -ladvapi32 
CMakeFiles/cmTC_7c16e.dir/objects.a(CheckFunctionExists.c.obj):CheckFunctionExists.c:(.text+0xc): undefined reference to `strlcat'

collect2.exe: error: ld returned 1 exit status

make[2]: *** [CMakeFiles/cmTC_7c16e.dir/build.make:88: cmTC_7c16e.exe] Error 1
make[2]: Leaving directory '/home/buildbot/slave/monero-static-win32/build/build/release/CMakeFiles/CMakeTmp'
make[1]: *** [Makefile:121: cmTC_7c16e/fast] Error 2
make[1]: Leaving directory '/home/buildbot/slave/monero-static-win32/build/build/release/CMakeFiles/CMakeTmp'


Determining if the function strlcpy exists failed with the following output:
Change Dir: C:/msys32/home/buildbot/slave/monero-static-win32/build/build/release/CMakeFiles/CMakeTmp

Run Build Command:"C:/msys32/usr/bin/make.exe" "cmTC_2c9ba/fast"
make[1]: Entering directory '/home/buildbot/slave/monero-static-win32/build/build/release/CMakeFiles/CMakeTmp'
/usr/bin/make -f CMakeFiles/cmTC_2c9ba.dir/build.make CMakeFiles/cmTC_2c9ba.dir/build
make[2]: Entering directory '/home/buildbot/slave/monero-static-win32/build/build/release/CMakeFiles/CMakeTmp'
Building C object CMakeFiles/cmTC_2c9ba.dir/CheckFunctionExists.c.obj

/C/msys32/mingw32/bin/i686-w64-mingw32-gcc.exe   -DCHECK_FUNCTION_EXISTS=strlcpy   -o CMakeFiles/cmTC_2c9ba.dir/CheckFunctionExists.c.obj   -c /C/msys32/mingw32/share/cmake-3.12/Modules/CheckFunctionExists.c
Linking C executable cmTC_2c9ba.exe

/C/msys32/mingw32/bin/cmake.exe -E remove -f CMakeFiles/cmTC_2c9ba.dir/objects.a
ar cr CMakeFiles/cmTC_2c9ba.dir/objects.a "CMakeFiles/cmTC_2c9ba.dir/CheckFunctionExists.c.obj" 
/C/msys32/mingw32/bin/i686-w64-mingw32-gcc.exe  -DCHECK_FUNCTION_EXISTS=strlcpy    -Wl,--whole-archive CMakeFiles/cmTC_2c9ba.dir/objects.a -Wl,--no-whole-archive  -o cmTC_2c9ba.exe -Wl,--major-image-version,0,--minor-image-version,0 -liphlpapi -lws2_32 -lkernel32 -luser32 -lgdi32 -lwinspool -lshell32 -lole32 -loleaut32 -luuid -lcomdlg32 -ladvapi32 
CMakeFiles/cmTC_2c9ba.dir/objects.a(CheckFunctionExists.c.obj):CheckFunctionExists.c:(.text+0xc): undefined reference to `strlcpy'

collect2.exe: error: ld returned 1 exit status

make[2]: *** [CMakeFiles/cmTC_2c9ba.dir/build.make:88: cmTC_2c9ba.exe] Error 1
make[2]: Leaving directory '/home/buildbot/slave/monero-static-win32/build/build/release/CMakeFiles/CMakeTmp'
make[1]: *** [Makefile:121: cmTC_2c9ba/fast] Error 2
make[1]: Leaving directory '/home/buildbot/slave/monero-static-win32/build/build/release/CMakeFiles/CMakeTmp'


Determining if the function strptime exists failed with the following output:
Change Dir: C:/msys32/home/buildbot/slave/monero-static-win32/build/build/release/CMakeFiles/CMakeTmp

Run Build Command:"C:/msys32/usr/bin/make.exe" "cmTC_95398/fast"
make[1]: Entering directory '/home/buildbot/slave/monero-static-win32/build/build/release/CMakeFiles/CMakeTmp'
/usr/bin/make -f CMakeFiles/cmTC_95398.dir/build.make CMakeFiles/cmTC_95398.dir/build
make[2]: Entering directory '/home/buildbot/slave/monero-static-win32/build/build/release/CMakeFiles/CMakeTmp'
Building C object CMakeFiles/cmTC_95398.dir/CheckFunctionExists.c.obj

/C/msys32/mingw32/bin/i686-w64-mingw32-gcc.exe   -DCHECK_FUNCTION_EXISTS=strptime   -o CMakeFiles/cmTC_95398.dir/CheckFunctionExists.c.obj   -c /C/msys32/mingw32/share/cmake-3.12/Modules/CheckFunctionExists.c
Linking C executable cmTC_95398.exe

/C/msys32/mingw32/bin/cmake.exe -E remove -f CMakeFiles/cmTC_95398.dir/objects.a
ar cr CMakeFiles/cmTC_95398.dir/objects.a "CMakeFiles/cmTC_95398.dir/CheckFunctionExists.c.obj" 
/C/msys32/mingw32/bin/i686-w64-mingw32-gcc.exe  -DCHECK_FUNCTION_EXISTS=strptime    -Wl,--whole-archive CMakeFiles/cmTC_95398.dir/objects.a -Wl,--no-whole-archive  -o cmTC_95398.exe -Wl,--major-image-version,0,--minor-image-version,0 -liphlpapi -lws2_32 -lkernel32 -luser32 -lgdi32 -lwinspool -lshell32 -lole32 -loleaut32 -luuid -lcomdlg32 -ladvapi32 
CMakeFiles/cmTC_95398.dir/objects.a(CheckFunctionExists.c.obj):CheckFunctionExists.c:(.text+0xc): undefined reference to `strptime'

collect2.exe: error: ld returned 1 exit status

make[2]: *** [CMakeFiles/cmTC_95398.dir/build.make:88: cmTC_95398.exe] Error 1
make[2]: Leaving directory '/home/buildbot/slave/monero-static-win32/build/build/release/CMakeFiles/CMakeTmp'
make[1]: *** [Makefile:121: cmTC_95398/fast] Error 2
make[1]: Leaving directory '/home/buildbot/slave/monero-static-win32/build/build/release/CMakeFiles/CMakeTmp'


Determining if the function writev exists failed with the following output:
Change Dir: C:/msys32/home/buildbot/slave/monero-static-win32/build/build/release/CMakeFiles/CMakeTmp

Run Build Command:"C:/msys32/usr/bin/make.exe" "cmTC_5b767/fast"
make[1]: Entering directory '/home/buildbot/slave/monero-static-win32/build/build/release/CMakeFiles/CMakeTmp'
/usr/bin/make -f CMakeFiles/cmTC_5b767.dir/build.make CMakeFiles/cmTC_5b767.dir/build
make[2]: Entering directory '/home/buildbot/slave/monero-static-win32/build/build/release/CMakeFiles/CMakeTmp'
Building C object CMakeFiles/cmTC_5b767.dir/CheckFunctionExists.c.obj

/C/msys32/mingw32/bin/i686-w64-mingw32-gcc.exe   -DCHECK_FUNCTION_EXISTS=writev   -o CMakeFiles/cmTC_5b767.dir/CheckFunctionExists.c.obj   -c /C/msys32/mingw32/share/cmake-3.12/Modules/CheckFunctionExists.c
Linking C executable cmTC_5b767.exe

/C/msys32/mingw32/bin/cmake.exe -E remove -f CMakeFiles/cmTC_5b767.dir/objects.a
ar cr CMakeFiles/cmTC_5b767.dir/objects.a "CMakeFiles/cmTC_5b767.dir/CheckFunctionExists.c.obj" 
/C/msys32/mingw32/bin/i686-w64-mingw32-gcc.exe  -DCHECK_FUNCTION_EXISTS=writev    -Wl,--whole-archive CMakeFiles/cmTC_5b767.dir/objects.a -Wl,--no-whole-archive  -o cmTC_5b767.exe -Wl,--major-image-version,0,--minor-image-version,0 -liphlpapi -lws2_32 -lkernel32 -luser32 -lgdi32 -lwinspool -lshell32 -lole32 -loleaut32 -luuid -lcomdlg32 -ladvapi32 
CMakeFiles/cmTC_5b767.dir/objects.a(CheckFunctionExists.c.obj):CheckFunctionExists.c:(.text+0xc): undefined reference to `writev'

collect2.exe: error: ld returned 1 exit status

make[2]: *** [CMakeFiles/cmTC_5b767.dir/build.make:88: cmTC_5b767.exe] Error 1
make[2]: Leaving directory '/home/buildbot/slave/monero-static-win32/build/build/release/CMakeFiles/CMakeTmp'
make[1]: *** [Makefile:121: cmTC_5b767/fast] Error 2
make[1]: Leaving directory '/home/buildbot/slave/monero-static-win32/build/build/release/CMakeFiles/CMakeTmp'


Determining size of gid_t failed with the following output:
Change Dir: C:/msys32/home/buildbot/slave/monero-static-win32/build/build/release/CMakeFiles/CMakeTmp

Run Build Command:"C:/msys32/usr/bin/make.exe" "cmTC_ab8c7/fast"
make[1]: Entering directory '/home/buildbot/slave/monero-static-win32/build/build/release/CMakeFiles/CMakeTmp'
/usr/bin/make -f CMakeFiles/cmTC_ab8c7.dir/build.make CMakeFiles/cmTC_ab8c7.dir/build
make[2]: Entering directory '/home/buildbot/slave/monero-static-win32/build/build/release/CMakeFiles/CMakeTmp'
Building C object CMakeFiles/cmTC_ab8c7.dir/gid_t.c.obj

/C/msys32/mingw32/bin/i686-w64-mingw32-gcc.exe    -o CMakeFiles/cmTC_ab8c7.dir/gid_t.c.obj   -c /C/msys32/home/buildbot/slave/monero-static-win32/build/build/release/CMakeFiles/CheckTypeSize/gid_t.c
C:/msys32/home/buildbot/slave/monero-static-win32/build/build/release/CMakeFiles/CheckTypeSize/gid_t.c:24:22: error: 'gid_t' undeclared here (not in a function); did you mean 'pid_t'?

 #define SIZE (sizeof(gid_t))

                      ^

C:/msys32/home/buildbot/slave/monero-static-win32/build/build/release/CMakeFiles/CheckTypeSize/gid_t.c:26:12: note: in expansion of macro 'SIZE'

   ('0' + ((SIZE / 10000)%10)),

            ^~~~

make[2]: *** [CMakeFiles/cmTC_ab8c7.dir/build.make:66: CMakeFiles/cmTC_ab8c7.dir/gid_t.c.obj] Error 1
make[2]: Leaving directory '/home/buildbot/slave/monero-static-win32/build/build/release/CMakeFiles/CMakeTmp'
make[1]: *** [Makefile:121: cmTC_ab8c7/fast] Error 2
make[1]: Leaving directory '/home/buildbot/slave/monero-static-win32/build/build/release/CMakeFiles/CMakeTmp'

C:/msys32/home/buildbot/slave/monero-static-win32/build/build/release/CMakeFiles/CheckTypeSize/gid_t.c:
#include <sys/types.h>
#include <stdint.h>
#include <stddef.h>
#include "sys/types.h"


#undef KEY
#if defined(__i386)
# define KEY '_','_','i','3','8','6'
#elif defined(__x86_64)
# define KEY '_','_','x','8','6','_','6','4'
#elif defined(__ppc__)
# define KEY '_','_','p','p','c','_','_'
#elif defined(__ppc64__)
# define KEY '_','_','p','p','c','6','4','_','_'
#elif defined(__aarch64__)
# define KEY '_','_','a','a','r','c','h','6','4','_','_'
#elif defined(__ARM_ARCH_7A__)
# define KEY '_','_','A','R','M','_','A','R','C','H','_','7','A','_','_'
#elif defined(__ARM_ARCH_7S__)
# define KEY '_','_','A','R','M','_','A','R','C','H','_','7','S','_','_'
#endif

#define SIZE (sizeof(gid_t))
char info_size[] =  {'I', 'N', 'F', 'O', ':', 's','i','z','e','[',
  ('0' + ((SIZE / 10000)%10)),
  ('0' + ((SIZE / 1000)%10)),
  ('0' + ((SIZE / 100)%10)),
  ('0' + ((SIZE / 10)%10)),
  ('0' +  (SIZE    % 10)),
  ']',
#ifdef KEY
  ' ','k','e','y','[', KEY, ']',
#endif
  '\0'};

#ifdef __CLASSIC_C__
int main(argc, argv) int argc; char *argv[];
#else
int main(int argc, char *argv[])
#endif
{
  int require = 0;
  require += info_size[argc];
  (void)argv;
  return require;
}


Determining size of in_addr_t failed with the following output:
Change Dir: C:/msys32/home/buildbot/slave/monero-static-win32/build/build/release/CMakeFiles/CMakeTmp

Run Build Command:"C:/msys32/usr/bin/make.exe" "cmTC_d3ea1/fast"
make[1]: Entering directory '/home/buildbot/slave/monero-static-win32/build/build/release/CMakeFiles/CMakeTmp'
/usr/bin/make -f CMakeFiles/cmTC_d3ea1.dir/build.make CMakeFiles/cmTC_d3ea1.dir/build
make[2]: Entering directory '/home/buildbot/slave/monero-static-win32/build/build/release/CMakeFiles/CMakeTmp'
Building C object CMakeFiles/cmTC_d3ea1.dir/in_addr_t.c.obj

/C/msys32/mingw32/bin/i686-w64-mingw32-gcc.exe    -o CMakeFiles/cmTC_d3ea1.dir/in_addr_t.c.obj   -c /C/msys32/home/buildbot/slave/monero-static-win32/build/build/release/CMakeFiles/CheckTypeSize/in_addr_t.c
C:/msys32/home/buildbot/slave/monero-static-win32/build/build/release/CMakeFiles/CheckTypeSize/in_addr_t.c:4:10: fatal error: netinet/in.h: No such file or directory

 #include "netinet/in.h"

          ^~~~~~~~~~~~~~

compilation terminated.

make[2]: *** [CMakeFiles/cmTC_d3ea1.dir/build.make:66: CMakeFiles/cmTC_d3ea1.dir/in_addr_t.c.obj] Error 1
make[2]: Leaving directory '/home/buildbot/slave/monero-static-win32/build/build/release/CMakeFiles/CMakeTmp'
make[1]: *** [Makefile:121: cmTC_d3ea1/fast] Error 2
make[1]: Leaving directory '/home/buildbot/slave/monero-static-win32/build/build/release/CMakeFiles/CMakeTmp'

C:/msys32/home/buildbot/slave/monero-static-win32/build/build/release/CMakeFiles/CheckTypeSize/in_addr_t.c:
#include <sys/types.h>
#include <stdint.h>
#include <stddef.h>
#include "netinet/in.h"


#undef KEY
#if defined(__i386)
# define KEY '_','_','i','3','8','6'
#elif defined(__x86_64)
# define KEY '_','_','x','8','6','_','6','4'
#elif defined(__ppc__)
# define KEY '_','_','p','p','c','_','_'
#elif defined(__ppc64__)
# define KEY '_','_','p','p','c','6','4','_','_'
#elif defined(__aarch64__)
# define KEY '_','_','a','a','r','c','h','6','4','_','_'
#elif defined(__ARM_ARCH_7A__)
# define KEY '_','_','A','R','M','_','A','R','C','H','_','7','A','_','_'
#elif defined(__ARM_ARCH_7S__)
# define KEY '_','_','A','R','M','_','A','R','C','H','_','7','S','_','_'
#endif

#define SIZE (sizeof(in_addr_t))
char info_size[] =  {'I', 'N', 'F', 'O', ':', 's','i','z','e','[',
  ('0' + ((SIZE / 10000)%10)),
  ('0' + ((SIZE / 1000)%10)),
  ('0' + ((SIZE / 100)%10)),
  ('0' + ((SIZE / 10)%10)),
  ('0' +  (SIZE    % 10)),
  ']',
#ifdef KEY
  ' ','k','e','y','[', KEY, ']',
#endif
  '\0'};

#ifdef __CLASSIC_C__
int main(argc, argv) int argc; char *argv[];
#else
int main(int argc, char *argv[])
#endif
{
  int require = 0;
  require += info_size[argc];
  (void)argv;
  return require;
}


Determining size of in_port_t failed with the following output:
Change Dir: C:/msys32/home/buildbot/slave/monero-static-win32/build/build/release/CMakeFiles/CMakeTmp

Run Build Command:"C:/msys32/usr/bin/make.exe" "cmTC_dbf83/fast"
make[1]: Entering directory '/home/buildbot/slave/monero-static-win32/build/build/release/CMakeFiles/CMakeTmp'
/usr/bin/make -f CMakeFiles/cmTC_dbf83.dir/build.make CMakeFiles/cmTC_dbf83.dir/build
make[2]: Entering directory '/home/buildbot/slave/monero-static-win32/build/build/release/CMakeFiles/CMakeTmp'
Building C object CMakeFiles/cmTC_dbf83.dir/in_port_t.c.obj

/C/msys32/mingw32/bin/i686-w64-mingw32-gcc.exe    -o CMakeFiles/cmTC_dbf83.dir/in_port_t.c.obj   -c /C/msys32/home/buildbot/slave/monero-static-win32/build/build/release/CMakeFiles/CheckTypeSize/in_port_t.c
C:/msys32/home/buildbot/slave/monero-static-win32/build/build/release/CMakeFiles/CheckTypeSize/in_port_t.c:4:10: fatal error: netinet/in.h: No such file or directory

 #include "netinet/in.h"

          ^~~~~~~~~~~~~~

compilation terminated.

make[2]: *** [CMakeFiles/cmTC_dbf83.dir/build.make:66: CMakeFiles/cmTC_dbf83.dir/in_port_t.c.obj] Error 1
make[2]: Leaving directory '/home/buildbot/slave/monero-static-win32/build/build/release/CMakeFiles/CMakeTmp'
make[1]: *** [Makefile:121: cmTC_dbf83/fast] Error 2
make[1]: Leaving directory '/home/buildbot/slave/monero-static-win32/build/build/release/CMakeFiles/CMakeTmp'

C:/msys32/home/buildbot/slave/monero-static-win32/build/build/release/CMakeFiles/CheckTypeSize/in_port_t.c:
#include <sys/types.h>
#include <stdint.h>
#include <stddef.h>
#include "netinet/in.h"


#undef KEY
#if defined(__i386)
# define KEY '_','_','i','3','8','6'
#elif defined(__x86_64)
# define KEY '_','_','x','8','6','_','6','4'
#elif defined(__ppc__)
# define KEY '_','_','p','p','c','_','_'
#elif defined(__ppc64__)
# define KEY '_','_','p','p','c','6','4','_','_'
#elif defined(__aarch64__)
# define KEY '_','_','a','a','r','c','h','6','4','_','_'
#elif defined(__ARM_ARCH_7A__)
# define KEY '_','_','A','R','M','_','A','R','C','H','_','7','A','_','_'
#elif defined(__ARM_ARCH_7S__)
# define KEY '_','_','A','R','M','_','A','R','C','H','_','7','S','_','_'
#endif

#define SIZE (sizeof(in_port_t))
char info_size[] =  {'I', 'N', 'F', 'O', ':', 's','i','z','e','[',
  ('0' + ((SIZE / 10000)%10)),
  ('0' + ((SIZE / 1000)%10)),
  ('0' + ((SIZE / 100)%10)),
  ('0' + ((SIZE / 10)%10)),
  ('0' +  (SIZE    % 10)),
  ']',
#ifdef KEY
  ' ','k','e','y','[', KEY, ']',
#endif
  '\0'};

#ifdef __CLASSIC_C__
int main(argc, argv) int argc; char *argv[];
#else
int main(int argc, char *argv[])
#endif
{
  int require = 0;
  require += info_size[argc];
  (void)argv;
  return require;
}


Determining size of rlim_t failed with the following output:
Change Dir: C:/msys32/home/buildbot/slave/monero-static-win32/build/build/release/CMakeFiles/CMakeTmp

Run Build Command:"C:/msys32/usr/bin/make.exe" "cmTC_1e2b8/fast"
make[1]: Entering directory '/home/buildbot/slave/monero-static-win32/build/build/release/CMakeFiles/CMakeTmp'
/usr/bin/make -f CMakeFiles/cmTC_1e2b8.dir/build.make CMakeFiles/cmTC_1e2b8.dir/build
make[2]: Entering directory '/home/buildbot/slave/monero-static-win32/build/build/release/CMakeFiles/CMakeTmp'
Building C object CMakeFiles/cmTC_1e2b8.dir/rlim_t.c.obj

/C/msys32/mingw32/bin/i686-w64-mingw32-gcc.exe    -o CMakeFiles/cmTC_1e2b8.dir/rlim_t.c.obj   -c /C/msys32/home/buildbot/slave/monero-static-win32/build/build/release/CMakeFiles/CheckTypeSize/rlim_t.c
C:/msys32/home/buildbot/slave/monero-static-win32/build/build/release/CMakeFiles/CheckTypeSize/rlim_t.c:4:10: fatal error: sys/resource.h: No such file or directory

 #include "sys/resource.h"

          ^~~~~~~~~~~~~~~~

compilation terminated.

make[2]: *** [CMakeFiles/cmTC_1e2b8.dir/build.make:66: CMakeFiles/cmTC_1e2b8.dir/rlim_t.c.obj] Error 1
make[2]: Leaving directory '/home/buildbot/slave/monero-static-win32/build/build/release/CMakeFiles/CMakeTmp'
make[1]: *** [Makefile:121: cmTC_1e2b8/fast] Error 2
make[1]: Leaving directory '/home/buildbot/slave/monero-static-win32/build/build/release/CMakeFiles/CMakeTmp'

C:/msys32/home/buildbot/slave/monero-static-win32/build/build/release/CMakeFiles/CheckTypeSize/rlim_t.c:
#include <sys/types.h>
#include <stdint.h>
#include <stddef.h>
#include "sys/resource.h"


#undef KEY
#if defined(__i386)
# define KEY '_','_','i','3','8','6'
#elif defined(__x86_64)
# define KEY '_','_','x','8','6','_','6','4'
#elif defined(__ppc__)
# define KEY '_','_','p','p','c','_','_'
#elif defined(__ppc64__)
# define KEY '_','_','p','p','c','6','4','_','_'
#elif defined(__aarch64__)
# define KEY '_','_','a','a','r','c','h','6','4','_','_'
#elif defined(__ARM_ARCH_7A__)
# define KEY '_','_','A','R','M','_','A','R','C','H','_','7','A','_','_'
#elif defined(__ARM_ARCH_7S__)
# define KEY '_','_','A','R','M','_','A','R','C','H','_','7','S','_','_'
#endif

#define SIZE (sizeof(rlim_t))
char info_size[] =  {'I', 'N', 'F', 'O', ':', 's','i','z','e','[',
  ('0' + ((SIZE / 10000)%10)),
  ('0' + ((SIZE / 1000)%10)),
  ('0' + ((SIZE / 100)%10)),
  ('0' + ((SIZE / 10)%10)),
  ('0' +  (SIZE    % 10)),
  ']',
#ifdef KEY
  ' ','k','e','y','[', KEY, ']',
#endif
  '\0'};

#ifdef __CLASSIC_C__
int main(argc, argv) int argc; char *argv[];
#else
int main(int argc, char *argv[])
#endif
{
  int require = 0;
  require += info_size[argc];
  (void)argv;
  return require;
}


Determining size of uid_t failed with the following output:
Change Dir: C:/msys32/home/buildbot/slave/monero-static-win32/build/build/release/CMakeFiles/CMakeTmp

Run Build Command:"C:/msys32/usr/bin/make.exe" "cmTC_54ebb/fast"
make[1]: Entering directory '/home/buildbot/slave/monero-static-win32/build/build/release/CMakeFiles/CMakeTmp'
/usr/bin/make -f CMakeFiles/cmTC_54ebb.dir/build.make CMakeFiles/cmTC_54ebb.dir/build
make[2]: Entering directory '/home/buildbot/slave/monero-static-win32/build/build/release/CMakeFiles/CMakeTmp'
Building C object CMakeFiles/cmTC_54ebb.dir/uid_t.c.obj

/C/msys32/mingw32/bin/i686-w64-mingw32-gcc.exe    -o CMakeFiles/cmTC_54ebb.dir/uid_t.c.obj   -c /C/msys32/home/buildbot/slave/monero-static-win32/build/build/release/CMakeFiles/CheckTypeSize/uid_t.c
C:/msys32/home/buildbot/slave/monero-static-win32/build/build/release/CMakeFiles/CheckTypeSize/uid_t.c:24:22: error: 'uid_t' undeclared here (not in a function); did you mean 'pid_t'?

 #define SIZE (sizeof(uid_t))

                      ^

C:/msys32/home/buildbot/slave/monero-static-win32/build/build/release/CMakeFiles/CheckTypeSize/uid_t.c:26:12: note: in expansion of macro 'SIZE'

   ('0' + ((SIZE / 10000)%10)),

            ^~~~

make[2]: *** [CMakeFiles/cmTC_54ebb.dir/build.make:66: CMakeFiles/cmTC_54ebb.dir/uid_t.c.obj] Error 1
make[2]: Leaving directory '/home/buildbot/slave/monero-static-win32/build/build/release/CMakeFiles/CMakeTmp'
make[1]: *** [Makefile:121: cmTC_54ebb/fast] Error 2
make[1]: Leaving directory '/home/buildbot/slave/monero-static-win32/build/build/release/CMakeFiles/CMakeTmp'

C:/msys32/home/buildbot/slave/monero-static-win32/build/build/release/CMakeFiles/CheckTypeSize/uid_t.c:
#include <sys/types.h>
#include <stdint.h>
#include <stddef.h>
#include "sys/types.h"


#undef KEY
#if defined(__i386)
# define KEY '_','_','i','3','8','6'
#elif defined(__x86_64)
# define KEY '_','_','x','8','6','_','6','4'
#elif defined(__ppc__)
# define KEY '_','_','p','p','c','_','_'
#elif defined(__ppc64__)
# define KEY '_','_','p','p','c','6','4','_','_'
#elif defined(__aarch64__)
# define KEY '_','_','a','a','r','c','h','6','4','_','_'
#elif defined(__ARM_ARCH_7A__)
# define KEY '_','_','A','R','M','_','A','R','C','H','_','7','A','_','_'
#elif defined(__ARM_ARCH_7S__)
# define KEY '_','_','A','R','M','_','A','R','C','H','_','7','S','_','_'
#endif

#define SIZE (sizeof(uid_t))
char info_size[] =  {'I', 'N', 'F', 'O', ':', 's','i','z','e','[',
  ('0' + ((SIZE / 10000)%10)),
  ('0' + ((SIZE / 1000)%10)),
  ('0' + ((SIZE / 100)%10)),
  ('0' + ((SIZE / 10)%10)),
  ('0' +  (SIZE    % 10)),
  ']',
#ifdef KEY
  ' ','k','e','y','[', KEY, ']',
#endif
  '\0'};

#ifdef __CLASSIC_C__
int main(argc, argv) int argc; char *argv[];
#else
int main(int argc, char *argv[])
#endif
{
  int require = 0;
  require += info_size[argc];
  (void)argv;
  return require;
}


Determining if the pthread_rwlock_t exist failed with the following output:
Change Dir: C:/msys32/home/buildbot/slave/monero-static-win32/build/build/release/CMakeFiles/CMakeTmp

Run Build Command:"C:/msys32/usr/bin/make.exe" "cmTC_8be5f/fast"
make[1]: Entering directory '/home/buildbot/slave/monero-static-win32/build/build/release/CMakeFiles/CMakeTmp'
/usr/bin/make -f CMakeFiles/cmTC_8be5f.dir/build.make CMakeFiles/cmTC_8be5f.dir/build
make[2]: Entering directory '/home/buildbot/slave/monero-static-win32/build/build/release/CMakeFiles/CMakeTmp'
Building C object CMakeFiles/cmTC_8be5f.dir/CheckSymbolExists.c.obj

/C/msys32/mingw32/bin/i686-w64-mingw32-gcc.exe    -o CMakeFiles/cmTC_8be5f.dir/CheckSymbolExists.c.obj   -c /C/msys32/home/buildbot/slave/monero-static-win32/build/build/release/CMakeFiles/CMakeTmp/CheckSymbolExists.c
C:/msys32/home/buildbot/slave/monero-static-win32/build/build/release/CMakeFiles/CMakeTmp/CheckSymbolExists.c: In function 'main':

C:/msys32/home/buildbot/slave/monero-static-win32/build/build/release/CMakeFiles/CMakeTmp/CheckSymbolExists.c:8:19: error: expected expression before 'pthread_rwlock_t'

   return ((int*)(&pthread_rwlock_t))[argc];

                   ^~~~~~~~~~~~~~~~

make[2]: *** [CMakeFiles/cmTC_8be5f.dir/build.make:66: CMakeFiles/cmTC_8be5f.dir/CheckSymbolExists.c.obj] Error 1
make[2]: Leaving directory '/home/buildbot/slave/monero-static-win32/build/build/release/CMakeFiles/CMakeTmp'
make[1]: *** [Makefile:121: cmTC_8be5f/fast] Error 2
make[1]: Leaving directory '/home/buildbot/slave/monero-static-win32/build/build/release/CMakeFiles/CMakeTmp'

File C:/msys32/home/buildbot/slave/monero-static-win32/build/build/release/CMakeFiles/CMakeTmp/CheckSymbolExists.c:
/* */
#include <pthread.h>

int main(int argc, char** argv)
{
  (void)argv;
#ifndef pthread_rwlock_t
  return ((int*)(&pthread_rwlock_t))[argc];
#else
  (void)argc;
  return 0;
#endif
}

Determining if the pthread_spinlock_t exist failed with the following output:
Change Dir: C:/msys32/home/buildbot/slave/monero-static-win32/build/build/release/CMakeFiles/CMakeTmp

Run Build Command:"C:/msys32/usr/bin/make.exe" "cmTC_a4089/fast"
make[1]: Entering directory '/home/buildbot/slave/monero-static-win32/build/build/release/CMakeFiles/CMakeTmp'
/usr/bin/make -f CMakeFiles/cmTC_a4089.dir/build.make CMakeFiles/cmTC_a4089.dir/build
make[2]: Entering directory '/home/buildbot/slave/monero-static-win32/build/build/release/CMakeFiles/CMakeTmp'
Building C object CMakeFiles/cmTC_a4089.dir/CheckSymbolExists.c.obj

/C/msys32/mingw32/bin/i686-w64-mingw32-gcc.exe    -o CMakeFiles/cmTC_a4089.dir/CheckSymbolExists.c.obj   -c /C/msys32/home/buildbot/slave/monero-static-win32/build/build/release/CMakeFiles/CMakeTmp/CheckSymbolExists.c
C:/msys32/home/buildbot/slave/monero-static-win32/build/build/release/CMakeFiles/CMakeTmp/CheckSymbolExists.c: In function 'main':

C:/msys32/home/buildbot/slave/monero-static-win32/build/build/release/CMakeFiles/CMakeTmp/CheckSymbolExists.c:8:19: error: expected expression before 'pthread_spinlock_t'

   return ((int*)(&pthread_spinlock_t))[argc];

                   ^~~~~~~~~~~~~~~~~~

make[2]: *** [CMakeFiles/cmTC_a4089.dir/build.make:66: CMakeFiles/cmTC_a4089.dir/CheckSymbolExists.c.obj] Error 1
make[2]: Leaving directory '/home/buildbot/slave/monero-static-win32/build/build/release/CMakeFiles/CMakeTmp'
make[1]: *** [Makefile:121: cmTC_a4089/fast] Error 2
make[1]: Leaving directory '/home/buildbot/slave/monero-static-win32/build/build/release/CMakeFiles/CMakeTmp'

File C:/msys32/home/buildbot/slave/monero-static-win32/build/build/release/CMakeFiles/CMakeTmp/CheckSymbolExists.c:
/* */
#include <pthread.h>

int main(int argc, char** argv)
{
  (void)argv;
#ifndef pthread_spinlock_t
  return ((int*)(&pthread_spinlock_t))[argc];
#else
  (void)argc;
  return 0;
#endif
}

Determining if the LIBRESSL_VERSION_TEXT exist failed with the following output:
Change Dir: C:/msys32/home/buildbot/slave/monero-static-win32/build/build/release/CMakeFiles/CMakeTmp

Run Build Command:"C:/msys32/usr/bin/make.exe" "cmTC_9a115/fast"
make[1]: Entering directory '/home/buildbot/slave/monero-static-win32/build/build/release/CMakeFiles/CMakeTmp'
/usr/bin/make -f CMakeFiles/cmTC_9a115.dir/build.make CMakeFiles/cmTC_9a115.dir/build
make[2]: Entering directory '/home/buildbot/slave/monero-static-win32/build/build/release/CMakeFiles/CMakeTmp'
Building C object CMakeFiles/cmTC_9a115.dir/CheckSymbolExists.c.obj

/C/msys32/mingw32/bin/i686-w64-mingw32-gcc.exe    -o CMakeFiles/cmTC_9a115.dir/CheckSymbolExists.c.obj   -c /C/msys32/home/buildbot/slave/monero-static-win32/build/build/release/CMakeFiles/CMakeTmp/CheckSymbolExists.c
C:/msys32/home/buildbot/slave/monero-static-win32/build/build/release/CMakeFiles/CMakeTmp/CheckSymbolExists.c: In function 'main':

C:/msys32/home/buildbot/slave/monero-static-win32/build/build/release/CMakeFiles/CMakeTmp/CheckSymbolExists.c:8:19: error: 'LIBRESSL_VERSION_TEXT' undeclared (first use in this function); did you mean 'OPENSSL_VERSION_TEXT'?

   return ((int*)(&LIBRESSL_VERSION_TEXT))[argc];

                   ^~~~~~~~~~~~~~~~~~~~~

                   OPENSSL_VERSION_TEXT

C:/msys32/home/buildbot/slave/monero-static-win32/build/build/release/CMakeFiles/CMakeTmp/CheckSymbolExists.c:8:19: note: each undeclared identifier is reported only once for each function it appears in

make[2]: *** [CMakeFiles/cmTC_9a115.dir/build.make:66: CMakeFiles/cmTC_9a115.dir/CheckSymbolExists.c.obj] Error 1
make[2]: Leaving directory '/home/buildbot/slave/monero-static-win32/build/build/release/CMakeFiles/CMakeTmp'
make[1]: *** [Makefile:121: cmTC_9a115/fast] Error 2
make[1]: Leaving directory '/home/buildbot/slave/monero-static-win32/build/build/release/CMakeFiles/CMakeTmp'

File C:/msys32/home/buildbot/slave/monero-static-win32/build/build/release/CMakeFiles/CMakeTmp/CheckSymbolExists.c:
/* */
#include <openssl/opensslv.h>

int main(int argc, char** argv)
{
  (void)argv;
#ifndef LIBRESSL_VERSION_TEXT
  return ((int*)(&LIBRESSL_VERSION_TEXT))[argc];
#else
  (void)argc;
  return 0;
#endif
}

Determining if the backtrace exist failed with the following output:
Change Dir: C:/msys32/home/buildbot/slave/monero-static-win32/build/build/release/CMakeFiles/CMakeTmp

Run Build Command:"C:/msys32/usr/bin/make.exe" "cmTC_43500/fast"
make[1]: Entering directory '/home/buildbot/slave/monero-static-win32/build/build/release/CMakeFiles/CMakeTmp'
/usr/bin/make -f CMakeFiles/cmTC_43500.dir/build.make CMakeFiles/cmTC_43500.dir/build
make[2]: Entering directory '/home/buildbot/slave/monero-static-win32/build/build/release/CMakeFiles/CMakeTmp'
Building C object CMakeFiles/cmTC_43500.dir/CheckSymbolExists.c.obj

/C/msys32/mingw32/bin/i686-w64-mingw32-gcc.exe    -o CMakeFiles/cmTC_43500.dir/CheckSymbolExists.c.obj   -c /C/msys32/home/buildbot/slave/monero-static-win32/build/build/release/CMakeFiles/CMakeTmp/CheckSymbolExists.c
C:/msys32/home/buildbot/slave/monero-static-win32/build/build/release/CMakeFiles/CMakeTmp/CheckSymbolExists.c:2:10: fatal error: execinfo.h: No such file or directory

 #include <execinfo.h>

          ^~~~~~~~~~~~

compilation terminated.

make[2]: *** [CMakeFiles/cmTC_43500.dir/build.make:66: CMakeFiles/cmTC_43500.dir/CheckSymbolExists.c.obj] Error 1
make[2]: Leaving directory '/home/buildbot/slave/monero-static-win32/build/build/release/CMakeFiles/CMakeTmp'
make[1]: *** [Makefile:121: cmTC_43500/fast] Error 2
make[1]: Leaving directory '/home/buildbot/slave/monero-static-win32/build/build/release/CMakeFiles/CMakeTmp'

File C:/msys32/home/buildbot/slave/monero-static-win32/build/build/release/CMakeFiles/CMakeTmp/CheckSymbolExists.c:
/* */
#include <execinfo.h>

int main(int argc, char** argv)
{
  (void)argv;
#ifndef backtrace
  return ((int*)(&backtrace))[argc];
#else
  (void)argc;
  return 0;
#endif
}

Determining if the -Wl,-z,relro linker flag is supported failed with the following output:
Change Dir: C:/msys32/home/buildbot/slave/monero-static-win32/build/build/release/CMakeFiles/CMakeTmp

Run Build Command:"C:/msys32/usr/bin/make.exe" "cmTC_a59fe/fast"
make[1]: Entering directory '/home/buildbot/slave/monero-static-win32/build/build/release/CMakeFiles/CMakeTmp'
/usr/bin/make -f CMakeFiles/cmTC_a59fe.dir/build.make CMakeFiles/cmTC_a59fe.dir/build
make[2]: Entering directory '/home/buildbot/slave/monero-static-win32/build/build/release/CMakeFiles/CMakeTmp'
Building C object CMakeFiles/cmTC_a59fe.dir/CheckLinkerFlag.c.obj

/C/msys32/mingw32/bin/i686-w64-mingw32-gcc.exe   -Wl,-z,relro    -Wl,-z,relro -o CMakeFiles/cmTC_a59fe.dir/CheckLinkerFlag.c.obj   -c /C/msys32/home/buildbot/slave/monero-static-win32/build/cmake/CheckLinkerFlag.c
Linking C executable cmTC_a59fe.exe

/C/msys32/mingw32/bin/cmake.exe -E remove -f CMakeFiles/cmTC_a59fe.dir/objects.a
ar cr CMakeFiles/cmTC_a59fe.dir/objects.a "CMakeFiles/cmTC_a59fe.dir/CheckLinkerFlag.c.obj" 
/C/msys32/mingw32/bin/i686-w64-mingw32-gcc.exe -Wl,-z,relro     -Wl,--whole-archive CMakeFiles/cmTC_a59fe.dir/objects.a -Wl,--no-whole-archive  -o cmTC_a59fe.exe -Wl,--major-image-version,0,--minor-image-version,0 -lkernel32 -luser32 -lgdi32 -lwinspool -lshell32 -lole32 -loleaut32 -luuid -lcomdlg32 -ladvapi32 
C:/msys32/mingw32/bin/../lib/gcc/i686-w64-mingw32/7.4.0/../../../../i686-w64-mingw32/bin/ld.exe: unrecognized option '-z'

C:/msys32/mingw32/bin/../lib/gcc/i686-w64-mingw32/7.4.0/../../../../i686-w64-mingw32/bin/ld.exe: use the --help option for usage information

collect2.exe: error: ld returned 1 exit status

make[2]: *** [CMakeFiles/cmTC_a59fe.dir/build.make:88: cmTC_a59fe.exe] Error 1
make[2]: Leaving directory '/home/buildbot/slave/monero-static-win32/build/build/release/CMakeFiles/CMakeTmp'
make[1]: *** [Makefile:121: cmTC_a59fe/fast] Error 2
make[1]: Leaving directory '/home/buildbot/slave/monero-static-win32/build/build/release/CMakeFiles/CMakeTmp'


Determining if the -Wl,-z,now linker flag is supported failed with the following output:
Change Dir: C:/msys32/home/buildbot/slave/monero-static-win32/build/build/release/CMakeFiles/CMakeTmp

Run Build Command:"C:/msys32/usr/bin/make.exe" "cmTC_adc1b/fast"
make[1]: Entering directory '/home/buildbot/slave/monero-static-win32/build/build/release/CMakeFiles/CMakeTmp'
/usr/bin/make -f CMakeFiles/cmTC_adc1b.dir/build.make CMakeFiles/cmTC_adc1b.dir/build
make[2]: Entering directory '/home/buildbot/slave/monero-static-win32/build/build/release/CMakeFiles/CMakeTmp'
Building C object CMakeFiles/cmTC_adc1b.dir/CheckLinkerFlag.c.obj

/C/msys32/mingw32/bin/i686-w64-mingw32-gcc.exe   -Wl,-z,now    -Wl,-z,now -o CMakeFiles/cmTC_adc1b.dir/CheckLinkerFlag.c.obj   -c /C/msys32/home/buildbot/slave/monero-static-win32/build/cmake/CheckLinkerFlag.c
Linking C executable cmTC_adc1b.exe

/C/msys32/mingw32/bin/cmake.exe -E remove -f CMakeFiles/cmTC_adc1b.dir/objects.a
ar cr CMakeFiles/cmTC_adc1b.dir/objects.a "CMakeFiles/cmTC_adc1b.dir/CheckLinkerFlag.c.obj" 
/C/msys32/mingw32/bin/i686-w64-mingw32-gcc.exe -Wl,-z,now     -Wl,--whole-archive CMakeFiles/cmTC_adc1b.dir/objects.a -Wl,--no-whole-archive  -o cmTC_adc1b.exe -Wl,--major-image-version,0,--minor-image-version,0 -lkernel32 -luser32 -lgdi32 -lwinspool -lshell32 -lole32 -loleaut32 -luuid -lcomdlg32 -ladvapi32 
C:/msys32/mingw32/bin/../lib/gcc/i686-w64-mingw32/7.4.0/../../../../i686-w64-mingw32/bin/ld.exe: unrecognized option '-z'

C:/msys32/mingw32/bin/../lib/gcc/i686-w64-mingw32/7.4.0/../../../../i686-w64-mingw32/bin/ld.exe: use the --help option for usage information

collect2.exe: error: ld returned 1 exit status

make[2]: *** [CMakeFiles/cmTC_adc1b.dir/build.make:88: cmTC_adc1b.exe] Error 1
make[2]: Leaving directory '/home/buildbot/slave/monero-static-win32/build/build/release/CMakeFiles/CMakeTmp'
make[1]: *** [Makefile:121: cmTC_adc1b/fast] Error 2
make[1]: Leaving directory '/home/buildbot/slave/monero-static-win32/build/build/release/CMakeFiles/CMakeTmp'


Determining if the -Wl,-z,noexecstack linker flag is supported failed with the following output:
Change Dir: C:/msys32/home/buildbot/slave/monero-static-win32/build/build/release/CMakeFiles/CMakeTmp

Run Build Command:"C:/msys32/usr/bin/make.exe" "cmTC_6e933/fast"
make[1]: Entering directory '/home/buildbot/slave/monero-static-win32/build/build/release/CMakeFiles/CMakeTmp'
/usr/bin/make -f CMakeFiles/cmTC_6e933.dir/build.make CMakeFiles/cmTC_6e933.dir/build
make[2]: Entering directory '/home/buildbot/slave/monero-static-win32/build/build/release/CMakeFiles/CMakeTmp'
Building C object CMakeFiles/cmTC_6e933.dir/CheckLinkerFlag.c.obj

/C/msys32/mingw32/bin/i686-w64-mingw32-gcc.exe   -Wl,-z,noexecstack    -Wl,-z,noexecstack -o CMakeFiles/cmTC_6e933.dir/CheckLinkerFlag.c.obj   -c /C/msys32/home/buildbot/slave/monero-static-win32/build/cmake/CheckLinkerFlag.c
Linking C executable cmTC_6e933.exe

/C/msys32/mingw32/bin/cmake.exe -E remove -f CMakeFiles/cmTC_6e933.dir/objects.a
ar cr CMakeFiles/cmTC_6e933.dir/objects.a "CMakeFiles/cmTC_6e933.dir/CheckLinkerFlag.c.obj" 
/C/msys32/mingw32/bin/i686-w64-mingw32-gcc.exe -Wl,-z,noexecstack     -Wl,--whole-archive CMakeFiles/cmTC_6e933.dir/objects.a -Wl,--no-whole-archive  -o cmTC_6e933.exe -Wl,--major-image-version,0,--minor-image-version,0 -lkernel32 -luser32 -lgdi32 -lwinspool -lshell32 -lole32 -loleaut32 -luuid -lcomdlg32 -ladvapi32 
C:/msys32/mingw32/bin/../lib/gcc/i686-w64-mingw32/7.4.0/../../../../i686-w64-mingw32/bin/ld.exe: unrecognized option '-z'

C:/msys32/mingw32/bin/../lib/gcc/i686-w64-mingw32/7.4.0/../../../../i686-w64-mingw32/bin/ld.exe: use the --help option for usage information

collect2.exe: error: ld returned 1 exit status

make[2]: *** [CMakeFiles/cmTC_6e933.dir/build.make:88: cmTC_6e933.exe] Error 1
make[2]: Leaving directory '/home/buildbot/slave/monero-static-win32/build/build/release/CMakeFiles/CMakeTmp'
make[1]: *** [Makefile:121: cmTC_6e933/fast] Error 2
make[1]: Leaving directory '/home/buildbot/slave/monero-static-win32/build/build/release/CMakeFiles/CMakeTmp'


Determining if the -Wl,-z,noexecheap linker flag is supported failed with the following output:
Change Dir: C:/msys32/home/buildbot/slave/monero-static-win32/build/build/release/CMakeFiles/CMakeTmp

Run Build Command:"C:/msys32/usr/bin/make.exe" "cmTC_6a275/fast"
make[1]: Entering directory '/home/buildbot/slave/monero-static-win32/build/build/release/CMakeFiles/CMakeTmp'
/usr/bin/make -f CMakeFiles/cmTC_6a275.dir/build.make CMakeFiles/cmTC_6a275.dir/build
make[2]: Entering directory '/home/buildbot/slave/monero-static-win32/build/build/release/CMakeFiles/CMakeTmp'
Building C object CMakeFiles/cmTC_6a275.dir/CheckLinkerFlag.c.obj

/C/msys32/mingw32/bin/i686-w64-mingw32-gcc.exe   -Wl,-z,noexecheap    -Wl,-z,noexecheap -o CMakeFiles/cmTC_6a275.dir/CheckLinkerFlag.c.obj   -c /C/msys32/home/buildbot/slave/monero-static-win32/build/cmake/CheckLinkerFlag.c
Linking C executable cmTC_6a275.exe

/C/msys32/mingw32/bin/cmake.exe -E remove -f CMakeFiles/cmTC_6a275.dir/objects.a
ar cr CMakeFiles/cmTC_6a275.dir/objects.a "CMakeFiles/cmTC_6a275.dir/CheckLinkerFlag.c.obj" 
/C/msys32/mingw32/bin/i686-w64-mingw32-gcc.exe -Wl,-z,noexecheap     -Wl,--whole-archive CMakeFiles/cmTC_6a275.dir/objects.a -Wl,--no-whole-archive  -o cmTC_6a275.exe -Wl,--major-image-version,0,--minor-image-version,0 -lkernel32 -luser32 -lgdi32 -lwinspool -lshell32 -lole32 -loleaut32 -luuid -lcomdlg32 -ladvapi32 
C:/msys32/mingw32/bin/../lib/gcc/i686-w64-mingw32/7.4.0/../../../../i686-w64-mingw32/bin/ld.exe: unrecognized option '-z'

C:/msys32/mingw32/bin/../lib/gcc/i686-w64-mingw32/7.4.0/../../../../i686-w64-mingw32/bin/ld.exe: use the --help option for usage information

collect2.exe: error: ld returned 1 exit status

make[2]: *** [CMakeFiles/cmTC_6a275.dir/build.make:88: cmTC_6a275.exe] Error 1
make[2]: Leaving directory '/home/buildbot/slave/monero-static-win32/build/build/release/CMakeFiles/CMakeTmp'
make[1]: *** [Makefile:121: cmTC_6a275/fast] Error 2
make[1]: Leaving directory '/home/buildbot/slave/monero-static-win32/build/build/release/CMakeFiles/CMakeTmp'


Determining if the function rl_copy_text exists failed with the following output:
Change Dir: C:/msys32/home/buildbot/slave/monero-static-win32/build/build/release/CMakeFiles/CMakeTmp

Run Build Command:"C:/msys32/usr/bin/make.exe" "cmTC_f3d7a/fast"
make[1]: Entering directory '/home/buildbot/slave/monero-static-win32/build/build/release/CMakeFiles/CMakeTmp'
/usr/bin/make -f CMakeFiles/cmTC_f3d7a.dir/build.make CMakeFiles/cmTC_f3d7a.dir/build
make[2]: Entering directory '/home/buildbot/slave/monero-static-win32/build/build/release/CMakeFiles/CMakeTmp'
Building C object CMakeFiles/cmTC_f3d7a.dir/CheckFunctionExists.c.obj

/C/msys32/mingw32/bin/i686-w64-mingw32-gcc.exe   -maes -march=i686 -fno-strict-aliasing -std=c11 -D_GNU_SOURCE -m32 -DWIN32_LEAN_AND_MEAN  -Wall -Wextra -Wpointer-arith -Wundef -Wvla -Wwrite-strings -Wno-error=extra -Wno-error=deprecated-declarations -Wno-unused-parameter -Wno-unused-variable -Wno-error=unused-variable -Wno-error=undef -Wno-error=uninitialized -Wlogical-op -Wno-error=maybe-uninitialized -Wno-error=cpp -Wno-error=unused-value -Wno-error=unused-but-set-variable -Waggregate-return -Wnested-externs -Wold-style-definition -Wstrict-prototypes  -fPIC  -U_FORTIFY_SOURCE -D_FORTIFY_SOURCE=1 -Wformat -Wformat-security -mmitigate-rop -fno-strict-aliasing -DCHECK_FUNCTION_EXISTS=rl_copy_text   -o CMakeFiles/cmTC_f3d7a.dir/CheckFunctionExists.c.obj   -c /C/msys32/mingw32/share/cmake-3.12/Modules/CheckFunctionExists.c
Linking C executable cmTC_f3d7a.exe

/C/msys32/mingw32/bin/cmake.exe -E remove -f CMakeFiles/cmTC_f3d7a.dir/objects.a
ar cr CMakeFiles/cmTC_f3d7a.dir/objects.a "CMakeFiles/cmTC_f3d7a.dir/CheckFunctionExists.c.obj" 
/C/msys32/mingw32/bin/i686-w64-mingw32-gcc.exe  -maes -march=i686 -fno-strict-aliasing -std=c11 -D_GNU_SOURCE -m32 -DWIN32_LEAN_AND_MEAN  -Wall -Wextra -Wpointer-arith -Wundef -Wvla -Wwrite-strings -Wno-error=extra -Wno-error=deprecated-declarations -Wno-unused-parameter -Wno-unused-variable -Wno-error=unused-variable -Wno-error=undef -Wno-error=uninitialized -Wlogical-op -Wno-error=maybe-uninitialized -Wno-error=cpp -Wno-error=unused-value -Wno-error=unused-but-set-variable -Waggregate-return -Wnested-externs -Wold-style-definition -Wstrict-prototypes  -fPIC  -U_FORTIFY_SOURCE -D_FORTIFY_SOURCE=1 -Wformat -Wformat-security -mmitigate-rop -fno-strict-aliasing -DCHECK_FUNCTION_EXISTS=rl_copy_text    -Wl,--whole-archive CMakeFiles/cmTC_f3d7a.dir/objects.a -Wl,--no-whole-archive  -o cmTC_f3d7a.exe -Wl,--major-image-version,0,--minor-image-version,0 /C/msys32/mingw32/lib/libreadline.a -lkernel32 -luser32 -lgdi32 -lwinspool -lshell32 -lole32 -loleaut32 -luuid -lcomdlg32 -ladvapi32 
C:/msys32/mingw32/lib/libreadline.a(terminal.o):(.text+0x1a6): undefined reference to `tgetnum'

C:/msys32/mingw32/lib/libreadline.a(terminal.o):(.text+0x2df): undefined reference to `tgetnum'

C:/msys32/mingw32/lib/libreadline.a(terminal.o):(.text+0x757): undefined reference to `tgetent'

C:/msys32/mingw32/lib/libreadline.a(terminal.o):(.text+0x793): undefined reference to `tgetstr'

C:/msys32/mingw32/lib/libreadline.a(terminal.o):(.text+0x7e6): undefined reference to `tgetflag'

C:/msys32/mingw32/lib/libreadline.a(terminal.o):(.text+0x833): undefined reference to `tgetflag'

C:/msys32/mingw32/lib/libreadline.a(terminal.o):(.text+0x948): undefined reference to `tgetflag'

C:/msys32/mingw32/lib/libreadline.a(terminal.o):(.text+0xb2c): undefined reference to `tputs'

C:/msys32/mingw32/lib/libreadline.a(terminal.o):(.text+0xc17): undefined reference to `tputs'

C:/msys32/mingw32/lib/libreadline.a(terminal.o):(.text+0xc59): undefined reference to `tputs'

C:/msys32/mingw32/lib/libreadline.a(terminal.o):(.text+0xcb7): undefined reference to `tputs'

C:/msys32/mingw32/lib/libreadline.a(terminal.o):(.text+0xcf8): undefined reference to `tputs'

C:/msys32/mingw32/lib/libreadline.a(terminal.o):(.text+0xd4a): more undefined references to `tputs' follow

collect2.exe: error: ld returned 1 exit status

make[2]: *** [CMakeFiles/cmTC_f3d7a.dir/build.make:89: cmTC_f3d7a.exe] Error 1
make[2]: Leaving directory '/home/buildbot/slave/monero-static-win32/build/build/release/CMakeFiles/CMakeTmp'
make[1]: *** [Makefile:121: cmTC_f3d7a/fast] Error 2
make[1]: Leaving directory '/home/buildbot/slave/monero-static-win32/build/build/release/CMakeFiles/CMakeTmp'


Determining if the function rl_filename_completion_function exists failed with the following output:
Change Dir: C:/msys32/home/buildbot/slave/monero-static-win32/build/build/release/CMakeFiles/CMakeTmp

Run Build Command:"C:/msys32/usr/bin/make.exe" "cmTC_9821a/fast"
make[1]: Entering directory '/home/buildbot/slave/monero-static-win32/build/build/release/CMakeFiles/CMakeTmp'
/usr/bin/make -f CMakeFiles/cmTC_9821a.dir/build.make CMakeFiles/cmTC_9821a.dir/build
make[2]: Entering directory '/home/buildbot/slave/monero-static-win32/build/build/release/CMakeFiles/CMakeTmp'
Building C object CMakeFiles/cmTC_9821a.dir/CheckFunctionExists.c.obj

/C/msys32/mingw32/bin/i686-w64-mingw32-gcc.exe   -maes -march=i686 -fno-strict-aliasing -std=c11 -D_GNU_SOURCE -m32 -DWIN32_LEAN_AND_MEAN  -Wall -Wextra -Wpointer-arith -Wundef -Wvla -Wwrite-strings -Wno-error=extra -Wno-error=deprecated-declarations -Wno-unused-parameter -Wno-unused-variable -Wno-error=unused-variable -Wno-error=undef -Wno-error=uninitialized -Wlogical-op -Wno-error=maybe-uninitialized -Wno-error=cpp -Wno-error=unused-value -Wno-error=unused-but-set-variable -Waggregate-return -Wnested-externs -Wold-style-definition -Wstrict-prototypes  -fPIC  -U_FORTIFY_SOURCE -D_FORTIFY_SOURCE=1 -Wformat -Wformat-security -mmitigate-rop -fno-strict-aliasing -DCHECK_FUNCTION_EXISTS=rl_filename_completion_function   -o CMakeFiles/cmTC_9821a.dir/CheckFunctionExists.c.obj   -c /C/msys32/mingw32/share/cmake-3.12/Modules/CheckFunctionExists.c
Linking C executable cmTC_9821a.exe

/C/msys32/mingw32/bin/cmake.exe -E remove -f CMakeFiles/cmTC_9821a.dir/objects.a
ar cr CMakeFiles/cmTC_9821a.dir/objects.a "CMakeFiles/cmTC_9821a.dir/CheckFunctionExists.c.obj" 
/C/msys32/mingw32/bin/i686-w64-mingw32-gcc.exe  -maes -march=i686 -fno-strict-aliasing -std=c11 -D_GNU_SOURCE -m32 -DWIN32_LEAN_AND_MEAN  -Wall -Wextra -Wpointer-arith -Wundef -Wvla -Wwrite-strings -Wno-error=extra -Wno-error=deprecated-declarations -Wno-unused-parameter -Wno-unused-variable -Wno-error=unused-variable -Wno-error=undef -Wno-error=uninitialized -Wlogical-op -Wno-error=maybe-uninitialized -Wno-error=cpp -Wno-error=unused-value -Wno-error=unused-but-set-variable -Waggregate-return -Wnested-externs -Wold-style-definition -Wstrict-prototypes  -fPIC  -U_FORTIFY_SOURCE -D_FORTIFY_SOURCE=1 -Wformat -Wformat-security -mmitigate-rop -fno-strict-aliasing -DCHECK_FUNCTION_EXISTS=rl_filename_completion_function    -Wl,--whole-archive CMakeFiles/cmTC_9821a.dir/objects.a -Wl,--no-whole-archive  -o cmTC_9821a.exe -Wl,--major-image-version,0,--minor-image-version,0 /C/msys32/mingw32/lib/libreadline.a -lkernel32 -luser32 -lgdi32 -lwinspool -lshell32 -lole32 -loleaut32 -luuid -lcomdlg32 -ladvapi32 
C:/msys32/mingw32/lib/libreadline.a(display.o):(.text+0x99f): undefined reference to `tputs'

C:/msys32/mingw32/lib/libreadline.a(display.o):(.text+0xa9a): undefined reference to `tputs'

C:/msys32/mingw32/lib/libreadline.a(display.o):(.text+0xaec): undefined reference to `tputs'

C:/msys32/mingw32/lib/libreadline.a(display.o):(.text+0x12e4): undefined reference to `tputs'

C:/msys32/mingw32/lib/libreadline.a(display.o):(.text+0x18b3): undefined reference to `tputs'

C:/msys32/mingw32/lib/libreadline.a(display.o):(.text+0x29ad): more undefined references to `tputs' follow

C:/msys32/mingw32/lib/libreadline.a(terminal.o):(.text+0x1a6): undefined reference to `tgetnum'

C:/msys32/mingw32/lib/libreadline.a(terminal.o):(.text+0x2df): undefined reference to `tgetnum'

C:/msys32/mingw32/lib/libreadline.a(terminal.o):(.text+0x757): undefined reference to `tgetent'

C:/msys32/mingw32/lib/libreadline.a(terminal.o):(.text+0x793): undefined reference to `tgetstr'

C:/msys32/mingw32/lib/libreadline.a(terminal.o):(.text+0x7e6): undefined reference to `tgetflag'

C:/msys32/mingw32/lib/libreadline.a(terminal.o):(.text+0x833): undefined reference to `tgetflag'

C:/msys32/mingw32/lib/libreadline.a(terminal.o):(.text+0x948): undefined reference to `tgetflag'

C:/msys32/mingw32/lib/libreadline.a(terminal.o):(.text+0xb2c): undefined reference to `tputs'

C:/msys32/mingw32/lib/libreadline.a(terminal.o):(.text+0xc17): undefined reference to `tputs'

C:/msys32/mingw32/lib/libreadline.a(terminal.o):(.text+0xc59): undefined reference to `tputs'

C:/msys32/mingw32/lib/libreadline.a(terminal.o):(.text+0xcb7): undefined reference to `tputs'

C:/msys32/mingw32/lib/libreadline.a(terminal.o):(.text+0xcf8): undefined reference to `tputs'

C:/msys32/mingw32/lib/libreadline.a(terminal.o):(.text+0xd4a): more undefined references to `tputs' follow

collect2.exe: error: ld returned 1 exit status

make[2]: *** [CMakeFiles/cmTC_9821a.dir/build.make:89: cmTC_9821a.exe] Error 1
make[2]: Leaving directory '/home/buildbot/slave/monero-static-win32/build/build/release/CMakeFiles/CMakeTmp'
make[1]: *** [Makefile:121: cmTC_9821a/fast] Error 2
make[1]: Leaving directory '/home/buildbot/slave/monero-static-win32/build/build/release/CMakeFiles/CMakeTmp'