(view as text)
Determining if the function memset_s exists in the c failed with the following output:
Change Dir: C:/msys32/home/buildbot/slave/monero-static-win32/build/build/release/CMakeFiles/CMakeTmp

Run Build Command:"C:/msys32/usr/bin/make.exe" "cmTC_cdc13/fast"
make[1]: Entering directory '/home/buildbot/slave/monero-static-win32/build/build/release/CMakeFiles/CMakeTmp'
/usr/bin/make -f CMakeFiles/cmTC_cdc13.dir/build.make CMakeFiles/cmTC_cdc13.dir/build
make[2]: Entering directory '/home/buildbot/slave/monero-static-win32/build/build/release/CMakeFiles/CMakeTmp'
Building C object CMakeFiles/cmTC_cdc13.dir/CheckFunctionExists.c.obj

/C/msys32/mingw32/bin/i686-w64-mingw32-gcc.exe   -DCHECK_FUNCTION_EXISTS=memset_s   -o CMakeFiles/cmTC_cdc13.dir/CheckFunctionExists.c.obj   -c /C/msys32/mingw32/share/cmake-3.12/Modules/CheckFunctionExists.c
Linking C executable cmTC_cdc13.exe

/C/msys32/mingw32/bin/cmake.exe -E remove -f CMakeFiles/cmTC_cdc13.dir/objects.a
ar cr CMakeFiles/cmTC_cdc13.dir/objects.a "CMakeFiles/cmTC_cdc13.dir/CheckFunctionExists.c.obj" 
/C/msys32/mingw32/bin/i686-w64-mingw32-gcc.exe  -DCHECK_FUNCTION_EXISTS=memset_s    -Wl,--whole-archive CMakeFiles/cmTC_cdc13.dir/objects.a -Wl,--no-whole-archive  -o cmTC_cdc13.exe -Wl,--major-image-version,0,--minor-image-version,0  -L/C/msys32/home/buildbot/slave/monero-static-win32/build/build/release/CMakeFiles/CMakeTmp/string.h -lc -lkernel32 -luser32 -lgdi32 -lwinspool -lshell32 -lole32 -loleaut32 -luuid -lcomdlg32 -ladvapi32 
C:/msys32/mingw32/bin/../lib/gcc/i686-w64-mingw32/7.4.0/../../../../i686-w64-mingw32/bin/ld.exe: cannot find -lc

collect2.exe: error: ld returned 1 exit status

make[2]: *** [CMakeFiles/cmTC_cdc13.dir/build.make:88: cmTC_cdc13.exe] Error 1
make[2]: Leaving directory '/home/buildbot/slave/monero-static-win32/build/build/release/CMakeFiles/CMakeTmp'
make[1]: *** [Makefile:121: cmTC_cdc13/fast] Error 2
make[1]: Leaving directory '/home/buildbot/slave/monero-static-win32/build/build/release/CMakeFiles/CMakeTmp'


Determining if the function explicit_bzero exists in the c failed with the following output:
Change Dir: C:/msys32/home/buildbot/slave/monero-static-win32/build/build/release/CMakeFiles/CMakeTmp

Run Build Command:"C:/msys32/usr/bin/make.exe" "cmTC_21851/fast"
make[1]: Entering directory '/home/buildbot/slave/monero-static-win32/build/build/release/CMakeFiles/CMakeTmp'
/usr/bin/make -f CMakeFiles/cmTC_21851.dir/build.make CMakeFiles/cmTC_21851.dir/build
make[2]: Entering directory '/home/buildbot/slave/monero-static-win32/build/build/release/CMakeFiles/CMakeTmp'
Building C object CMakeFiles/cmTC_21851.dir/CheckFunctionExists.c.obj

/C/msys32/mingw32/bin/i686-w64-mingw32-gcc.exe   -DCHECK_FUNCTION_EXISTS=explicit_bzero   -o CMakeFiles/cmTC_21851.dir/CheckFunctionExists.c.obj   -c /C/msys32/mingw32/share/cmake-3.12/Modules/CheckFunctionExists.c
Linking C executable cmTC_21851.exe

/C/msys32/mingw32/bin/cmake.exe -E remove -f CMakeFiles/cmTC_21851.dir/objects.a
ar cr CMakeFiles/cmTC_21851.dir/objects.a "CMakeFiles/cmTC_21851.dir/CheckFunctionExists.c.obj" 
/C/msys32/mingw32/bin/i686-w64-mingw32-gcc.exe  -DCHECK_FUNCTION_EXISTS=explicit_bzero    -Wl,--whole-archive CMakeFiles/cmTC_21851.dir/objects.a -Wl,--no-whole-archive  -o cmTC_21851.exe -Wl,--major-image-version,0,--minor-image-version,0  -L/C/msys32/home/buildbot/slave/monero-static-win32/build/build/release/CMakeFiles/CMakeTmp/strings.h -lc -lkernel32 -luser32 -lgdi32 -lwinspool -lshell32 -lole32 -loleaut32 -luuid -lcomdlg32 -ladvapi32 
C:/msys32/mingw32/bin/../lib/gcc/i686-w64-mingw32/7.4.0/../../../../i686-w64-mingw32/bin/ld.exe: cannot find -lc

collect2.exe: error: ld returned 1 exit status

make[2]: *** [CMakeFiles/cmTC_21851.dir/build.make:88: cmTC_21851.exe] Error 1
make[2]: Leaving directory '/home/buildbot/slave/monero-static-win32/build/build/release/CMakeFiles/CMakeTmp'
make[1]: *** [Makefile:121: cmTC_21851/fast] Error 2
make[1]: Leaving directory '/home/buildbot/slave/monero-static-win32/build/build/release/CMakeFiles/CMakeTmp'


Determining if the function strptime exists failed with the following output:
Change Dir: C:/msys32/home/buildbot/slave/monero-static-win32/build/build/release/CMakeFiles/CMakeTmp

Run Build Command:"C:/msys32/usr/bin/make.exe" "cmTC_578a8/fast"
make[1]: Entering directory '/home/buildbot/slave/monero-static-win32/build/build/release/CMakeFiles/CMakeTmp'
/usr/bin/make -f CMakeFiles/cmTC_578a8.dir/build.make CMakeFiles/cmTC_578a8.dir/build
make[2]: Entering directory '/home/buildbot/slave/monero-static-win32/build/build/release/CMakeFiles/CMakeTmp'
Building C object CMakeFiles/cmTC_578a8.dir/CheckFunctionExists.c.obj

/C/msys32/mingw32/bin/i686-w64-mingw32-gcc.exe   -DCHECK_FUNCTION_EXISTS=strptime   -o CMakeFiles/cmTC_578a8.dir/CheckFunctionExists.c.obj   -c /C/msys32/mingw32/share/cmake-3.12/Modules/CheckFunctionExists.c
Linking C executable cmTC_578a8.exe

/C/msys32/mingw32/bin/cmake.exe -E remove -f CMakeFiles/cmTC_578a8.dir/objects.a
ar cr CMakeFiles/cmTC_578a8.dir/objects.a "CMakeFiles/cmTC_578a8.dir/CheckFunctionExists.c.obj" 
/C/msys32/mingw32/bin/i686-w64-mingw32-gcc.exe  -DCHECK_FUNCTION_EXISTS=strptime    -Wl,--whole-archive CMakeFiles/cmTC_578a8.dir/objects.a -Wl,--no-whole-archive  -o cmTC_578a8.exe -Wl,--major-image-version,0,--minor-image-version,0 -lkernel32 -luser32 -lgdi32 -lwinspool -lshell32 -lole32 -loleaut32 -luuid -lcomdlg32 -ladvapi32 
CMakeFiles/cmTC_578a8.dir/objects.a(CheckFunctionExists.c.obj):CheckFunctionExists.c:(.text+0xc): undefined reference to `strptime'

collect2.exe: error: ld returned 1 exit status

make[2]: *** [CMakeFiles/cmTC_578a8.dir/build.make:88: cmTC_578a8.exe] Error 1
make[2]: Leaving directory '/home/buildbot/slave/monero-static-win32/build/build/release/CMakeFiles/CMakeTmp'
make[1]: *** [Makefile:121: cmTC_578a8/fast] Error 2
make[1]: Leaving directory '/home/buildbot/slave/monero-static-win32/build/build/release/CMakeFiles/CMakeTmp'


Determining if the include file arpa/inet.h exists failed with the following output:
Change Dir: C:/msys32/home/buildbot/slave/monero-static-win32/build/build/release/CMakeFiles/CMakeTmp

Run Build Command:"C:/msys32/usr/bin/make.exe" "cmTC_14651/fast"
make[1]: Entering directory '/home/buildbot/slave/monero-static-win32/build/build/release/CMakeFiles/CMakeTmp'
/usr/bin/make -f CMakeFiles/cmTC_14651.dir/build.make CMakeFiles/cmTC_14651.dir/build
make[2]: Entering directory '/home/buildbot/slave/monero-static-win32/build/build/release/CMakeFiles/CMakeTmp'
Building C object CMakeFiles/cmTC_14651.dir/CheckIncludeFile.c.obj

/C/msys32/mingw32/bin/i686-w64-mingw32-gcc.exe    -o CMakeFiles/cmTC_14651.dir/CheckIncludeFile.c.obj   -c /C/msys32/home/buildbot/slave/monero-static-win32/build/build/release/CMakeFiles/CMakeTmp/CheckIncludeFile.c
C:/msys32/home/buildbot/slave/monero-static-win32/build/build/release/CMakeFiles/CMakeTmp/CheckIncludeFile.c:1:10: fatal error: arpa/inet.h: No such file or directory

 #include <arpa/inet.h>

          ^~~~~~~~~~~~~

compilation terminated.

make[2]: *** [CMakeFiles/cmTC_14651.dir/build.make:66: CMakeFiles/cmTC_14651.dir/CheckIncludeFile.c.obj] Error 1
make[2]: Leaving directory '/home/buildbot/slave/monero-static-win32/build/build/release/CMakeFiles/CMakeTmp'
make[1]: *** [Makefile:121: cmTC_14651/fast] Error 2
make[1]: Leaving directory '/home/buildbot/slave/monero-static-win32/build/build/release/CMakeFiles/CMakeTmp'


Determining if the include file endian.h exists failed with the following output:
Change Dir: C:/msys32/home/buildbot/slave/monero-static-win32/build/build/release/CMakeFiles/CMakeTmp

Run Build Command:"C:/msys32/usr/bin/make.exe" "cmTC_5be8a/fast"
make[1]: Entering directory '/home/buildbot/slave/monero-static-win32/build/build/release/CMakeFiles/CMakeTmp'
/usr/bin/make -f CMakeFiles/cmTC_5be8a.dir/build.make CMakeFiles/cmTC_5be8a.dir/build
make[2]: Entering directory '/home/buildbot/slave/monero-static-win32/build/build/release/CMakeFiles/CMakeTmp'
Building C object CMakeFiles/cmTC_5be8a.dir/CheckIncludeFile.c.obj

/C/msys32/mingw32/bin/i686-w64-mingw32-gcc.exe    -o CMakeFiles/cmTC_5be8a.dir/CheckIncludeFile.c.obj   -c /C/msys32/home/buildbot/slave/monero-static-win32/build/build/release/CMakeFiles/CMakeTmp/CheckIncludeFile.c
C:/msys32/home/buildbot/slave/monero-static-win32/build/build/release/CMakeFiles/CMakeTmp/CheckIncludeFile.c:1:10: fatal error: endian.h: No such file or directory

 #include <endian.h>

          ^~~~~~~~~~

compilation terminated.

make[2]: *** [CMakeFiles/cmTC_5be8a.dir/build.make:66: CMakeFiles/cmTC_5be8a.dir/CheckIncludeFile.c.obj] Error 1
make[2]: Leaving directory '/home/buildbot/slave/monero-static-win32/build/build/release/CMakeFiles/CMakeTmp'
make[1]: *** [Makefile:121: cmTC_5be8a/fast] Error 2
make[1]: Leaving directory '/home/buildbot/slave/monero-static-win32/build/build/release/CMakeFiles/CMakeTmp'


Determining if the include file dlfcn.h exists failed with the following output:
Change Dir: C:/msys32/home/buildbot/slave/monero-static-win32/build/build/release/CMakeFiles/CMakeTmp

Run Build Command:"C:/msys32/usr/bin/make.exe" "cmTC_cf3d2/fast"
make[1]: Entering directory '/home/buildbot/slave/monero-static-win32/build/build/release/CMakeFiles/CMakeTmp'
/usr/bin/make -f CMakeFiles/cmTC_cf3d2.dir/build.make CMakeFiles/cmTC_cf3d2.dir/build
make[2]: Entering directory '/home/buildbot/slave/monero-static-win32/build/build/release/CMakeFiles/CMakeTmp'
Building C object CMakeFiles/cmTC_cf3d2.dir/CheckIncludeFile.c.obj

/C/msys32/mingw32/bin/i686-w64-mingw32-gcc.exe    -o CMakeFiles/cmTC_cf3d2.dir/CheckIncludeFile.c.obj   -c /C/msys32/home/buildbot/slave/monero-static-win32/build/build/release/CMakeFiles/CMakeTmp/CheckIncludeFile.c
C:/msys32/home/buildbot/slave/monero-static-win32/build/build/release/CMakeFiles/CMakeTmp/CheckIncludeFile.c:1:10: fatal error: dlfcn.h: No such file or directory

 #include <dlfcn.h>

          ^~~~~~~~~

compilation terminated.

make[2]: *** [CMakeFiles/cmTC_cf3d2.dir/build.make:66: CMakeFiles/cmTC_cf3d2.dir/CheckIncludeFile.c.obj] Error 1
make[2]: Leaving directory '/home/buildbot/slave/monero-static-win32/build/build/release/CMakeFiles/CMakeTmp'
make[1]: *** [Makefile:121: cmTC_cf3d2/fast] Error 2
make[1]: Leaving directory '/home/buildbot/slave/monero-static-win32/build/build/release/CMakeFiles/CMakeTmp'


Determining if the include file event.h exists failed with the following output:
Change Dir: C:/msys32/home/buildbot/slave/monero-static-win32/build/build/release/CMakeFiles/CMakeTmp

Run Build Command:"C:/msys32/usr/bin/make.exe" "cmTC_7b240/fast"
make[1]: Entering directory '/home/buildbot/slave/monero-static-win32/build/build/release/CMakeFiles/CMakeTmp'
/usr/bin/make -f CMakeFiles/cmTC_7b240.dir/build.make CMakeFiles/cmTC_7b240.dir/build
make[2]: Entering directory '/home/buildbot/slave/monero-static-win32/build/build/release/CMakeFiles/CMakeTmp'
Building C object CMakeFiles/cmTC_7b240.dir/CheckIncludeFile.c.obj

/C/msys32/mingw32/bin/i686-w64-mingw32-gcc.exe    -o CMakeFiles/cmTC_7b240.dir/CheckIncludeFile.c.obj   -c /C/msys32/home/buildbot/slave/monero-static-win32/build/build/release/CMakeFiles/CMakeTmp/CheckIncludeFile.c
C:/msys32/home/buildbot/slave/monero-static-win32/build/build/release/CMakeFiles/CMakeTmp/CheckIncludeFile.c:1:10: fatal error: event.h: No such file or directory

 #include <event.h>

          ^~~~~~~~~

compilation terminated.

make[2]: *** [CMakeFiles/cmTC_7b240.dir/build.make:66: CMakeFiles/cmTC_7b240.dir/CheckIncludeFile.c.obj] Error 1
make[2]: Leaving directory '/home/buildbot/slave/monero-static-win32/build/build/release/CMakeFiles/CMakeTmp'
make[1]: *** [Makefile:121: cmTC_7b240/fast] Error 2
make[1]: Leaving directory '/home/buildbot/slave/monero-static-win32/build/build/release/CMakeFiles/CMakeTmp'


Determining if the include file glob.h exists failed with the following output:
Change Dir: C:/msys32/home/buildbot/slave/monero-static-win32/build/build/release/CMakeFiles/CMakeTmp

Run Build Command:"C:/msys32/usr/bin/make.exe" "cmTC_9cfc5/fast"
make[1]: Entering directory '/home/buildbot/slave/monero-static-win32/build/build/release/CMakeFiles/CMakeTmp'
/usr/bin/make -f CMakeFiles/cmTC_9cfc5.dir/build.make CMakeFiles/cmTC_9cfc5.dir/build
make[2]: Entering directory '/home/buildbot/slave/monero-static-win32/build/build/release/CMakeFiles/CMakeTmp'
Building C object CMakeFiles/cmTC_9cfc5.dir/CheckIncludeFile.c.obj

/C/msys32/mingw32/bin/i686-w64-mingw32-gcc.exe    -o CMakeFiles/cmTC_9cfc5.dir/CheckIncludeFile.c.obj   -c /C/msys32/home/buildbot/slave/monero-static-win32/build/build/release/CMakeFiles/CMakeTmp/CheckIncludeFile.c
C:/msys32/home/buildbot/slave/monero-static-win32/build/build/release/CMakeFiles/CMakeTmp/CheckIncludeFile.c:1:10: fatal error: glob.h: No such file or directory

 #include <glob.h>

          ^~~~~~~~

compilation terminated.

make[2]: *** [CMakeFiles/cmTC_9cfc5.dir/build.make:66: CMakeFiles/cmTC_9cfc5.dir/CheckIncludeFile.c.obj] Error 1
make[2]: Leaving directory '/home/buildbot/slave/monero-static-win32/build/build/release/CMakeFiles/CMakeTmp'
make[1]: *** [Makefile:121: cmTC_9cfc5/fast] Error 2
make[1]: Leaving directory '/home/buildbot/slave/monero-static-win32/build/build/release/CMakeFiles/CMakeTmp'


Determining if the include file grp.h exists failed with the following output:
Change Dir: C:/msys32/home/buildbot/slave/monero-static-win32/build/build/release/CMakeFiles/CMakeTmp

Run Build Command:"C:/msys32/usr/bin/make.exe" "cmTC_65632/fast"
make[1]: Entering directory '/home/buildbot/slave/monero-static-win32/build/build/release/CMakeFiles/CMakeTmp'
/usr/bin/make -f CMakeFiles/cmTC_65632.dir/build.make CMakeFiles/cmTC_65632.dir/build
make[2]: Entering directory '/home/buildbot/slave/monero-static-win32/build/build/release/CMakeFiles/CMakeTmp'
Building C object CMakeFiles/cmTC_65632.dir/CheckIncludeFile.c.obj

/C/msys32/mingw32/bin/i686-w64-mingw32-gcc.exe    -o CMakeFiles/cmTC_65632.dir/CheckIncludeFile.c.obj   -c /C/msys32/home/buildbot/slave/monero-static-win32/build/build/release/CMakeFiles/CMakeTmp/CheckIncludeFile.c
C:/msys32/home/buildbot/slave/monero-static-win32/build/build/release/CMakeFiles/CMakeTmp/CheckIncludeFile.c:1:10: fatal error: grp.h: No such file or directory

 #include <grp.h>

          ^~~~~~~

compilation terminated.

make[2]: *** [CMakeFiles/cmTC_65632.dir/build.make:66: CMakeFiles/cmTC_65632.dir/CheckIncludeFile.c.obj] Error 1
make[2]: Leaving directory '/home/buildbot/slave/monero-static-win32/build/build/release/CMakeFiles/CMakeTmp'
make[1]: *** [Makefile:121: cmTC_65632/fast] Error 2
make[1]: Leaving directory '/home/buildbot/slave/monero-static-win32/build/build/release/CMakeFiles/CMakeTmp'


Determining if the include file login_cap.h exists failed with the following output:
Change Dir: C:/msys32/home/buildbot/slave/monero-static-win32/build/build/release/CMakeFiles/CMakeTmp

Run Build Command:"C:/msys32/usr/bin/make.exe" "cmTC_93c36/fast"
make[1]: Entering directory '/home/buildbot/slave/monero-static-win32/build/build/release/CMakeFiles/CMakeTmp'
/usr/bin/make -f CMakeFiles/cmTC_93c36.dir/build.make CMakeFiles/cmTC_93c36.dir/build
make[2]: Entering directory '/home/buildbot/slave/monero-static-win32/build/build/release/CMakeFiles/CMakeTmp'
Building C object CMakeFiles/cmTC_93c36.dir/CheckIncludeFile.c.obj

/C/msys32/mingw32/bin/i686-w64-mingw32-gcc.exe    -o CMakeFiles/cmTC_93c36.dir/CheckIncludeFile.c.obj   -c /C/msys32/home/buildbot/slave/monero-static-win32/build/build/release/CMakeFiles/CMakeTmp/CheckIncludeFile.c
C:/msys32/home/buildbot/slave/monero-static-win32/build/build/release/CMakeFiles/CMakeTmp/CheckIncludeFile.c:1:10: fatal error: login_cap.h: No such file or directory

 #include <login_cap.h>

          ^~~~~~~~~~~~~

compilation terminated.

make[2]: *** [CMakeFiles/cmTC_93c36.dir/build.make:66: CMakeFiles/cmTC_93c36.dir/CheckIncludeFile.c.obj] Error 1
make[2]: Leaving directory '/home/buildbot/slave/monero-static-win32/build/build/release/CMakeFiles/CMakeTmp'
make[1]: *** [Makefile:121: cmTC_93c36/fast] Error 2
make[1]: Leaving directory '/home/buildbot/slave/monero-static-win32/build/build/release/CMakeFiles/CMakeTmp'


Determining if the include file netdb.h exists failed with the following output:
Change Dir: C:/msys32/home/buildbot/slave/monero-static-win32/build/build/release/CMakeFiles/CMakeTmp

Run Build Command:"C:/msys32/usr/bin/make.exe" "cmTC_4b8cf/fast"
make[1]: Entering directory '/home/buildbot/slave/monero-static-win32/build/build/release/CMakeFiles/CMakeTmp'
/usr/bin/make -f CMakeFiles/cmTC_4b8cf.dir/build.make CMakeFiles/cmTC_4b8cf.dir/build
make[2]: Entering directory '/home/buildbot/slave/monero-static-win32/build/build/release/CMakeFiles/CMakeTmp'
Building C object CMakeFiles/cmTC_4b8cf.dir/CheckIncludeFile.c.obj

/C/msys32/mingw32/bin/i686-w64-mingw32-gcc.exe    -o CMakeFiles/cmTC_4b8cf.dir/CheckIncludeFile.c.obj   -c /C/msys32/home/buildbot/slave/monero-static-win32/build/build/release/CMakeFiles/CMakeTmp/CheckIncludeFile.c
C:/msys32/home/buildbot/slave/monero-static-win32/build/build/release/CMakeFiles/CMakeTmp/CheckIncludeFile.c:1:10: fatal error: netdb.h: No such file or directory

 #include <netdb.h>

          ^~~~~~~~~

compilation terminated.

make[2]: *** [CMakeFiles/cmTC_4b8cf.dir/build.make:66: CMakeFiles/cmTC_4b8cf.dir/CheckIncludeFile.c.obj] Error 1
make[2]: Leaving directory '/home/buildbot/slave/monero-static-win32/build/build/release/CMakeFiles/CMakeTmp'
make[1]: *** [Makefile:121: cmTC_4b8cf/fast] Error 2
make[1]: Leaving directory '/home/buildbot/slave/monero-static-win32/build/build/release/CMakeFiles/CMakeTmp'


Determining if the include file netinet/in.h exists failed with the following output:
Change Dir: C:/msys32/home/buildbot/slave/monero-static-win32/build/build/release/CMakeFiles/CMakeTmp

Run Build Command:"C:/msys32/usr/bin/make.exe" "cmTC_2c836/fast"
make[1]: Entering directory '/home/buildbot/slave/monero-static-win32/build/build/release/CMakeFiles/CMakeTmp'
/usr/bin/make -f CMakeFiles/cmTC_2c836.dir/build.make CMakeFiles/cmTC_2c836.dir/build
make[2]: Entering directory '/home/buildbot/slave/monero-static-win32/build/build/release/CMakeFiles/CMakeTmp'
Building C object CMakeFiles/cmTC_2c836.dir/CheckIncludeFile.c.obj

/C/msys32/mingw32/bin/i686-w64-mingw32-gcc.exe    -o CMakeFiles/cmTC_2c836.dir/CheckIncludeFile.c.obj   -c /C/msys32/home/buildbot/slave/monero-static-win32/build/build/release/CMakeFiles/CMakeTmp/CheckIncludeFile.c
C:/msys32/home/buildbot/slave/monero-static-win32/build/build/release/CMakeFiles/CMakeTmp/CheckIncludeFile.c:1:10: fatal error: netinet/in.h: No such file or directory

 #include <netinet/in.h>

          ^~~~~~~~~~~~~~

compilation terminated.

make[2]: *** [CMakeFiles/cmTC_2c836.dir/build.make:66: CMakeFiles/cmTC_2c836.dir/CheckIncludeFile.c.obj] Error 1
make[2]: Leaving directory '/home/buildbot/slave/monero-static-win32/build/build/release/CMakeFiles/CMakeTmp'
make[1]: *** [Makefile:121: cmTC_2c836/fast] Error 2
make[1]: Leaving directory '/home/buildbot/slave/monero-static-win32/build/build/release/CMakeFiles/CMakeTmp'


Determining if the include file pwd.h exists failed with the following output:
Change Dir: C:/msys32/home/buildbot/slave/monero-static-win32/build/build/release/CMakeFiles/CMakeTmp

Run Build Command:"C:/msys32/usr/bin/make.exe" "cmTC_2decb/fast"
make[1]: Entering directory '/home/buildbot/slave/monero-static-win32/build/build/release/CMakeFiles/CMakeTmp'
/usr/bin/make -f CMakeFiles/cmTC_2decb.dir/build.make CMakeFiles/cmTC_2decb.dir/build
make[2]: Entering directory '/home/buildbot/slave/monero-static-win32/build/build/release/CMakeFiles/CMakeTmp'
Building C object CMakeFiles/cmTC_2decb.dir/CheckIncludeFile.c.obj

/C/msys32/mingw32/bin/i686-w64-mingw32-gcc.exe    -o CMakeFiles/cmTC_2decb.dir/CheckIncludeFile.c.obj   -c /C/msys32/home/buildbot/slave/monero-static-win32/build/build/release/CMakeFiles/CMakeTmp/CheckIncludeFile.c
C:/msys32/home/buildbot/slave/monero-static-win32/build/build/release/CMakeFiles/CMakeTmp/CheckIncludeFile.c:1:10: fatal error: pwd.h: No such file or directory

 #include <pwd.h>

          ^~~~~~~

compilation terminated.

make[2]: *** [CMakeFiles/cmTC_2decb.dir/build.make:66: CMakeFiles/cmTC_2decb.dir/CheckIncludeFile.c.obj] Error 1
make[2]: Leaving directory '/home/buildbot/slave/monero-static-win32/build/build/release/CMakeFiles/CMakeTmp'
make[1]: *** [Makefile:121: cmTC_2decb/fast] Error 2
make[1]: Leaving directory '/home/buildbot/slave/monero-static-win32/build/build/release/CMakeFiles/CMakeTmp'


Determining if the include file sys/resource.h exists failed with the following output:
Change Dir: C:/msys32/home/buildbot/slave/monero-static-win32/build/build/release/CMakeFiles/CMakeTmp

Run Build Command:"C:/msys32/usr/bin/make.exe" "cmTC_2b847/fast"
make[1]: Entering directory '/home/buildbot/slave/monero-static-win32/build/build/release/CMakeFiles/CMakeTmp'
/usr/bin/make -f CMakeFiles/cmTC_2b847.dir/build.make CMakeFiles/cmTC_2b847.dir/build
make[2]: Entering directory '/home/buildbot/slave/monero-static-win32/build/build/release/CMakeFiles/CMakeTmp'
Building C object CMakeFiles/cmTC_2b847.dir/CheckIncludeFile.c.obj

/C/msys32/mingw32/bin/i686-w64-mingw32-gcc.exe    -o CMakeFiles/cmTC_2b847.dir/CheckIncludeFile.c.obj   -c /C/msys32/home/buildbot/slave/monero-static-win32/build/build/release/CMakeFiles/CMakeTmp/CheckIncludeFile.c
C:/msys32/home/buildbot/slave/monero-static-win32/build/build/release/CMakeFiles/CMakeTmp/CheckIncludeFile.c:1:10: fatal error: sys/resource.h: No such file or directory

 #include <sys/resource.h>

          ^~~~~~~~~~~~~~~~

compilation terminated.

make[2]: *** [CMakeFiles/cmTC_2b847.dir/build.make:66: CMakeFiles/cmTC_2b847.dir/CheckIncludeFile.c.obj] Error 1
make[2]: Leaving directory '/home/buildbot/slave/monero-static-win32/build/build/release/CMakeFiles/CMakeTmp'
make[1]: *** [Makefile:121: cmTC_2b847/fast] Error 2
make[1]: Leaving directory '/home/buildbot/slave/monero-static-win32/build/build/release/CMakeFiles/CMakeTmp'


Determining if the include file sys/sha2.h exists failed with the following output:
Change Dir: C:/msys32/home/buildbot/slave/monero-static-win32/build/build/release/CMakeFiles/CMakeTmp

Run Build Command:"C:/msys32/usr/bin/make.exe" "cmTC_cc4eb/fast"
make[1]: Entering directory '/home/buildbot/slave/monero-static-win32/build/build/release/CMakeFiles/CMakeTmp'
/usr/bin/make -f CMakeFiles/cmTC_cc4eb.dir/build.make CMakeFiles/cmTC_cc4eb.dir/build
make[2]: Entering directory '/home/buildbot/slave/monero-static-win32/build/build/release/CMakeFiles/CMakeTmp'
Building C object CMakeFiles/cmTC_cc4eb.dir/CheckIncludeFile.c.obj

/C/msys32/mingw32/bin/i686-w64-mingw32-gcc.exe    -o CMakeFiles/cmTC_cc4eb.dir/CheckIncludeFile.c.obj   -c /C/msys32/home/buildbot/slave/monero-static-win32/build/build/release/CMakeFiles/CMakeTmp/CheckIncludeFile.c
C:/msys32/home/buildbot/slave/monero-static-win32/build/build/release/CMakeFiles/CMakeTmp/CheckIncludeFile.c:1:10: fatal error: sys/sha2.h: No such file or directory

 #include <sys/sha2.h>

          ^~~~~~~~~~~~

compilation terminated.

make[2]: *** [CMakeFiles/cmTC_cc4eb.dir/build.make:66: CMakeFiles/cmTC_cc4eb.dir/CheckIncludeFile.c.obj] Error 1
make[2]: Leaving directory '/home/buildbot/slave/monero-static-win32/build/build/release/CMakeFiles/CMakeTmp'
make[1]: *** [Makefile:121: cmTC_cc4eb/fast] Error 2
make[1]: Leaving directory '/home/buildbot/slave/monero-static-win32/build/build/release/CMakeFiles/CMakeTmp'


Determining if the include file sys/socket.h exists failed with the following output:
Change Dir: C:/msys32/home/buildbot/slave/monero-static-win32/build/build/release/CMakeFiles/CMakeTmp

Run Build Command:"C:/msys32/usr/bin/make.exe" "cmTC_e51f3/fast"
make[1]: Entering directory '/home/buildbot/slave/monero-static-win32/build/build/release/CMakeFiles/CMakeTmp'
/usr/bin/make -f CMakeFiles/cmTC_e51f3.dir/build.make CMakeFiles/cmTC_e51f3.dir/build
make[2]: Entering directory '/home/buildbot/slave/monero-static-win32/build/build/release/CMakeFiles/CMakeTmp'
Building C object CMakeFiles/cmTC_e51f3.dir/CheckIncludeFile.c.obj

/C/msys32/mingw32/bin/i686-w64-mingw32-gcc.exe    -o CMakeFiles/cmTC_e51f3.dir/CheckIncludeFile.c.obj   -c /C/msys32/home/buildbot/slave/monero-static-win32/build/build/release/CMakeFiles/CMakeTmp/CheckIncludeFile.c
C:/msys32/home/buildbot/slave/monero-static-win32/build/build/release/CMakeFiles/CMakeTmp/CheckIncludeFile.c:1:10: fatal error: sys/socket.h: No such file or directory

 #include <sys/socket.h>

          ^~~~~~~~~~~~~~

compilation terminated.

make[2]: *** [CMakeFiles/cmTC_e51f3.dir/build.make:66: CMakeFiles/cmTC_e51f3.dir/CheckIncludeFile.c.obj] Error 1
make[2]: Leaving directory '/home/buildbot/slave/monero-static-win32/build/build/release/CMakeFiles/CMakeTmp'
make[1]: *** [Makefile:121: cmTC_e51f3/fast] Error 2
make[1]: Leaving directory '/home/buildbot/slave/monero-static-win32/build/build/release/CMakeFiles/CMakeTmp'


Determining if the include file sys/sysctl.h exists failed with the following output:
Change Dir: C:/msys32/home/buildbot/slave/monero-static-win32/build/build/release/CMakeFiles/CMakeTmp

Run Build Command:"C:/msys32/usr/bin/make.exe" "cmTC_f51e4/fast"
make[1]: Entering directory '/home/buildbot/slave/monero-static-win32/build/build/release/CMakeFiles/CMakeTmp'
/usr/bin/make -f CMakeFiles/cmTC_f51e4.dir/build.make CMakeFiles/cmTC_f51e4.dir/build
make[2]: Entering directory '/home/buildbot/slave/monero-static-win32/build/build/release/CMakeFiles/CMakeTmp'
Building C object CMakeFiles/cmTC_f51e4.dir/CheckIncludeFile.c.obj

/C/msys32/mingw32/bin/i686-w64-mingw32-gcc.exe    -o CMakeFiles/cmTC_f51e4.dir/CheckIncludeFile.c.obj   -c /C/msys32/home/buildbot/slave/monero-static-win32/build/build/release/CMakeFiles/CMakeTmp/CheckIncludeFile.c
C:/msys32/home/buildbot/slave/monero-static-win32/build/build/release/CMakeFiles/CMakeTmp/CheckIncludeFile.c:1:10: fatal error: sys/sysctl.h: No such file or directory

 #include <sys/sysctl.h>

          ^~~~~~~~~~~~~~

compilation terminated.

make[2]: *** [CMakeFiles/cmTC_f51e4.dir/build.make:66: CMakeFiles/cmTC_f51e4.dir/CheckIncludeFile.c.obj] Error 1
make[2]: Leaving directory '/home/buildbot/slave/monero-static-win32/build/build/release/CMakeFiles/CMakeTmp'
make[1]: *** [Makefile:121: cmTC_f51e4/fast] Error 2
make[1]: Leaving directory '/home/buildbot/slave/monero-static-win32/build/build/release/CMakeFiles/CMakeTmp'


Determining if the include file sys/uio.h exists failed with the following output:
Change Dir: C:/msys32/home/buildbot/slave/monero-static-win32/build/build/release/CMakeFiles/CMakeTmp

Run Build Command:"C:/msys32/usr/bin/make.exe" "cmTC_ccb80/fast"
make[1]: Entering directory '/home/buildbot/slave/monero-static-win32/build/build/release/CMakeFiles/CMakeTmp'
/usr/bin/make -f CMakeFiles/cmTC_ccb80.dir/build.make CMakeFiles/cmTC_ccb80.dir/build
make[2]: Entering directory '/home/buildbot/slave/monero-static-win32/build/build/release/CMakeFiles/CMakeTmp'
Building C object CMakeFiles/cmTC_ccb80.dir/CheckIncludeFile.c.obj

/C/msys32/mingw32/bin/i686-w64-mingw32-gcc.exe    -o CMakeFiles/cmTC_ccb80.dir/CheckIncludeFile.c.obj   -c /C/msys32/home/buildbot/slave/monero-static-win32/build/build/release/CMakeFiles/CMakeTmp/CheckIncludeFile.c
C:/msys32/home/buildbot/slave/monero-static-win32/build/build/release/CMakeFiles/CMakeTmp/CheckIncludeFile.c:1:10: fatal error: sys/uio.h: No such file or directory

 #include <sys/uio.h>

          ^~~~~~~~~~~

compilation terminated.

make[2]: *** [CMakeFiles/cmTC_ccb80.dir/build.make:66: CMakeFiles/cmTC_ccb80.dir/CheckIncludeFile.c.obj] Error 1
make[2]: Leaving directory '/home/buildbot/slave/monero-static-win32/build/build/release/CMakeFiles/CMakeTmp'
make[1]: *** [Makefile:121: cmTC_ccb80/fast] Error 2
make[1]: Leaving directory '/home/buildbot/slave/monero-static-win32/build/build/release/CMakeFiles/CMakeTmp'


Determining if the include file sys/un.h exists failed with the following output:
Change Dir: C:/msys32/home/buildbot/slave/monero-static-win32/build/build/release/CMakeFiles/CMakeTmp

Run Build Command:"C:/msys32/usr/bin/make.exe" "cmTC_9272f/fast"
make[1]: Entering directory '/home/buildbot/slave/monero-static-win32/build/build/release/CMakeFiles/CMakeTmp'
/usr/bin/make -f CMakeFiles/cmTC_9272f.dir/build.make CMakeFiles/cmTC_9272f.dir/build
make[2]: Entering directory '/home/buildbot/slave/monero-static-win32/build/build/release/CMakeFiles/CMakeTmp'
Building C object CMakeFiles/cmTC_9272f.dir/CheckIncludeFile.c.obj

/C/msys32/mingw32/bin/i686-w64-mingw32-gcc.exe    -o CMakeFiles/cmTC_9272f.dir/CheckIncludeFile.c.obj   -c /C/msys32/home/buildbot/slave/monero-static-win32/build/build/release/CMakeFiles/CMakeTmp/CheckIncludeFile.c
C:/msys32/home/buildbot/slave/monero-static-win32/build/build/release/CMakeFiles/CMakeTmp/CheckIncludeFile.c:1:10: fatal error: sys/un.h: No such file or directory

 #include <sys/un.h>

          ^~~~~~~~~~

compilation terminated.

make[2]: *** [CMakeFiles/cmTC_9272f.dir/build.make:66: CMakeFiles/cmTC_9272f.dir/CheckIncludeFile.c.obj] Error 1
make[2]: Leaving directory '/home/buildbot/slave/monero-static-win32/build/build/release/CMakeFiles/CMakeTmp'
make[1]: *** [Makefile:121: cmTC_9272f/fast] Error 2
make[1]: Leaving directory '/home/buildbot/slave/monero-static-win32/build/build/release/CMakeFiles/CMakeTmp'


Determining if the include file sys/wait.h exists failed with the following output:
Change Dir: C:/msys32/home/buildbot/slave/monero-static-win32/build/build/release/CMakeFiles/CMakeTmp

Run Build Command:"C:/msys32/usr/bin/make.exe" "cmTC_4191f/fast"
make[1]: Entering directory '/home/buildbot/slave/monero-static-win32/build/build/release/CMakeFiles/CMakeTmp'
/usr/bin/make -f CMakeFiles/cmTC_4191f.dir/build.make CMakeFiles/cmTC_4191f.dir/build
make[2]: Entering directory '/home/buildbot/slave/monero-static-win32/build/build/release/CMakeFiles/CMakeTmp'
Building C object CMakeFiles/cmTC_4191f.dir/CheckIncludeFile.c.obj

/C/msys32/mingw32/bin/i686-w64-mingw32-gcc.exe    -o CMakeFiles/cmTC_4191f.dir/CheckIncludeFile.c.obj   -c /C/msys32/home/buildbot/slave/monero-static-win32/build/build/release/CMakeFiles/CMakeTmp/CheckIncludeFile.c
C:/msys32/home/buildbot/slave/monero-static-win32/build/build/release/CMakeFiles/CMakeTmp/CheckIncludeFile.c:1:10: fatal error: sys/wait.h: No such file or directory

 #include <sys/wait.h>

          ^~~~~~~~~~~~

compilation terminated.

make[2]: *** [CMakeFiles/cmTC_4191f.dir/build.make:66: CMakeFiles/cmTC_4191f.dir/CheckIncludeFile.c.obj] Error 1
make[2]: Leaving directory '/home/buildbot/slave/monero-static-win32/build/build/release/CMakeFiles/CMakeTmp'
make[1]: *** [Makefile:121: cmTC_4191f/fast] Error 2
make[1]: Leaving directory '/home/buildbot/slave/monero-static-win32/build/build/release/CMakeFiles/CMakeTmp'


Determining if the include file syslog.h exists failed with the following output:
Change Dir: C:/msys32/home/buildbot/slave/monero-static-win32/build/build/release/CMakeFiles/CMakeTmp

Run Build Command:"C:/msys32/usr/bin/make.exe" "cmTC_b33ae/fast"
make[1]: Entering directory '/home/buildbot/slave/monero-static-win32/build/build/release/CMakeFiles/CMakeTmp'
/usr/bin/make -f CMakeFiles/cmTC_b33ae.dir/build.make CMakeFiles/cmTC_b33ae.dir/build
make[2]: Entering directory '/home/buildbot/slave/monero-static-win32/build/build/release/CMakeFiles/CMakeTmp'
Building C object CMakeFiles/cmTC_b33ae.dir/CheckIncludeFile.c.obj

/C/msys32/mingw32/bin/i686-w64-mingw32-gcc.exe    -o CMakeFiles/cmTC_b33ae.dir/CheckIncludeFile.c.obj   -c /C/msys32/home/buildbot/slave/monero-static-win32/build/build/release/CMakeFiles/CMakeTmp/CheckIncludeFile.c
C:/msys32/home/buildbot/slave/monero-static-win32/build/build/release/CMakeFiles/CMakeTmp/CheckIncludeFile.c:1:10: fatal error: syslog.h: No such file or directory

 #include <syslog.h>

          ^~~~~~~~~~

compilation terminated.

make[2]: *** [CMakeFiles/cmTC_b33ae.dir/build.make:66: CMakeFiles/cmTC_b33ae.dir/CheckIncludeFile.c.obj] Error 1
make[2]: Leaving directory '/home/buildbot/slave/monero-static-win32/build/build/release/CMakeFiles/CMakeTmp'
make[1]: *** [Makefile:121: cmTC_b33ae/fast] Error 2
make[1]: Leaving directory '/home/buildbot/slave/monero-static-win32/build/build/release/CMakeFiles/CMakeTmp'


Determining if the include file vfork.h exists failed with the following output:
Change Dir: C:/msys32/home/buildbot/slave/monero-static-win32/build/build/release/CMakeFiles/CMakeTmp

Run Build Command:"C:/msys32/usr/bin/make.exe" "cmTC_2d137/fast"
make[1]: Entering directory '/home/buildbot/slave/monero-static-win32/build/build/release/CMakeFiles/CMakeTmp'
/usr/bin/make -f CMakeFiles/cmTC_2d137.dir/build.make CMakeFiles/cmTC_2d137.dir/build
make[2]: Entering directory '/home/buildbot/slave/monero-static-win32/build/build/release/CMakeFiles/CMakeTmp'
Building C object CMakeFiles/cmTC_2d137.dir/CheckIncludeFile.c.obj

/C/msys32/mingw32/bin/i686-w64-mingw32-gcc.exe    -o CMakeFiles/cmTC_2d137.dir/CheckIncludeFile.c.obj   -c /C/msys32/home/buildbot/slave/monero-static-win32/build/build/release/CMakeFiles/CMakeTmp/CheckIncludeFile.c
C:/msys32/home/buildbot/slave/monero-static-win32/build/build/release/CMakeFiles/CMakeTmp/CheckIncludeFile.c:1:10: fatal error: vfork.h: No such file or directory

 #include <vfork.h>

          ^~~~~~~~~

compilation terminated.

make[2]: *** [CMakeFiles/cmTC_2d137.dir/build.make:66: CMakeFiles/cmTC_2d137.dir/CheckIncludeFile.c.obj] Error 1
make[2]: Leaving directory '/home/buildbot/slave/monero-static-win32/build/build/release/CMakeFiles/CMakeTmp'
make[1]: *** [Makefile:121: cmTC_2d137/fast] Error 2
make[1]: Leaving directory '/home/buildbot/slave/monero-static-win32/build/build/release/CMakeFiles/CMakeTmp'


Determining if the function arc4random exists failed with the following output:
Change Dir: C:/msys32/home/buildbot/slave/monero-static-win32/build/build/release/CMakeFiles/CMakeTmp

Run Build Command:"C:/msys32/usr/bin/make.exe" "cmTC_60e7a/fast"
make[1]: Entering directory '/home/buildbot/slave/monero-static-win32/build/build/release/CMakeFiles/CMakeTmp'
/usr/bin/make -f CMakeFiles/cmTC_60e7a.dir/build.make CMakeFiles/cmTC_60e7a.dir/build
make[2]: Entering directory '/home/buildbot/slave/monero-static-win32/build/build/release/CMakeFiles/CMakeTmp'
Building C object CMakeFiles/cmTC_60e7a.dir/CheckFunctionExists.c.obj

/C/msys32/mingw32/bin/i686-w64-mingw32-gcc.exe   -DCHECK_FUNCTION_EXISTS=arc4random   -o CMakeFiles/cmTC_60e7a.dir/CheckFunctionExists.c.obj   -c /C/msys32/mingw32/share/cmake-3.12/Modules/CheckFunctionExists.c
Linking C executable cmTC_60e7a.exe

/C/msys32/mingw32/bin/cmake.exe -E remove -f CMakeFiles/cmTC_60e7a.dir/objects.a
ar cr CMakeFiles/cmTC_60e7a.dir/objects.a "CMakeFiles/cmTC_60e7a.dir/CheckFunctionExists.c.obj" 
/C/msys32/mingw32/bin/i686-w64-mingw32-gcc.exe  -DCHECK_FUNCTION_EXISTS=arc4random    -Wl,--whole-archive CMakeFiles/cmTC_60e7a.dir/objects.a -Wl,--no-whole-archive  -o cmTC_60e7a.exe -Wl,--major-image-version,0,--minor-image-version,0 -liphlpapi -lws2_32 -lkernel32 -luser32 -lgdi32 -lwinspool -lshell32 -lole32 -loleaut32 -luuid -lcomdlg32 -ladvapi32 
CMakeFiles/cmTC_60e7a.dir/objects.a(CheckFunctionExists.c.obj):CheckFunctionExists.c:(.text+0xc): undefined reference to `arc4random'

collect2.exe: error: ld returned 1 exit status

make[2]: *** [CMakeFiles/cmTC_60e7a.dir/build.make:88: cmTC_60e7a.exe] Error 1
make[2]: Leaving directory '/home/buildbot/slave/monero-static-win32/build/build/release/CMakeFiles/CMakeTmp'
make[1]: *** [Makefile:121: cmTC_60e7a/fast] Error 2
make[1]: Leaving directory '/home/buildbot/slave/monero-static-win32/build/build/release/CMakeFiles/CMakeTmp'


Determining if the function arc4random_uniform exists failed with the following output:
Change Dir: C:/msys32/home/buildbot/slave/monero-static-win32/build/build/release/CMakeFiles/CMakeTmp

Run Build Command:"C:/msys32/usr/bin/make.exe" "cmTC_ab323/fast"
make[1]: Entering directory '/home/buildbot/slave/monero-static-win32/build/build/release/CMakeFiles/CMakeTmp'
/usr/bin/make -f CMakeFiles/cmTC_ab323.dir/build.make CMakeFiles/cmTC_ab323.dir/build
make[2]: Entering directory '/home/buildbot/slave/monero-static-win32/build/build/release/CMakeFiles/CMakeTmp'
Building C object CMakeFiles/cmTC_ab323.dir/CheckFunctionExists.c.obj

/C/msys32/mingw32/bin/i686-w64-mingw32-gcc.exe   -DCHECK_FUNCTION_EXISTS=arc4random_uniform   -o CMakeFiles/cmTC_ab323.dir/CheckFunctionExists.c.obj   -c /C/msys32/mingw32/share/cmake-3.12/Modules/CheckFunctionExists.c
Linking C executable cmTC_ab323.exe

/C/msys32/mingw32/bin/cmake.exe -E remove -f CMakeFiles/cmTC_ab323.dir/objects.a
ar cr CMakeFiles/cmTC_ab323.dir/objects.a "CMakeFiles/cmTC_ab323.dir/CheckFunctionExists.c.obj" 
/C/msys32/mingw32/bin/i686-w64-mingw32-gcc.exe  -DCHECK_FUNCTION_EXISTS=arc4random_uniform    -Wl,--whole-archive CMakeFiles/cmTC_ab323.dir/objects.a -Wl,--no-whole-archive  -o cmTC_ab323.exe -Wl,--major-image-version,0,--minor-image-version,0 -liphlpapi -lws2_32 -lkernel32 -luser32 -lgdi32 -lwinspool -lshell32 -lole32 -loleaut32 -luuid -lcomdlg32 -ladvapi32 
CMakeFiles/cmTC_ab323.dir/objects.a(CheckFunctionExists.c.obj):CheckFunctionExists.c:(.text+0xc): undefined reference to `arc4random_uniform'

collect2.exe: error: ld returned 1 exit status

make[2]: *** [CMakeFiles/cmTC_ab323.dir/build.make:88: cmTC_ab323.exe] Error 1
make[2]: Leaving directory '/home/buildbot/slave/monero-static-win32/build/build/release/CMakeFiles/CMakeTmp'
make[1]: *** [Makefile:121: cmTC_ab323/fast] Error 2
make[1]: Leaving directory '/home/buildbot/slave/monero-static-win32/build/build/release/CMakeFiles/CMakeTmp'


Determining if the function chown exists failed with the following output:
Change Dir: C:/msys32/home/buildbot/slave/monero-static-win32/build/build/release/CMakeFiles/CMakeTmp

Run Build Command:"C:/msys32/usr/bin/make.exe" "cmTC_03d9a/fast"
make[1]: Entering directory '/home/buildbot/slave/monero-static-win32/build/build/release/CMakeFiles/CMakeTmp'
/usr/bin/make -f CMakeFiles/cmTC_03d9a.dir/build.make CMakeFiles/cmTC_03d9a.dir/build
make[2]: Entering directory '/home/buildbot/slave/monero-static-win32/build/build/release/CMakeFiles/CMakeTmp'
Building C object CMakeFiles/cmTC_03d9a.dir/CheckFunctionExists.c.obj

/C/msys32/mingw32/bin/i686-w64-mingw32-gcc.exe   -DCHECK_FUNCTION_EXISTS=chown   -o CMakeFiles/cmTC_03d9a.dir/CheckFunctionExists.c.obj   -c /C/msys32/mingw32/share/cmake-3.12/Modules/CheckFunctionExists.c
Linking C executable cmTC_03d9a.exe

/C/msys32/mingw32/bin/cmake.exe -E remove -f CMakeFiles/cmTC_03d9a.dir/objects.a
ar cr CMakeFiles/cmTC_03d9a.dir/objects.a "CMakeFiles/cmTC_03d9a.dir/CheckFunctionExists.c.obj" 
/C/msys32/mingw32/bin/i686-w64-mingw32-gcc.exe  -DCHECK_FUNCTION_EXISTS=chown    -Wl,--whole-archive CMakeFiles/cmTC_03d9a.dir/objects.a -Wl,--no-whole-archive  -o cmTC_03d9a.exe -Wl,--major-image-version,0,--minor-image-version,0 -liphlpapi -lws2_32 -lkernel32 -luser32 -lgdi32 -lwinspool -lshell32 -lole32 -loleaut32 -luuid -lcomdlg32 -ladvapi32 
CMakeFiles/cmTC_03d9a.dir/objects.a(CheckFunctionExists.c.obj):CheckFunctionExists.c:(.text+0xc): undefined reference to `chown'

collect2.exe: error: ld returned 1 exit status

make[2]: *** [CMakeFiles/cmTC_03d9a.dir/build.make:88: cmTC_03d9a.exe] Error 1
make[2]: Leaving directory '/home/buildbot/slave/monero-static-win32/build/build/release/CMakeFiles/CMakeTmp'
make[1]: *** [Makefile:121: cmTC_03d9a/fast] Error 2
make[1]: Leaving directory '/home/buildbot/slave/monero-static-win32/build/build/release/CMakeFiles/CMakeTmp'


Determining if the function chroot exists failed with the following output:
Change Dir: C:/msys32/home/buildbot/slave/monero-static-win32/build/build/release/CMakeFiles/CMakeTmp

Run Build Command:"C:/msys32/usr/bin/make.exe" "cmTC_a2d55/fast"
make[1]: Entering directory '/home/buildbot/slave/monero-static-win32/build/build/release/CMakeFiles/CMakeTmp'
/usr/bin/make -f CMakeFiles/cmTC_a2d55.dir/build.make CMakeFiles/cmTC_a2d55.dir/build
make[2]: Entering directory '/home/buildbot/slave/monero-static-win32/build/build/release/CMakeFiles/CMakeTmp'
Building C object CMakeFiles/cmTC_a2d55.dir/CheckFunctionExists.c.obj

/C/msys32/mingw32/bin/i686-w64-mingw32-gcc.exe   -DCHECK_FUNCTION_EXISTS=chroot   -o CMakeFiles/cmTC_a2d55.dir/CheckFunctionExists.c.obj   -c /C/msys32/mingw32/share/cmake-3.12/Modules/CheckFunctionExists.c
Linking C executable cmTC_a2d55.exe

/C/msys32/mingw32/bin/cmake.exe -E remove -f CMakeFiles/cmTC_a2d55.dir/objects.a
ar cr CMakeFiles/cmTC_a2d55.dir/objects.a "CMakeFiles/cmTC_a2d55.dir/CheckFunctionExists.c.obj" 
/C/msys32/mingw32/bin/i686-w64-mingw32-gcc.exe  -DCHECK_FUNCTION_EXISTS=chroot    -Wl,--whole-archive CMakeFiles/cmTC_a2d55.dir/objects.a -Wl,--no-whole-archive  -o cmTC_a2d55.exe -Wl,--major-image-version,0,--minor-image-version,0 -liphlpapi -lws2_32 -lkernel32 -luser32 -lgdi32 -lwinspool -lshell32 -lole32 -loleaut32 -luuid -lcomdlg32 -ladvapi32 
CMakeFiles/cmTC_a2d55.dir/objects.a(CheckFunctionExists.c.obj):CheckFunctionExists.c:(.text+0xc): undefined reference to `chroot'

collect2.exe: error: ld returned 1 exit status

make[2]: *** [CMakeFiles/cmTC_a2d55.dir/build.make:88: cmTC_a2d55.exe] Error 1
make[2]: Leaving directory '/home/buildbot/slave/monero-static-win32/build/build/release/CMakeFiles/CMakeTmp'
make[1]: *** [Makefile:121: cmTC_a2d55/fast] Error 2
make[1]: Leaving directory '/home/buildbot/slave/monero-static-win32/build/build/release/CMakeFiles/CMakeTmp'


Determining if the function ctime_r exists failed with the following output:
Change Dir: C:/msys32/home/buildbot/slave/monero-static-win32/build/build/release/CMakeFiles/CMakeTmp

Run Build Command:"C:/msys32/usr/bin/make.exe" "cmTC_bf58c/fast"
make[1]: Entering directory '/home/buildbot/slave/monero-static-win32/build/build/release/CMakeFiles/CMakeTmp'
/usr/bin/make -f CMakeFiles/cmTC_bf58c.dir/build.make CMakeFiles/cmTC_bf58c.dir/build
make[2]: Entering directory '/home/buildbot/slave/monero-static-win32/build/build/release/CMakeFiles/CMakeTmp'
Building C object CMakeFiles/cmTC_bf58c.dir/CheckFunctionExists.c.obj

/C/msys32/mingw32/bin/i686-w64-mingw32-gcc.exe   -DCHECK_FUNCTION_EXISTS=ctime_r   -o CMakeFiles/cmTC_bf58c.dir/CheckFunctionExists.c.obj   -c /C/msys32/mingw32/share/cmake-3.12/Modules/CheckFunctionExists.c
Linking C executable cmTC_bf58c.exe

/C/msys32/mingw32/bin/cmake.exe -E remove -f CMakeFiles/cmTC_bf58c.dir/objects.a
ar cr CMakeFiles/cmTC_bf58c.dir/objects.a "CMakeFiles/cmTC_bf58c.dir/CheckFunctionExists.c.obj" 
/C/msys32/mingw32/bin/i686-w64-mingw32-gcc.exe  -DCHECK_FUNCTION_EXISTS=ctime_r    -Wl,--whole-archive CMakeFiles/cmTC_bf58c.dir/objects.a -Wl,--no-whole-archive  -o cmTC_bf58c.exe -Wl,--major-image-version,0,--minor-image-version,0 -liphlpapi -lws2_32 -lkernel32 -luser32 -lgdi32 -lwinspool -lshell32 -lole32 -loleaut32 -luuid -lcomdlg32 -ladvapi32 
CMakeFiles/cmTC_bf58c.dir/objects.a(CheckFunctionExists.c.obj):CheckFunctionExists.c:(.text+0xc): undefined reference to `ctime_r'

collect2.exe: error: ld returned 1 exit status

make[2]: *** [CMakeFiles/cmTC_bf58c.dir/build.make:88: cmTC_bf58c.exe] Error 1
make[2]: Leaving directory '/home/buildbot/slave/monero-static-win32/build/build/release/CMakeFiles/CMakeTmp'
make[1]: *** [Makefile:121: cmTC_bf58c/fast] Error 2
make[1]: Leaving directory '/home/buildbot/slave/monero-static-win32/build/build/release/CMakeFiles/CMakeTmp'


Determining if the function daemon exists failed with the following output:
Change Dir: C:/msys32/home/buildbot/slave/monero-static-win32/build/build/release/CMakeFiles/CMakeTmp

Run Build Command:"C:/msys32/usr/bin/make.exe" "cmTC_acf4f/fast"
make[1]: Entering directory '/home/buildbot/slave/monero-static-win32/build/build/release/CMakeFiles/CMakeTmp'
/usr/bin/make -f CMakeFiles/cmTC_acf4f.dir/build.make CMakeFiles/cmTC_acf4f.dir/build
make[2]: Entering directory '/home/buildbot/slave/monero-static-win32/build/build/release/CMakeFiles/CMakeTmp'
Building C object CMakeFiles/cmTC_acf4f.dir/CheckFunctionExists.c.obj

/C/msys32/mingw32/bin/i686-w64-mingw32-gcc.exe   -DCHECK_FUNCTION_EXISTS=daemon   -o CMakeFiles/cmTC_acf4f.dir/CheckFunctionExists.c.obj   -c /C/msys32/mingw32/share/cmake-3.12/Modules/CheckFunctionExists.c
Linking C executable cmTC_acf4f.exe

/C/msys32/mingw32/bin/cmake.exe -E remove -f CMakeFiles/cmTC_acf4f.dir/objects.a
ar cr CMakeFiles/cmTC_acf4f.dir/objects.a "CMakeFiles/cmTC_acf4f.dir/CheckFunctionExists.c.obj" 
/C/msys32/mingw32/bin/i686-w64-mingw32-gcc.exe  -DCHECK_FUNCTION_EXISTS=daemon    -Wl,--whole-archive CMakeFiles/cmTC_acf4f.dir/objects.a -Wl,--no-whole-archive  -o cmTC_acf4f.exe -Wl,--major-image-version,0,--minor-image-version,0 -liphlpapi -lws2_32 -lkernel32 -luser32 -lgdi32 -lwinspool -lshell32 -lole32 -loleaut32 -luuid -lcomdlg32 -ladvapi32 
CMakeFiles/cmTC_acf4f.dir/objects.a(CheckFunctionExists.c.obj):CheckFunctionExists.c:(.text+0xc): undefined reference to `daemon'

collect2.exe: error: ld returned 1 exit status

make[2]: *** [CMakeFiles/cmTC_acf4f.dir/build.make:88: cmTC_acf4f.exe] Error 1
make[2]: Leaving directory '/home/buildbot/slave/monero-static-win32/build/build/release/CMakeFiles/CMakeTmp'
make[1]: *** [Makefile:121: cmTC_acf4f/fast] Error 2
make[1]: Leaving directory '/home/buildbot/slave/monero-static-win32/build/build/release/CMakeFiles/CMakeTmp'


Determining if the function endprotoent exists failed with the following output:
Change Dir: C:/msys32/home/buildbot/slave/monero-static-win32/build/build/release/CMakeFiles/CMakeTmp

Run Build Command:"C:/msys32/usr/bin/make.exe" "cmTC_0e481/fast"
make[1]: Entering directory '/home/buildbot/slave/monero-static-win32/build/build/release/CMakeFiles/CMakeTmp'
/usr/bin/make -f CMakeFiles/cmTC_0e481.dir/build.make CMakeFiles/cmTC_0e481.dir/build
make[2]: Entering directory '/home/buildbot/slave/monero-static-win32/build/build/release/CMakeFiles/CMakeTmp'
Building C object CMakeFiles/cmTC_0e481.dir/CheckFunctionExists.c.obj

/C/msys32/mingw32/bin/i686-w64-mingw32-gcc.exe   -DCHECK_FUNCTION_EXISTS=endprotoent   -o CMakeFiles/cmTC_0e481.dir/CheckFunctionExists.c.obj   -c /C/msys32/mingw32/share/cmake-3.12/Modules/CheckFunctionExists.c
Linking C executable cmTC_0e481.exe

/C/msys32/mingw32/bin/cmake.exe -E remove -f CMakeFiles/cmTC_0e481.dir/objects.a
ar cr CMakeFiles/cmTC_0e481.dir/objects.a "CMakeFiles/cmTC_0e481.dir/CheckFunctionExists.c.obj" 
/C/msys32/mingw32/bin/i686-w64-mingw32-gcc.exe  -DCHECK_FUNCTION_EXISTS=endprotoent    -Wl,--whole-archive CMakeFiles/cmTC_0e481.dir/objects.a -Wl,--no-whole-archive  -o cmTC_0e481.exe -Wl,--major-image-version,0,--minor-image-version,0 -liphlpapi -lws2_32 -lkernel32 -luser32 -lgdi32 -lwinspool -lshell32 -lole32 -loleaut32 -luuid -lcomdlg32 -ladvapi32 
CMakeFiles/cmTC_0e481.dir/objects.a(CheckFunctionExists.c.obj):CheckFunctionExists.c:(.text+0xc): undefined reference to `endprotoent'

collect2.exe: error: ld returned 1 exit status

make[2]: *** [CMakeFiles/cmTC_0e481.dir/build.make:88: cmTC_0e481.exe] Error 1
make[2]: Leaving directory '/home/buildbot/slave/monero-static-win32/build/build/release/CMakeFiles/CMakeTmp'
make[1]: *** [Makefile:121: cmTC_0e481/fast] Error 2
make[1]: Leaving directory '/home/buildbot/slave/monero-static-win32/build/build/release/CMakeFiles/CMakeTmp'


Determining if the function endservent exists failed with the following output:
Change Dir: C:/msys32/home/buildbot/slave/monero-static-win32/build/build/release/CMakeFiles/CMakeTmp

Run Build Command:"C:/msys32/usr/bin/make.exe" "cmTC_2aad4/fast"
make[1]: Entering directory '/home/buildbot/slave/monero-static-win32/build/build/release/CMakeFiles/CMakeTmp'
/usr/bin/make -f CMakeFiles/cmTC_2aad4.dir/build.make CMakeFiles/cmTC_2aad4.dir/build
make[2]: Entering directory '/home/buildbot/slave/monero-static-win32/build/build/release/CMakeFiles/CMakeTmp'
Building C object CMakeFiles/cmTC_2aad4.dir/CheckFunctionExists.c.obj

/C/msys32/mingw32/bin/i686-w64-mingw32-gcc.exe   -DCHECK_FUNCTION_EXISTS=endservent   -o CMakeFiles/cmTC_2aad4.dir/CheckFunctionExists.c.obj   -c /C/msys32/mingw32/share/cmake-3.12/Modules/CheckFunctionExists.c
Linking C executable cmTC_2aad4.exe

/C/msys32/mingw32/bin/cmake.exe -E remove -f CMakeFiles/cmTC_2aad4.dir/objects.a
ar cr CMakeFiles/cmTC_2aad4.dir/objects.a "CMakeFiles/cmTC_2aad4.dir/CheckFunctionExists.c.obj" 
/C/msys32/mingw32/bin/i686-w64-mingw32-gcc.exe  -DCHECK_FUNCTION_EXISTS=endservent    -Wl,--whole-archive CMakeFiles/cmTC_2aad4.dir/objects.a -Wl,--no-whole-archive  -o cmTC_2aad4.exe -Wl,--major-image-version,0,--minor-image-version,0 -liphlpapi -lws2_32 -lkernel32 -luser32 -lgdi32 -lwinspool -lshell32 -lole32 -loleaut32 -luuid -lcomdlg32 -ladvapi32 
CMakeFiles/cmTC_2aad4.dir/objects.a(CheckFunctionExists.c.obj):CheckFunctionExists.c:(.text+0xc): undefined reference to `endservent'

collect2.exe: error: ld returned 1 exit status

make[2]: *** [CMakeFiles/cmTC_2aad4.dir/build.make:88: cmTC_2aad4.exe] Error 1
make[2]: Leaving directory '/home/buildbot/slave/monero-static-win32/build/build/release/CMakeFiles/CMakeTmp'
make[1]: *** [Makefile:121: cmTC_2aad4/fast] Error 2
make[1]: Leaving directory '/home/buildbot/slave/monero-static-win32/build/build/release/CMakeFiles/CMakeTmp'


Determining if the function fork exists failed with the following output:
Change Dir: C:/msys32/home/buildbot/slave/monero-static-win32/build/build/release/CMakeFiles/CMakeTmp

Run Build Command:"C:/msys32/usr/bin/make.exe" "cmTC_f5749/fast"
make[1]: Entering directory '/home/buildbot/slave/monero-static-win32/build/build/release/CMakeFiles/CMakeTmp'
/usr/bin/make -f CMakeFiles/cmTC_f5749.dir/build.make CMakeFiles/cmTC_f5749.dir/build
make[2]: Entering directory '/home/buildbot/slave/monero-static-win32/build/build/release/CMakeFiles/CMakeTmp'
Building C object CMakeFiles/cmTC_f5749.dir/CheckFunctionExists.c.obj

/C/msys32/mingw32/bin/i686-w64-mingw32-gcc.exe   -DCHECK_FUNCTION_EXISTS=fork   -o CMakeFiles/cmTC_f5749.dir/CheckFunctionExists.c.obj   -c /C/msys32/mingw32/share/cmake-3.12/Modules/CheckFunctionExists.c
<command-line>:0:23: warning: conflicting types for built-in function 'fork' [-Wbuiltin-declaration-mismatch]

C:/msys32/mingw32/share/cmake-3.12/Modules/CheckFunctionExists.c:7:3: note: in expansion of macro 'CHECK_FUNCTION_EXISTS'

   CHECK_FUNCTION_EXISTS(void);

   ^~~~~~~~~~~~~~~~~~~~~

Linking C executable cmTC_f5749.exe

/C/msys32/mingw32/bin/cmake.exe -E remove -f CMakeFiles/cmTC_f5749.dir/objects.a
ar cr CMakeFiles/cmTC_f5749.dir/objects.a "CMakeFiles/cmTC_f5749.dir/CheckFunctionExists.c.obj" 
/C/msys32/mingw32/bin/i686-w64-mingw32-gcc.exe  -DCHECK_FUNCTION_EXISTS=fork    -Wl,--whole-archive CMakeFiles/cmTC_f5749.dir/objects.a -Wl,--no-whole-archive  -o cmTC_f5749.exe -Wl,--major-image-version,0,--minor-image-version,0 -liphlpapi -lws2_32 -lkernel32 -luser32 -lgdi32 -lwinspool -lshell32 -lole32 -loleaut32 -luuid -lcomdlg32 -ladvapi32 
CMakeFiles/cmTC_f5749.dir/objects.a(CheckFunctionExists.c.obj):CheckFunctionExists.c:(.text+0xc): undefined reference to `fork'

collect2.exe: error: ld returned 1 exit status

make[2]: *** [CMakeFiles/cmTC_f5749.dir/build.make:88: cmTC_f5749.exe] Error 1
make[2]: Leaving directory '/home/buildbot/slave/monero-static-win32/build/build/release/CMakeFiles/CMakeTmp'
make[1]: *** [Makefile:121: cmTC_f5749/fast] Error 2
make[1]: Leaving directory '/home/buildbot/slave/monero-static-win32/build/build/release/CMakeFiles/CMakeTmp'


Determining if the function fsync exists failed with the following output:
Change Dir: C:/msys32/home/buildbot/slave/monero-static-win32/build/build/release/CMakeFiles/CMakeTmp

Run Build Command:"C:/msys32/usr/bin/make.exe" "cmTC_40b8a/fast"
make[1]: Entering directory '/home/buildbot/slave/monero-static-win32/build/build/release/CMakeFiles/CMakeTmp'
/usr/bin/make -f CMakeFiles/cmTC_40b8a.dir/build.make CMakeFiles/cmTC_40b8a.dir/build
make[2]: Entering directory '/home/buildbot/slave/monero-static-win32/build/build/release/CMakeFiles/CMakeTmp'
Building C object CMakeFiles/cmTC_40b8a.dir/CheckFunctionExists.c.obj

/C/msys32/mingw32/bin/i686-w64-mingw32-gcc.exe   -DCHECK_FUNCTION_EXISTS=fsync   -o CMakeFiles/cmTC_40b8a.dir/CheckFunctionExists.c.obj   -c /C/msys32/mingw32/share/cmake-3.12/Modules/CheckFunctionExists.c
Linking C executable cmTC_40b8a.exe

/C/msys32/mingw32/bin/cmake.exe -E remove -f CMakeFiles/cmTC_40b8a.dir/objects.a
ar cr CMakeFiles/cmTC_40b8a.dir/objects.a "CMakeFiles/cmTC_40b8a.dir/CheckFunctionExists.c.obj" 
/C/msys32/mingw32/bin/i686-w64-mingw32-gcc.exe  -DCHECK_FUNCTION_EXISTS=fsync    -Wl,--whole-archive CMakeFiles/cmTC_40b8a.dir/objects.a -Wl,--no-whole-archive  -o cmTC_40b8a.exe -Wl,--major-image-version,0,--minor-image-version,0 -liphlpapi -lws2_32 -lkernel32 -luser32 -lgdi32 -lwinspool -lshell32 -lole32 -loleaut32 -luuid -lcomdlg32 -ladvapi32 
CMakeFiles/cmTC_40b8a.dir/objects.a(CheckFunctionExists.c.obj):CheckFunctionExists.c:(.text+0xc): undefined reference to `fsync'

collect2.exe: error: ld returned 1 exit status

make[2]: *** [CMakeFiles/cmTC_40b8a.dir/build.make:88: cmTC_40b8a.exe] Error 1
make[2]: Leaving directory '/home/buildbot/slave/monero-static-win32/build/build/release/CMakeFiles/CMakeTmp'
make[1]: *** [Makefile:121: cmTC_40b8a/fast] Error 2
make[1]: Leaving directory '/home/buildbot/slave/monero-static-win32/build/build/release/CMakeFiles/CMakeTmp'


Determining if the function getauxval exists failed with the following output:
Change Dir: C:/msys32/home/buildbot/slave/monero-static-win32/build/build/release/CMakeFiles/CMakeTmp

Run Build Command:"C:/msys32/usr/bin/make.exe" "cmTC_f1f1c/fast"
make[1]: Entering directory '/home/buildbot/slave/monero-static-win32/build/build/release/CMakeFiles/CMakeTmp'
/usr/bin/make -f CMakeFiles/cmTC_f1f1c.dir/build.make CMakeFiles/cmTC_f1f1c.dir/build
make[2]: Entering directory '/home/buildbot/slave/monero-static-win32/build/build/release/CMakeFiles/CMakeTmp'
Building C object CMakeFiles/cmTC_f1f1c.dir/CheckFunctionExists.c.obj

/C/msys32/mingw32/bin/i686-w64-mingw32-gcc.exe   -DCHECK_FUNCTION_EXISTS=getauxval   -o CMakeFiles/cmTC_f1f1c.dir/CheckFunctionExists.c.obj   -c /C/msys32/mingw32/share/cmake-3.12/Modules/CheckFunctionExists.c
Linking C executable cmTC_f1f1c.exe

/C/msys32/mingw32/bin/cmake.exe -E remove -f CMakeFiles/cmTC_f1f1c.dir/objects.a
ar cr CMakeFiles/cmTC_f1f1c.dir/objects.a "CMakeFiles/cmTC_f1f1c.dir/CheckFunctionExists.c.obj" 
/C/msys32/mingw32/bin/i686-w64-mingw32-gcc.exe  -DCHECK_FUNCTION_EXISTS=getauxval    -Wl,--whole-archive CMakeFiles/cmTC_f1f1c.dir/objects.a -Wl,--no-whole-archive  -o cmTC_f1f1c.exe -Wl,--major-image-version,0,--minor-image-version,0 -liphlpapi -lws2_32 -lkernel32 -luser32 -lgdi32 -lwinspool -lshell32 -lole32 -loleaut32 -luuid -lcomdlg32 -ladvapi32 
CMakeFiles/cmTC_f1f1c.dir/objects.a(CheckFunctionExists.c.obj):CheckFunctionExists.c:(.text+0xc): undefined reference to `getauxval'

collect2.exe: error: ld returned 1 exit status

make[2]: *** [CMakeFiles/cmTC_f1f1c.dir/build.make:88: cmTC_f1f1c.exe] Error 1
make[2]: Leaving directory '/home/buildbot/slave/monero-static-win32/build/build/release/CMakeFiles/CMakeTmp'
make[1]: *** [Makefile:121: cmTC_f1f1c/fast] Error 2
make[1]: Leaving directory '/home/buildbot/slave/monero-static-win32/build/build/release/CMakeFiles/CMakeTmp'


Determining if the function getentropy exists failed with the following output:
Change Dir: C:/msys32/home/buildbot/slave/monero-static-win32/build/build/release/CMakeFiles/CMakeTmp

Run Build Command:"C:/msys32/usr/bin/make.exe" "cmTC_e420d/fast"
make[1]: Entering directory '/home/buildbot/slave/monero-static-win32/build/build/release/CMakeFiles/CMakeTmp'
/usr/bin/make -f CMakeFiles/cmTC_e420d.dir/build.make CMakeFiles/cmTC_e420d.dir/build
make[2]: Entering directory '/home/buildbot/slave/monero-static-win32/build/build/release/CMakeFiles/CMakeTmp'
Building C object CMakeFiles/cmTC_e420d.dir/CheckFunctionExists.c.obj

/C/msys32/mingw32/bin/i686-w64-mingw32-gcc.exe   -DCHECK_FUNCTION_EXISTS=getentropy   -o CMakeFiles/cmTC_e420d.dir/CheckFunctionExists.c.obj   -c /C/msys32/mingw32/share/cmake-3.12/Modules/CheckFunctionExists.c
Linking C executable cmTC_e420d.exe

/C/msys32/mingw32/bin/cmake.exe -E remove -f CMakeFiles/cmTC_e420d.dir/objects.a
ar cr CMakeFiles/cmTC_e420d.dir/objects.a "CMakeFiles/cmTC_e420d.dir/CheckFunctionExists.c.obj" 
/C/msys32/mingw32/bin/i686-w64-mingw32-gcc.exe  -DCHECK_FUNCTION_EXISTS=getentropy    -Wl,--whole-archive CMakeFiles/cmTC_e420d.dir/objects.a -Wl,--no-whole-archive  -o cmTC_e420d.exe -Wl,--major-image-version,0,--minor-image-version,0 -liphlpapi -lws2_32 -lkernel32 -luser32 -lgdi32 -lwinspool -lshell32 -lole32 -loleaut32 -luuid -lcomdlg32 -ladvapi32 
CMakeFiles/cmTC_e420d.dir/objects.a(CheckFunctionExists.c.obj):CheckFunctionExists.c:(.text+0xc): undefined reference to `getentropy'

collect2.exe: error: ld returned 1 exit status

make[2]: *** [CMakeFiles/cmTC_e420d.dir/build.make:88: cmTC_e420d.exe] Error 1
make[2]: Leaving directory '/home/buildbot/slave/monero-static-win32/build/build/release/CMakeFiles/CMakeTmp'
make[1]: *** [Makefile:121: cmTC_e420d/fast] Error 2
make[1]: Leaving directory '/home/buildbot/slave/monero-static-win32/build/build/release/CMakeFiles/CMakeTmp'


Determining if the function getpwnam exists failed with the following output:
Change Dir: C:/msys32/home/buildbot/slave/monero-static-win32/build/build/release/CMakeFiles/CMakeTmp

Run Build Command:"C:/msys32/usr/bin/make.exe" "cmTC_2ea05/fast"
make[1]: Entering directory '/home/buildbot/slave/monero-static-win32/build/build/release/CMakeFiles/CMakeTmp'
/usr/bin/make -f CMakeFiles/cmTC_2ea05.dir/build.make CMakeFiles/cmTC_2ea05.dir/build
make[2]: Entering directory '/home/buildbot/slave/monero-static-win32/build/build/release/CMakeFiles/CMakeTmp'
Building C object CMakeFiles/cmTC_2ea05.dir/CheckFunctionExists.c.obj

/C/msys32/mingw32/bin/i686-w64-mingw32-gcc.exe   -DCHECK_FUNCTION_EXISTS=getpwnam   -o CMakeFiles/cmTC_2ea05.dir/CheckFunctionExists.c.obj   -c /C/msys32/mingw32/share/cmake-3.12/Modules/CheckFunctionExists.c
Linking C executable cmTC_2ea05.exe

/C/msys32/mingw32/bin/cmake.exe -E remove -f CMakeFiles/cmTC_2ea05.dir/objects.a
ar cr CMakeFiles/cmTC_2ea05.dir/objects.a "CMakeFiles/cmTC_2ea05.dir/CheckFunctionExists.c.obj" 
/C/msys32/mingw32/bin/i686-w64-mingw32-gcc.exe  -DCHECK_FUNCTION_EXISTS=getpwnam    -Wl,--whole-archive CMakeFiles/cmTC_2ea05.dir/objects.a -Wl,--no-whole-archive  -o cmTC_2ea05.exe -Wl,--major-image-version,0,--minor-image-version,0 -liphlpapi -lws2_32 -lkernel32 -luser32 -lgdi32 -lwinspool -lshell32 -lole32 -loleaut32 -luuid -lcomdlg32 -ladvapi32 
CMakeFiles/cmTC_2ea05.dir/objects.a(CheckFunctionExists.c.obj):CheckFunctionExists.c:(.text+0xc): undefined reference to `getpwnam'

collect2.exe: error: ld returned 1 exit status

make[2]: *** [CMakeFiles/cmTC_2ea05.dir/build.make:88: cmTC_2ea05.exe] Error 1
make[2]: Leaving directory '/home/buildbot/slave/monero-static-win32/build/build/release/CMakeFiles/CMakeTmp'
make[1]: *** [Makefile:121: cmTC_2ea05/fast] Error 2
make[1]: Leaving directory '/home/buildbot/slave/monero-static-win32/build/build/release/CMakeFiles/CMakeTmp'


Determining if the function getrlimit exists failed with the following output:
Change Dir: C:/msys32/home/buildbot/slave/monero-static-win32/build/build/release/CMakeFiles/CMakeTmp

Run Build Command:"C:/msys32/usr/bin/make.exe" "cmTC_93a5f/fast"
make[1]: Entering directory '/home/buildbot/slave/monero-static-win32/build/build/release/CMakeFiles/CMakeTmp'
/usr/bin/make -f CMakeFiles/cmTC_93a5f.dir/build.make CMakeFiles/cmTC_93a5f.dir/build
make[2]: Entering directory '/home/buildbot/slave/monero-static-win32/build/build/release/CMakeFiles/CMakeTmp'
Building C object CMakeFiles/cmTC_93a5f.dir/CheckFunctionExists.c.obj

/C/msys32/mingw32/bin/i686-w64-mingw32-gcc.exe   -DCHECK_FUNCTION_EXISTS=getrlimit   -o CMakeFiles/cmTC_93a5f.dir/CheckFunctionExists.c.obj   -c /C/msys32/mingw32/share/cmake-3.12/Modules/CheckFunctionExists.c
Linking C executable cmTC_93a5f.exe

/C/msys32/mingw32/bin/cmake.exe -E remove -f CMakeFiles/cmTC_93a5f.dir/objects.a
ar cr CMakeFiles/cmTC_93a5f.dir/objects.a "CMakeFiles/cmTC_93a5f.dir/CheckFunctionExists.c.obj" 
/C/msys32/mingw32/bin/i686-w64-mingw32-gcc.exe  -DCHECK_FUNCTION_EXISTS=getrlimit    -Wl,--whole-archive CMakeFiles/cmTC_93a5f.dir/objects.a -Wl,--no-whole-archive  -o cmTC_93a5f.exe -Wl,--major-image-version,0,--minor-image-version,0 -liphlpapi -lws2_32 -lkernel32 -luser32 -lgdi32 -lwinspool -lshell32 -lole32 -loleaut32 -luuid -lcomdlg32 -ladvapi32 
CMakeFiles/cmTC_93a5f.dir/objects.a(CheckFunctionExists.c.obj):CheckFunctionExists.c:(.text+0xc): undefined reference to `getrlimit'

collect2.exe: error: ld returned 1 exit status

make[2]: *** [CMakeFiles/cmTC_93a5f.dir/build.make:88: cmTC_93a5f.exe] Error 1
make[2]: Leaving directory '/home/buildbot/slave/monero-static-win32/build/build/release/CMakeFiles/CMakeTmp'
make[1]: *** [Makefile:121: cmTC_93a5f/fast] Error 2
make[1]: Leaving directory '/home/buildbot/slave/monero-static-win32/build/build/release/CMakeFiles/CMakeTmp'


Determining if the function glob exists failed with the following output:
Change Dir: C:/msys32/home/buildbot/slave/monero-static-win32/build/build/release/CMakeFiles/CMakeTmp

Run Build Command:"C:/msys32/usr/bin/make.exe" "cmTC_a10a6/fast"
make[1]: Entering directory '/home/buildbot/slave/monero-static-win32/build/build/release/CMakeFiles/CMakeTmp'
/usr/bin/make -f CMakeFiles/cmTC_a10a6.dir/build.make CMakeFiles/cmTC_a10a6.dir/build
make[2]: Entering directory '/home/buildbot/slave/monero-static-win32/build/build/release/CMakeFiles/CMakeTmp'
Building C object CMakeFiles/cmTC_a10a6.dir/CheckFunctionExists.c.obj

/C/msys32/mingw32/bin/i686-w64-mingw32-gcc.exe   -DCHECK_FUNCTION_EXISTS=glob   -o CMakeFiles/cmTC_a10a6.dir/CheckFunctionExists.c.obj   -c /C/msys32/mingw32/share/cmake-3.12/Modules/CheckFunctionExists.c
Linking C executable cmTC_a10a6.exe

/C/msys32/mingw32/bin/cmake.exe -E remove -f CMakeFiles/cmTC_a10a6.dir/objects.a
ar cr CMakeFiles/cmTC_a10a6.dir/objects.a "CMakeFiles/cmTC_a10a6.dir/CheckFunctionExists.c.obj" 
/C/msys32/mingw32/bin/i686-w64-mingw32-gcc.exe  -DCHECK_FUNCTION_EXISTS=glob    -Wl,--whole-archive CMakeFiles/cmTC_a10a6.dir/objects.a -Wl,--no-whole-archive  -o cmTC_a10a6.exe -Wl,--major-image-version,0,--minor-image-version,0 -liphlpapi -lws2_32 -lkernel32 -luser32 -lgdi32 -lwinspool -lshell32 -lole32 -loleaut32 -luuid -lcomdlg32 -ladvapi32 
CMakeFiles/cmTC_a10a6.dir/objects.a(CheckFunctionExists.c.obj):CheckFunctionExists.c:(.text+0xc): undefined reference to `glob'

collect2.exe: error: ld returned 1 exit status

make[2]: *** [CMakeFiles/cmTC_a10a6.dir/build.make:88: cmTC_a10a6.exe] Error 1
make[2]: Leaving directory '/home/buildbot/slave/monero-static-win32/build/build/release/CMakeFiles/CMakeTmp'
make[1]: *** [Makefile:121: cmTC_a10a6/fast] Error 2
make[1]: Leaving directory '/home/buildbot/slave/monero-static-win32/build/build/release/CMakeFiles/CMakeTmp'


Determining if the function gmtime_r exists failed with the following output:
Change Dir: C:/msys32/home/buildbot/slave/monero-static-win32/build/build/release/CMakeFiles/CMakeTmp

Run Build Command:"C:/msys32/usr/bin/make.exe" "cmTC_3f574/fast"
make[1]: Entering directory '/home/buildbot/slave/monero-static-win32/build/build/release/CMakeFiles/CMakeTmp'
/usr/bin/make -f CMakeFiles/cmTC_3f574.dir/build.make CMakeFiles/cmTC_3f574.dir/build
make[2]: Entering directory '/home/buildbot/slave/monero-static-win32/build/build/release/CMakeFiles/CMakeTmp'
Building C object CMakeFiles/cmTC_3f574.dir/CheckFunctionExists.c.obj

/C/msys32/mingw32/bin/i686-w64-mingw32-gcc.exe   -DCHECK_FUNCTION_EXISTS=gmtime_r   -o CMakeFiles/cmTC_3f574.dir/CheckFunctionExists.c.obj   -c /C/msys32/mingw32/share/cmake-3.12/Modules/CheckFunctionExists.c
Linking C executable cmTC_3f574.exe

/C/msys32/mingw32/bin/cmake.exe -E remove -f CMakeFiles/cmTC_3f574.dir/objects.a
ar cr CMakeFiles/cmTC_3f574.dir/objects.a "CMakeFiles/cmTC_3f574.dir/CheckFunctionExists.c.obj" 
/C/msys32/mingw32/bin/i686-w64-mingw32-gcc.exe  -DCHECK_FUNCTION_EXISTS=gmtime_r    -Wl,--whole-archive CMakeFiles/cmTC_3f574.dir/objects.a -Wl,--no-whole-archive  -o cmTC_3f574.exe -Wl,--major-image-version,0,--minor-image-version,0 -liphlpapi -lws2_32 -lkernel32 -luser32 -lgdi32 -lwinspool -lshell32 -lole32 -loleaut32 -luuid -lcomdlg32 -ladvapi32 
CMakeFiles/cmTC_3f574.dir/objects.a(CheckFunctionExists.c.obj):CheckFunctionExists.c:(.text+0xc): undefined reference to `gmtime_r'

collect2.exe: error: ld returned 1 exit status

make[2]: *** [CMakeFiles/cmTC_3f574.dir/build.make:88: cmTC_3f574.exe] Error 1
make[2]: Leaving directory '/home/buildbot/slave/monero-static-win32/build/build/release/CMakeFiles/CMakeTmp'
make[1]: *** [Makefile:121: cmTC_3f574/fast] Error 2
make[1]: Leaving directory '/home/buildbot/slave/monero-static-win32/build/build/release/CMakeFiles/CMakeTmp'


Determining if the function fcntl exists failed with the following output:
Change Dir: C:/msys32/home/buildbot/slave/monero-static-win32/build/build/release/CMakeFiles/CMakeTmp

Run Build Command:"C:/msys32/usr/bin/make.exe" "cmTC_83da4/fast"
make[1]: Entering directory '/home/buildbot/slave/monero-static-win32/build/build/release/CMakeFiles/CMakeTmp'
/usr/bin/make -f CMakeFiles/cmTC_83da4.dir/build.make CMakeFiles/cmTC_83da4.dir/build
make[2]: Entering directory '/home/buildbot/slave/monero-static-win32/build/build/release/CMakeFiles/CMakeTmp'
Building C object CMakeFiles/cmTC_83da4.dir/CheckFunctionExists.c.obj

/C/msys32/mingw32/bin/i686-w64-mingw32-gcc.exe   -DCHECK_FUNCTION_EXISTS=fcntl   -o CMakeFiles/cmTC_83da4.dir/CheckFunctionExists.c.obj   -c /C/msys32/mingw32/share/cmake-3.12/Modules/CheckFunctionExists.c
Linking C executable cmTC_83da4.exe

/C/msys32/mingw32/bin/cmake.exe -E remove -f CMakeFiles/cmTC_83da4.dir/objects.a
ar cr CMakeFiles/cmTC_83da4.dir/objects.a "CMakeFiles/cmTC_83da4.dir/CheckFunctionExists.c.obj" 
/C/msys32/mingw32/bin/i686-w64-mingw32-gcc.exe  -DCHECK_FUNCTION_EXISTS=fcntl    -Wl,--whole-archive CMakeFiles/cmTC_83da4.dir/objects.a -Wl,--no-whole-archive  -o cmTC_83da4.exe -Wl,--major-image-version,0,--minor-image-version,0 -liphlpapi -lws2_32 -lkernel32 -luser32 -lgdi32 -lwinspool -lshell32 -lole32 -loleaut32 -luuid -lcomdlg32 -ladvapi32 
CMakeFiles/cmTC_83da4.dir/objects.a(CheckFunctionExists.c.obj):CheckFunctionExists.c:(.text+0xc): undefined reference to `fcntl'

collect2.exe: error: ld returned 1 exit status

make[2]: *** [CMakeFiles/cmTC_83da4.dir/build.make:88: cmTC_83da4.exe] Error 1
make[2]: Leaving directory '/home/buildbot/slave/monero-static-win32/build/build/release/CMakeFiles/CMakeTmp'
make[1]: *** [Makefile:121: cmTC_83da4/fast] Error 2
make[1]: Leaving directory '/home/buildbot/slave/monero-static-win32/build/build/release/CMakeFiles/CMakeTmp'


Determining if the function inet_aton exists failed with the following output:
Change Dir: C:/msys32/home/buildbot/slave/monero-static-win32/build/build/release/CMakeFiles/CMakeTmp

Run Build Command:"C:/msys32/usr/bin/make.exe" "cmTC_09672/fast"
make[1]: Entering directory '/home/buildbot/slave/monero-static-win32/build/build/release/CMakeFiles/CMakeTmp'
/usr/bin/make -f CMakeFiles/cmTC_09672.dir/build.make CMakeFiles/cmTC_09672.dir/build
make[2]: Entering directory '/home/buildbot/slave/monero-static-win32/build/build/release/CMakeFiles/CMakeTmp'
Building C object CMakeFiles/cmTC_09672.dir/CheckFunctionExists.c.obj

/C/msys32/mingw32/bin/i686-w64-mingw32-gcc.exe   -DCHECK_FUNCTION_EXISTS=inet_aton   -o CMakeFiles/cmTC_09672.dir/CheckFunctionExists.c.obj   -c /C/msys32/mingw32/share/cmake-3.12/Modules/CheckFunctionExists.c
Linking C executable cmTC_09672.exe

/C/msys32/mingw32/bin/cmake.exe -E remove -f CMakeFiles/cmTC_09672.dir/objects.a
ar cr CMakeFiles/cmTC_09672.dir/objects.a "CMakeFiles/cmTC_09672.dir/CheckFunctionExists.c.obj" 
/C/msys32/mingw32/bin/i686-w64-mingw32-gcc.exe  -DCHECK_FUNCTION_EXISTS=inet_aton    -Wl,--whole-archive CMakeFiles/cmTC_09672.dir/objects.a -Wl,--no-whole-archive  -o cmTC_09672.exe -Wl,--major-image-version,0,--minor-image-version,0 -liphlpapi -lws2_32 -lkernel32 -luser32 -lgdi32 -lwinspool -lshell32 -lole32 -loleaut32 -luuid -lcomdlg32 -ladvapi32 
CMakeFiles/cmTC_09672.dir/objects.a(CheckFunctionExists.c.obj):CheckFunctionExists.c:(.text+0xc): undefined reference to `inet_aton'

collect2.exe: error: ld returned 1 exit status

make[2]: *** [CMakeFiles/cmTC_09672.dir/build.make:88: cmTC_09672.exe] Error 1
make[2]: Leaving directory '/home/buildbot/slave/monero-static-win32/build/build/release/CMakeFiles/CMakeTmp'
make[1]: *** [Makefile:121: cmTC_09672/fast] Error 2
make[1]: Leaving directory '/home/buildbot/slave/monero-static-win32/build/build/release/CMakeFiles/CMakeTmp'


Determining if the function inet_ntop exists failed with the following output:
Change Dir: C:/msys32/home/buildbot/slave/monero-static-win32/build/build/release/CMakeFiles/CMakeTmp

Run Build Command:"C:/msys32/usr/bin/make.exe" "cmTC_f5374/fast"
make[1]: Entering directory '/home/buildbot/slave/monero-static-win32/build/build/release/CMakeFiles/CMakeTmp'
/usr/bin/make -f CMakeFiles/cmTC_f5374.dir/build.make CMakeFiles/cmTC_f5374.dir/build
make[2]: Entering directory '/home/buildbot/slave/monero-static-win32/build/build/release/CMakeFiles/CMakeTmp'
Building C object CMakeFiles/cmTC_f5374.dir/CheckFunctionExists.c.obj

/C/msys32/mingw32/bin/i686-w64-mingw32-gcc.exe   -DCHECK_FUNCTION_EXISTS=inet_ntop   -o CMakeFiles/cmTC_f5374.dir/CheckFunctionExists.c.obj   -c /C/msys32/mingw32/share/cmake-3.12/Modules/CheckFunctionExists.c
Linking C executable cmTC_f5374.exe

/C/msys32/mingw32/bin/cmake.exe -E remove -f CMakeFiles/cmTC_f5374.dir/objects.a
ar cr CMakeFiles/cmTC_f5374.dir/objects.a "CMakeFiles/cmTC_f5374.dir/CheckFunctionExists.c.obj" 
/C/msys32/mingw32/bin/i686-w64-mingw32-gcc.exe  -DCHECK_FUNCTION_EXISTS=inet_ntop    -Wl,--whole-archive CMakeFiles/cmTC_f5374.dir/objects.a -Wl,--no-whole-archive  -o cmTC_f5374.exe -Wl,--major-image-version,0,--minor-image-version,0 -liphlpapi -lws2_32 -lkernel32 -luser32 -lgdi32 -lwinspool -lshell32 -lole32 -loleaut32 -luuid -lcomdlg32 -ladvapi32 
CMakeFiles/cmTC_f5374.dir/objects.a(CheckFunctionExists.c.obj):CheckFunctionExists.c:(.text+0xc): undefined reference to `inet_ntop'

collect2.exe: error: ld returned 1 exit status

make[2]: *** [CMakeFiles/cmTC_f5374.dir/build.make:88: cmTC_f5374.exe] Error 1
make[2]: Leaving directory '/home/buildbot/slave/monero-static-win32/build/build/release/CMakeFiles/CMakeTmp'
make[1]: *** [Makefile:121: cmTC_f5374/fast] Error 2
make[1]: Leaving directory '/home/buildbot/slave/monero-static-win32/build/build/release/CMakeFiles/CMakeTmp'


Determining if the function inet_pton exists failed with the following output:
Change Dir: C:/msys32/home/buildbot/slave/monero-static-win32/build/build/release/CMakeFiles/CMakeTmp

Run Build Command:"C:/msys32/usr/bin/make.exe" "cmTC_db7dc/fast"
make[1]: Entering directory '/home/buildbot/slave/monero-static-win32/build/build/release/CMakeFiles/CMakeTmp'
/usr/bin/make -f CMakeFiles/cmTC_db7dc.dir/build.make CMakeFiles/cmTC_db7dc.dir/build
make[2]: Entering directory '/home/buildbot/slave/monero-static-win32/build/build/release/CMakeFiles/CMakeTmp'
Building C object CMakeFiles/cmTC_db7dc.dir/CheckFunctionExists.c.obj

/C/msys32/mingw32/bin/i686-w64-mingw32-gcc.exe   -DCHECK_FUNCTION_EXISTS=inet_pton   -o CMakeFiles/cmTC_db7dc.dir/CheckFunctionExists.c.obj   -c /C/msys32/mingw32/share/cmake-3.12/Modules/CheckFunctionExists.c
Linking C executable cmTC_db7dc.exe

/C/msys32/mingw32/bin/cmake.exe -E remove -f CMakeFiles/cmTC_db7dc.dir/objects.a
ar cr CMakeFiles/cmTC_db7dc.dir/objects.a "CMakeFiles/cmTC_db7dc.dir/CheckFunctionExists.c.obj" 
/C/msys32/mingw32/bin/i686-w64-mingw32-gcc.exe  -DCHECK_FUNCTION_EXISTS=inet_pton    -Wl,--whole-archive CMakeFiles/cmTC_db7dc.dir/objects.a -Wl,--no-whole-archive  -o cmTC_db7dc.exe -Wl,--major-image-version,0,--minor-image-version,0 -liphlpapi -lws2_32 -lkernel32 -luser32 -lgdi32 -lwinspool -lshell32 -lole32 -loleaut32 -luuid -lcomdlg32 -ladvapi32 
CMakeFiles/cmTC_db7dc.dir/objects.a(CheckFunctionExists.c.obj):CheckFunctionExists.c:(.text+0xc): undefined reference to `inet_pton'

collect2.exe: error: ld returned 1 exit status

make[2]: *** [CMakeFiles/cmTC_db7dc.dir/build.make:88: cmTC_db7dc.exe] Error 1
make[2]: Leaving directory '/home/buildbot/slave/monero-static-win32/build/build/release/CMakeFiles/CMakeTmp'
make[1]: *** [Makefile:121: cmTC_db7dc/fast] Error 2
make[1]: Leaving directory '/home/buildbot/slave/monero-static-win32/build/build/release/CMakeFiles/CMakeTmp'


Determining if the function initgroups exists failed with the following output:
Change Dir: C:/msys32/home/buildbot/slave/monero-static-win32/build/build/release/CMakeFiles/CMakeTmp

Run Build Command:"C:/msys32/usr/bin/make.exe" "cmTC_4e4d8/fast"
make[1]: Entering directory '/home/buildbot/slave/monero-static-win32/build/build/release/CMakeFiles/CMakeTmp'
/usr/bin/make -f CMakeFiles/cmTC_4e4d8.dir/build.make CMakeFiles/cmTC_4e4d8.dir/build
make[2]: Entering directory '/home/buildbot/slave/monero-static-win32/build/build/release/CMakeFiles/CMakeTmp'
Building C object CMakeFiles/cmTC_4e4d8.dir/CheckFunctionExists.c.obj

/C/msys32/mingw32/bin/i686-w64-mingw32-gcc.exe   -DCHECK_FUNCTION_EXISTS=initgroups   -o CMakeFiles/cmTC_4e4d8.dir/CheckFunctionExists.c.obj   -c /C/msys32/mingw32/share/cmake-3.12/Modules/CheckFunctionExists.c
Linking C executable cmTC_4e4d8.exe

/C/msys32/mingw32/bin/cmake.exe -E remove -f CMakeFiles/cmTC_4e4d8.dir/objects.a
ar cr CMakeFiles/cmTC_4e4d8.dir/objects.a "CMakeFiles/cmTC_4e4d8.dir/CheckFunctionExists.c.obj" 
/C/msys32/mingw32/bin/i686-w64-mingw32-gcc.exe  -DCHECK_FUNCTION_EXISTS=initgroups    -Wl,--whole-archive CMakeFiles/cmTC_4e4d8.dir/objects.a -Wl,--no-whole-archive  -o cmTC_4e4d8.exe -Wl,--major-image-version,0,--minor-image-version,0 -liphlpapi -lws2_32 -lkernel32 -luser32 -lgdi32 -lwinspool -lshell32 -lole32 -loleaut32 -luuid -lcomdlg32 -ladvapi32 
CMakeFiles/cmTC_4e4d8.dir/objects.a(CheckFunctionExists.c.obj):CheckFunctionExists.c:(.text+0xc): undefined reference to `initgroups'

collect2.exe: error: ld returned 1 exit status

make[2]: *** [CMakeFiles/cmTC_4e4d8.dir/build.make:88: cmTC_4e4d8.exe] Error 1
make[2]: Leaving directory '/home/buildbot/slave/monero-static-win32/build/build/release/CMakeFiles/CMakeTmp'
make[1]: *** [Makefile:121: cmTC_4e4d8/fast] Error 2
make[1]: Leaving directory '/home/buildbot/slave/monero-static-win32/build/build/release/CMakeFiles/CMakeTmp'


Determining if the function ioctlsocket exists failed with the following output:
Change Dir: C:/msys32/home/buildbot/slave/monero-static-win32/build/build/release/CMakeFiles/CMakeTmp

Run Build Command:"C:/msys32/usr/bin/make.exe" "cmTC_e6566/fast"
make[1]: Entering directory '/home/buildbot/slave/monero-static-win32/build/build/release/CMakeFiles/CMakeTmp'
/usr/bin/make -f CMakeFiles/cmTC_e6566.dir/build.make CMakeFiles/cmTC_e6566.dir/build
make[2]: Entering directory '/home/buildbot/slave/monero-static-win32/build/build/release/CMakeFiles/CMakeTmp'
Building C object CMakeFiles/cmTC_e6566.dir/CheckFunctionExists.c.obj

/C/msys32/mingw32/bin/i686-w64-mingw32-gcc.exe   -DCHECK_FUNCTION_EXISTS=ioctlsocket   -o CMakeFiles/cmTC_e6566.dir/CheckFunctionExists.c.obj   -c /C/msys32/mingw32/share/cmake-3.12/Modules/CheckFunctionExists.c
Linking C executable cmTC_e6566.exe

/C/msys32/mingw32/bin/cmake.exe -E remove -f CMakeFiles/cmTC_e6566.dir/objects.a
ar cr CMakeFiles/cmTC_e6566.dir/objects.a "CMakeFiles/cmTC_e6566.dir/CheckFunctionExists.c.obj" 
/C/msys32/mingw32/bin/i686-w64-mingw32-gcc.exe  -DCHECK_FUNCTION_EXISTS=ioctlsocket    -Wl,--whole-archive CMakeFiles/cmTC_e6566.dir/objects.a -Wl,--no-whole-archive  -o cmTC_e6566.exe -Wl,--major-image-version,0,--minor-image-version,0 -liphlpapi -lws2_32 -lkernel32 -luser32 -lgdi32 -lwinspool -lshell32 -lole32 -loleaut32 -luuid -lcomdlg32 -ladvapi32 
CMakeFiles/cmTC_e6566.dir/objects.a(CheckFunctionExists.c.obj):CheckFunctionExists.c:(.text+0xc): undefined reference to `ioctlsocket'

collect2.exe: error: ld returned 1 exit status

make[2]: *** [CMakeFiles/cmTC_e6566.dir/build.make:88: cmTC_e6566.exe] Error 1
make[2]: Leaving directory '/home/buildbot/slave/monero-static-win32/build/build/release/CMakeFiles/CMakeTmp'
make[1]: *** [Makefile:121: cmTC_e6566/fast] Error 2
make[1]: Leaving directory '/home/buildbot/slave/monero-static-win32/build/build/release/CMakeFiles/CMakeTmp'


Determining if the function kill exists failed with the following output:
Change Dir: C:/msys32/home/buildbot/slave/monero-static-win32/build/build/release/CMakeFiles/CMakeTmp

Run Build Command:"C:/msys32/usr/bin/make.exe" "cmTC_339a5/fast"
make[1]: Entering directory '/home/buildbot/slave/monero-static-win32/build/build/release/CMakeFiles/CMakeTmp'
/usr/bin/make -f CMakeFiles/cmTC_339a5.dir/build.make CMakeFiles/cmTC_339a5.dir/build
make[2]: Entering directory '/home/buildbot/slave/monero-static-win32/build/build/release/CMakeFiles/CMakeTmp'
Building C object CMakeFiles/cmTC_339a5.dir/CheckFunctionExists.c.obj

/C/msys32/mingw32/bin/i686-w64-mingw32-gcc.exe   -DCHECK_FUNCTION_EXISTS=kill   -o CMakeFiles/cmTC_339a5.dir/CheckFunctionExists.c.obj   -c /C/msys32/mingw32/share/cmake-3.12/Modules/CheckFunctionExists.c
Linking C executable cmTC_339a5.exe

/C/msys32/mingw32/bin/cmake.exe -E remove -f CMakeFiles/cmTC_339a5.dir/objects.a
ar cr CMakeFiles/cmTC_339a5.dir/objects.a "CMakeFiles/cmTC_339a5.dir/CheckFunctionExists.c.obj" 
/C/msys32/mingw32/bin/i686-w64-mingw32-gcc.exe  -DCHECK_FUNCTION_EXISTS=kill    -Wl,--whole-archive CMakeFiles/cmTC_339a5.dir/objects.a -Wl,--no-whole-archive  -o cmTC_339a5.exe -Wl,--major-image-version,0,--minor-image-version,0 -liphlpapi -lws2_32 -lkernel32 -luser32 -lgdi32 -lwinspool -lshell32 -lole32 -loleaut32 -luuid -lcomdlg32 -ladvapi32 
CMakeFiles/cmTC_339a5.dir/objects.a(CheckFunctionExists.c.obj):CheckFunctionExists.c:(.text+0xc): undefined reference to `kill'

collect2.exe: error: ld returned 1 exit status

make[2]: *** [CMakeFiles/cmTC_339a5.dir/build.make:88: cmTC_339a5.exe] Error 1
make[2]: Leaving directory '/home/buildbot/slave/monero-static-win32/build/build/release/CMakeFiles/CMakeTmp'
make[1]: *** [Makefile:121: cmTC_339a5/fast] Error 2
make[1]: Leaving directory '/home/buildbot/slave/monero-static-win32/build/build/release/CMakeFiles/CMakeTmp'


Determining if the function localtime_r exists failed with the following output:
Change Dir: C:/msys32/home/buildbot/slave/monero-static-win32/build/build/release/CMakeFiles/CMakeTmp

Run Build Command:"C:/msys32/usr/bin/make.exe" "cmTC_6f955/fast"
make[1]: Entering directory '/home/buildbot/slave/monero-static-win32/build/build/release/CMakeFiles/CMakeTmp'
/usr/bin/make -f CMakeFiles/cmTC_6f955.dir/build.make CMakeFiles/cmTC_6f955.dir/build
make[2]: Entering directory '/home/buildbot/slave/monero-static-win32/build/build/release/CMakeFiles/CMakeTmp'
Building C object CMakeFiles/cmTC_6f955.dir/CheckFunctionExists.c.obj

/C/msys32/mingw32/bin/i686-w64-mingw32-gcc.exe   -DCHECK_FUNCTION_EXISTS=localtime_r   -o CMakeFiles/cmTC_6f955.dir/CheckFunctionExists.c.obj   -c /C/msys32/mingw32/share/cmake-3.12/Modules/CheckFunctionExists.c
Linking C executable cmTC_6f955.exe

/C/msys32/mingw32/bin/cmake.exe -E remove -f CMakeFiles/cmTC_6f955.dir/objects.a
ar cr CMakeFiles/cmTC_6f955.dir/objects.a "CMakeFiles/cmTC_6f955.dir/CheckFunctionExists.c.obj" 
/C/msys32/mingw32/bin/i686-w64-mingw32-gcc.exe  -DCHECK_FUNCTION_EXISTS=localtime_r    -Wl,--whole-archive CMakeFiles/cmTC_6f955.dir/objects.a -Wl,--no-whole-archive  -o cmTC_6f955.exe -Wl,--major-image-version,0,--minor-image-version,0 -liphlpapi -lws2_32 -lkernel32 -luser32 -lgdi32 -lwinspool -lshell32 -lole32 -loleaut32 -luuid -lcomdlg32 -ladvapi32 
CMakeFiles/cmTC_6f955.dir/objects.a(CheckFunctionExists.c.obj):CheckFunctionExists.c:(.text+0xc): undefined reference to `localtime_r'

collect2.exe: error: ld returned 1 exit status

make[2]: *** [CMakeFiles/cmTC_6f955.dir/build.make:88: cmTC_6f955.exe] Error 1
make[2]: Leaving directory '/home/buildbot/slave/monero-static-win32/build/build/release/CMakeFiles/CMakeTmp'
make[1]: *** [Makefile:121: cmTC_6f955/fast] Error 2
make[1]: Leaving directory '/home/buildbot/slave/monero-static-win32/build/build/release/CMakeFiles/CMakeTmp'


Determining if the function random exists failed with the following output:
Change Dir: C:/msys32/home/buildbot/slave/monero-static-win32/build/build/release/CMakeFiles/CMakeTmp

Run Build Command:"C:/msys32/usr/bin/make.exe" "cmTC_41351/fast"
make[1]: Entering directory '/home/buildbot/slave/monero-static-win32/build/build/release/CMakeFiles/CMakeTmp'
/usr/bin/make -f CMakeFiles/cmTC_41351.dir/build.make CMakeFiles/cmTC_41351.dir/build
make[2]: Entering directory '/home/buildbot/slave/monero-static-win32/build/build/release/CMakeFiles/CMakeTmp'
Building C object CMakeFiles/cmTC_41351.dir/CheckFunctionExists.c.obj

/C/msys32/mingw32/bin/i686-w64-mingw32-gcc.exe   -DCHECK_FUNCTION_EXISTS=random   -o CMakeFiles/cmTC_41351.dir/CheckFunctionExists.c.obj   -c /C/msys32/mingw32/share/cmake-3.12/Modules/CheckFunctionExists.c
Linking C executable cmTC_41351.exe

/C/msys32/mingw32/bin/cmake.exe -E remove -f CMakeFiles/cmTC_41351.dir/objects.a
ar cr CMakeFiles/cmTC_41351.dir/objects.a "CMakeFiles/cmTC_41351.dir/CheckFunctionExists.c.obj" 
/C/msys32/mingw32/bin/i686-w64-mingw32-gcc.exe  -DCHECK_FUNCTION_EXISTS=random    -Wl,--whole-archive CMakeFiles/cmTC_41351.dir/objects.a -Wl,--no-whole-archive  -o cmTC_41351.exe -Wl,--major-image-version,0,--minor-image-version,0 -liphlpapi -lws2_32 -lkernel32 -luser32 -lgdi32 -lwinspool -lshell32 -lole32 -loleaut32 -luuid -lcomdlg32 -ladvapi32 
CMakeFiles/cmTC_41351.dir/objects.a(CheckFunctionExists.c.obj):CheckFunctionExists.c:(.text+0xc): undefined reference to `random'

collect2.exe: error: ld returned 1 exit status

make[2]: *** [CMakeFiles/cmTC_41351.dir/build.make:88: cmTC_41351.exe] Error 1
make[2]: Leaving directory '/home/buildbot/slave/monero-static-win32/build/build/release/CMakeFiles/CMakeTmp'
make[1]: *** [Makefile:121: cmTC_41351/fast] Error 2
make[1]: Leaving directory '/home/buildbot/slave/monero-static-win32/build/build/release/CMakeFiles/CMakeTmp'


Determining if the function reallocarray exists failed with the following output:
Change Dir: C:/msys32/home/buildbot/slave/monero-static-win32/build/build/release/CMakeFiles/CMakeTmp

Run Build Command:"C:/msys32/usr/bin/make.exe" "cmTC_a07a0/fast"
make[1]: Entering directory '/home/buildbot/slave/monero-static-win32/build/build/release/CMakeFiles/CMakeTmp'
/usr/bin/make -f CMakeFiles/cmTC_a07a0.dir/build.make CMakeFiles/cmTC_a07a0.dir/build
make[2]: Entering directory '/home/buildbot/slave/monero-static-win32/build/build/release/CMakeFiles/CMakeTmp'
Building C object CMakeFiles/cmTC_a07a0.dir/CheckFunctionExists.c.obj

/C/msys32/mingw32/bin/i686-w64-mingw32-gcc.exe   -DCHECK_FUNCTION_EXISTS=reallocarray   -o CMakeFiles/cmTC_a07a0.dir/CheckFunctionExists.c.obj   -c /C/msys32/mingw32/share/cmake-3.12/Modules/CheckFunctionExists.c
Linking C executable cmTC_a07a0.exe

/C/msys32/mingw32/bin/cmake.exe -E remove -f CMakeFiles/cmTC_a07a0.dir/objects.a
ar cr CMakeFiles/cmTC_a07a0.dir/objects.a "CMakeFiles/cmTC_a07a0.dir/CheckFunctionExists.c.obj" 
/C/msys32/mingw32/bin/i686-w64-mingw32-gcc.exe  -DCHECK_FUNCTION_EXISTS=reallocarray    -Wl,--whole-archive CMakeFiles/cmTC_a07a0.dir/objects.a -Wl,--no-whole-archive  -o cmTC_a07a0.exe -Wl,--major-image-version,0,--minor-image-version,0 -liphlpapi -lws2_32 -lkernel32 -luser32 -lgdi32 -lwinspool -lshell32 -lole32 -loleaut32 -luuid -lcomdlg32 -ladvapi32 
CMakeFiles/cmTC_a07a0.dir/objects.a(CheckFunctionExists.c.obj):CheckFunctionExists.c:(.text+0xc): undefined reference to `reallocarray'

collect2.exe: error: ld returned 1 exit status

make[2]: *** [CMakeFiles/cmTC_a07a0.dir/build.make:88: cmTC_a07a0.exe] Error 1
make[2]: Leaving directory '/home/buildbot/slave/monero-static-win32/build/build/release/CMakeFiles/CMakeTmp'
make[1]: *** [Makefile:121: cmTC_a07a0/fast] Error 2
make[1]: Leaving directory '/home/buildbot/slave/monero-static-win32/build/build/release/CMakeFiles/CMakeTmp'


Determining if the function recvmsg exists failed with the following output:
Change Dir: C:/msys32/home/buildbot/slave/monero-static-win32/build/build/release/CMakeFiles/CMakeTmp

Run Build Command:"C:/msys32/usr/bin/make.exe" "cmTC_cffa0/fast"
make[1]: Entering directory '/home/buildbot/slave/monero-static-win32/build/build/release/CMakeFiles/CMakeTmp'
/usr/bin/make -f CMakeFiles/cmTC_cffa0.dir/build.make CMakeFiles/cmTC_cffa0.dir/build
make[2]: Entering directory '/home/buildbot/slave/monero-static-win32/build/build/release/CMakeFiles/CMakeTmp'
Building C object CMakeFiles/cmTC_cffa0.dir/CheckFunctionExists.c.obj

/C/msys32/mingw32/bin/i686-w64-mingw32-gcc.exe   -DCHECK_FUNCTION_EXISTS=recvmsg   -o CMakeFiles/cmTC_cffa0.dir/CheckFunctionExists.c.obj   -c /C/msys32/mingw32/share/cmake-3.12/Modules/CheckFunctionExists.c
Linking C executable cmTC_cffa0.exe

/C/msys32/mingw32/bin/cmake.exe -E remove -f CMakeFiles/cmTC_cffa0.dir/objects.a
ar cr CMakeFiles/cmTC_cffa0.dir/objects.a "CMakeFiles/cmTC_cffa0.dir/CheckFunctionExists.c.obj" 
/C/msys32/mingw32/bin/i686-w64-mingw32-gcc.exe  -DCHECK_FUNCTION_EXISTS=recvmsg    -Wl,--whole-archive CMakeFiles/cmTC_cffa0.dir/objects.a -Wl,--no-whole-archive  -o cmTC_cffa0.exe -Wl,--major-image-version,0,--minor-image-version,0 -liphlpapi -lws2_32 -lkernel32 -luser32 -lgdi32 -lwinspool -lshell32 -lole32 -loleaut32 -luuid -lcomdlg32 -ladvapi32 
CMakeFiles/cmTC_cffa0.dir/objects.a(CheckFunctionExists.c.obj):CheckFunctionExists.c:(.text+0xc): undefined reference to `recvmsg'

collect2.exe: error: ld returned 1 exit status

make[2]: *** [CMakeFiles/cmTC_cffa0.dir/build.make:88: cmTC_cffa0.exe] Error 1
make[2]: Leaving directory '/home/buildbot/slave/monero-static-win32/build/build/release/CMakeFiles/CMakeTmp'
make[1]: *** [Makefile:121: cmTC_cffa0/fast] Error 2
make[1]: Leaving directory '/home/buildbot/slave/monero-static-win32/build/build/release/CMakeFiles/CMakeTmp'


Determining if the function sbrk exists failed with the following output:
Change Dir: C:/msys32/home/buildbot/slave/monero-static-win32/build/build/release/CMakeFiles/CMakeTmp

Run Build Command:"C:/msys32/usr/bin/make.exe" "cmTC_cf3f4/fast"
make[1]: Entering directory '/home/buildbot/slave/monero-static-win32/build/build/release/CMakeFiles/CMakeTmp'
/usr/bin/make -f CMakeFiles/cmTC_cf3f4.dir/build.make CMakeFiles/cmTC_cf3f4.dir/build
make[2]: Entering directory '/home/buildbot/slave/monero-static-win32/build/build/release/CMakeFiles/CMakeTmp'
Building C object CMakeFiles/cmTC_cf3f4.dir/CheckFunctionExists.c.obj

/C/msys32/mingw32/bin/i686-w64-mingw32-gcc.exe   -DCHECK_FUNCTION_EXISTS=sbrk   -o CMakeFiles/cmTC_cf3f4.dir/CheckFunctionExists.c.obj   -c /C/msys32/mingw32/share/cmake-3.12/Modules/CheckFunctionExists.c
Linking C executable cmTC_cf3f4.exe

/C/msys32/mingw32/bin/cmake.exe -E remove -f CMakeFiles/cmTC_cf3f4.dir/objects.a
ar cr CMakeFiles/cmTC_cf3f4.dir/objects.a "CMakeFiles/cmTC_cf3f4.dir/CheckFunctionExists.c.obj" 
/C/msys32/mingw32/bin/i686-w64-mingw32-gcc.exe  -DCHECK_FUNCTION_EXISTS=sbrk    -Wl,--whole-archive CMakeFiles/cmTC_cf3f4.dir/objects.a -Wl,--no-whole-archive  -o cmTC_cf3f4.exe -Wl,--major-image-version,0,--minor-image-version,0 -liphlpapi -lws2_32 -lkernel32 -luser32 -lgdi32 -lwinspool -lshell32 -lole32 -loleaut32 -luuid -lcomdlg32 -ladvapi32 
CMakeFiles/cmTC_cf3f4.dir/objects.a(CheckFunctionExists.c.obj):CheckFunctionExists.c:(.text+0xc): undefined reference to `sbrk'

collect2.exe: error: ld returned 1 exit status

make[2]: *** [CMakeFiles/cmTC_cf3f4.dir/build.make:88: cmTC_cf3f4.exe] Error 1
make[2]: Leaving directory '/home/buildbot/slave/monero-static-win32/build/build/release/CMakeFiles/CMakeTmp'
make[1]: *** [Makefile:121: cmTC_cf3f4/fast] Error 2
make[1]: Leaving directory '/home/buildbot/slave/monero-static-win32/build/build/release/CMakeFiles/CMakeTmp'


Determining if the function sendmsg exists failed with the following output:
Change Dir: C:/msys32/home/buildbot/slave/monero-static-win32/build/build/release/CMakeFiles/CMakeTmp

Run Build Command:"C:/msys32/usr/bin/make.exe" "cmTC_6ae18/fast"
make[1]: Entering directory '/home/buildbot/slave/monero-static-win32/build/build/release/CMakeFiles/CMakeTmp'
/usr/bin/make -f CMakeFiles/cmTC_6ae18.dir/build.make CMakeFiles/cmTC_6ae18.dir/build
make[2]: Entering directory '/home/buildbot/slave/monero-static-win32/build/build/release/CMakeFiles/CMakeTmp'
Building C object CMakeFiles/cmTC_6ae18.dir/CheckFunctionExists.c.obj

/C/msys32/mingw32/bin/i686-w64-mingw32-gcc.exe   -DCHECK_FUNCTION_EXISTS=sendmsg   -o CMakeFiles/cmTC_6ae18.dir/CheckFunctionExists.c.obj   -c /C/msys32/mingw32/share/cmake-3.12/Modules/CheckFunctionExists.c
Linking C executable cmTC_6ae18.exe

/C/msys32/mingw32/bin/cmake.exe -E remove -f CMakeFiles/cmTC_6ae18.dir/objects.a
ar cr CMakeFiles/cmTC_6ae18.dir/objects.a "CMakeFiles/cmTC_6ae18.dir/CheckFunctionExists.c.obj" 
/C/msys32/mingw32/bin/i686-w64-mingw32-gcc.exe  -DCHECK_FUNCTION_EXISTS=sendmsg    -Wl,--whole-archive CMakeFiles/cmTC_6ae18.dir/objects.a -Wl,--no-whole-archive  -o cmTC_6ae18.exe -Wl,--major-image-version,0,--minor-image-version,0 -liphlpapi -lws2_32 -lkernel32 -luser32 -lgdi32 -lwinspool -lshell32 -lole32 -loleaut32 -luuid -lcomdlg32 -ladvapi32 
CMakeFiles/cmTC_6ae18.dir/objects.a(CheckFunctionExists.c.obj):CheckFunctionExists.c:(.text+0xc): undefined reference to `sendmsg'

collect2.exe: error: ld returned 1 exit status

make[2]: *** [CMakeFiles/cmTC_6ae18.dir/build.make:88: cmTC_6ae18.exe] Error 1
make[2]: Leaving directory '/home/buildbot/slave/monero-static-win32/build/build/release/CMakeFiles/CMakeTmp'
make[1]: *** [Makefile:121: cmTC_6ae18/fast] Error 2
make[1]: Leaving directory '/home/buildbot/slave/monero-static-win32/build/build/release/CMakeFiles/CMakeTmp'


Determining if the function setregid exists failed with the following output:
Change Dir: C:/msys32/home/buildbot/slave/monero-static-win32/build/build/release/CMakeFiles/CMakeTmp

Run Build Command:"C:/msys32/usr/bin/make.exe" "cmTC_e8b8a/fast"
make[1]: Entering directory '/home/buildbot/slave/monero-static-win32/build/build/release/CMakeFiles/CMakeTmp'
/usr/bin/make -f CMakeFiles/cmTC_e8b8a.dir/build.make CMakeFiles/cmTC_e8b8a.dir/build
make[2]: Entering directory '/home/buildbot/slave/monero-static-win32/build/build/release/CMakeFiles/CMakeTmp'
Building C object CMakeFiles/cmTC_e8b8a.dir/CheckFunctionExists.c.obj

/C/msys32/mingw32/bin/i686-w64-mingw32-gcc.exe   -DCHECK_FUNCTION_EXISTS=setregid   -o CMakeFiles/cmTC_e8b8a.dir/CheckFunctionExists.c.obj   -c /C/msys32/mingw32/share/cmake-3.12/Modules/CheckFunctionExists.c
Linking C executable cmTC_e8b8a.exe

/C/msys32/mingw32/bin/cmake.exe -E remove -f CMakeFiles/cmTC_e8b8a.dir/objects.a
ar cr CMakeFiles/cmTC_e8b8a.dir/objects.a "CMakeFiles/cmTC_e8b8a.dir/CheckFunctionExists.c.obj" 
/C/msys32/mingw32/bin/i686-w64-mingw32-gcc.exe  -DCHECK_FUNCTION_EXISTS=setregid    -Wl,--whole-archive CMakeFiles/cmTC_e8b8a.dir/objects.a -Wl,--no-whole-archive  -o cmTC_e8b8a.exe -Wl,--major-image-version,0,--minor-image-version,0 -liphlpapi -lws2_32 -lkernel32 -luser32 -lgdi32 -lwinspool -lshell32 -lole32 -loleaut32 -luuid -lcomdlg32 -ladvapi32 
CMakeFiles/cmTC_e8b8a.dir/objects.a(CheckFunctionExists.c.obj):CheckFunctionExists.c:(.text+0xc): undefined reference to `setregid'

collect2.exe: error: ld returned 1 exit status

make[2]: *** [CMakeFiles/cmTC_e8b8a.dir/build.make:88: cmTC_e8b8a.exe] Error 1
make[2]: Leaving directory '/home/buildbot/slave/monero-static-win32/build/build/release/CMakeFiles/CMakeTmp'
make[1]: *** [Makefile:121: cmTC_e8b8a/fast] Error 2
make[1]: Leaving directory '/home/buildbot/slave/monero-static-win32/build/build/release/CMakeFiles/CMakeTmp'


Determining if the function setresgid exists failed with the following output:
Change Dir: C:/msys32/home/buildbot/slave/monero-static-win32/build/build/release/CMakeFiles/CMakeTmp

Run Build Command:"C:/msys32/usr/bin/make.exe" "cmTC_e6136/fast"
make[1]: Entering directory '/home/buildbot/slave/monero-static-win32/build/build/release/CMakeFiles/CMakeTmp'
/usr/bin/make -f CMakeFiles/cmTC_e6136.dir/build.make CMakeFiles/cmTC_e6136.dir/build
make[2]: Entering directory '/home/buildbot/slave/monero-static-win32/build/build/release/CMakeFiles/CMakeTmp'
Building C object CMakeFiles/cmTC_e6136.dir/CheckFunctionExists.c.obj

/C/msys32/mingw32/bin/i686-w64-mingw32-gcc.exe   -DCHECK_FUNCTION_EXISTS=setresgid   -o CMakeFiles/cmTC_e6136.dir/CheckFunctionExists.c.obj   -c /C/msys32/mingw32/share/cmake-3.12/Modules/CheckFunctionExists.c
Linking C executable cmTC_e6136.exe

/C/msys32/mingw32/bin/cmake.exe -E remove -f CMakeFiles/cmTC_e6136.dir/objects.a
ar cr CMakeFiles/cmTC_e6136.dir/objects.a "CMakeFiles/cmTC_e6136.dir/CheckFunctionExists.c.obj" 
/C/msys32/mingw32/bin/i686-w64-mingw32-gcc.exe  -DCHECK_FUNCTION_EXISTS=setresgid    -Wl,--whole-archive CMakeFiles/cmTC_e6136.dir/objects.a -Wl,--no-whole-archive  -o cmTC_e6136.exe -Wl,--major-image-version,0,--minor-image-version,0 -liphlpapi -lws2_32 -lkernel32 -luser32 -lgdi32 -lwinspool -lshell32 -lole32 -loleaut32 -luuid -lcomdlg32 -ladvapi32 
CMakeFiles/cmTC_e6136.dir/objects.a(CheckFunctionExists.c.obj):CheckFunctionExists.c:(.text+0xc): undefined reference to `setresgid'

collect2.exe: error: ld returned 1 exit status

make[2]: *** [CMakeFiles/cmTC_e6136.dir/build.make:88: cmTC_e6136.exe] Error 1
make[2]: Leaving directory '/home/buildbot/slave/monero-static-win32/build/build/release/CMakeFiles/CMakeTmp'
make[1]: *** [Makefile:121: cmTC_e6136/fast] Error 2
make[1]: Leaving directory '/home/buildbot/slave/monero-static-win32/build/build/release/CMakeFiles/CMakeTmp'


Determining if the function setresuid exists failed with the following output:
Change Dir: C:/msys32/home/buildbot/slave/monero-static-win32/build/build/release/CMakeFiles/CMakeTmp

Run Build Command:"C:/msys32/usr/bin/make.exe" "cmTC_d316f/fast"
make[1]: Entering directory '/home/buildbot/slave/monero-static-win32/build/build/release/CMakeFiles/CMakeTmp'
/usr/bin/make -f CMakeFiles/cmTC_d316f.dir/build.make CMakeFiles/cmTC_d316f.dir/build
make[2]: Entering directory '/home/buildbot/slave/monero-static-win32/build/build/release/CMakeFiles/CMakeTmp'
Building C object CMakeFiles/cmTC_d316f.dir/CheckFunctionExists.c.obj

/C/msys32/mingw32/bin/i686-w64-mingw32-gcc.exe   -DCHECK_FUNCTION_EXISTS=setresuid   -o CMakeFiles/cmTC_d316f.dir/CheckFunctionExists.c.obj   -c /C/msys32/mingw32/share/cmake-3.12/Modules/CheckFunctionExists.c
Linking C executable cmTC_d316f.exe

/C/msys32/mingw32/bin/cmake.exe -E remove -f CMakeFiles/cmTC_d316f.dir/objects.a
ar cr CMakeFiles/cmTC_d316f.dir/objects.a "CMakeFiles/cmTC_d316f.dir/CheckFunctionExists.c.obj" 
/C/msys32/mingw32/bin/i686-w64-mingw32-gcc.exe  -DCHECK_FUNCTION_EXISTS=setresuid    -Wl,--whole-archive CMakeFiles/cmTC_d316f.dir/objects.a -Wl,--no-whole-archive  -o cmTC_d316f.exe -Wl,--major-image-version,0,--minor-image-version,0 -liphlpapi -lws2_32 -lkernel32 -luser32 -lgdi32 -lwinspool -lshell32 -lole32 -loleaut32 -luuid -lcomdlg32 -ladvapi32 
CMakeFiles/cmTC_d316f.dir/objects.a(CheckFunctionExists.c.obj):CheckFunctionExists.c:(.text+0xc): undefined reference to `setresuid'

collect2.exe: error: ld returned 1 exit status

make[2]: *** [CMakeFiles/cmTC_d316f.dir/build.make:88: cmTC_d316f.exe] Error 1
make[2]: Leaving directory '/home/buildbot/slave/monero-static-win32/build/build/release/CMakeFiles/CMakeTmp'
make[1]: *** [Makefile:121: cmTC_d316f/fast] Error 2
make[1]: Leaving directory '/home/buildbot/slave/monero-static-win32/build/build/release/CMakeFiles/CMakeTmp'


Determining if the function setreuid exists failed with the following output:
Change Dir: C:/msys32/home/buildbot/slave/monero-static-win32/build/build/release/CMakeFiles/CMakeTmp

Run Build Command:"C:/msys32/usr/bin/make.exe" "cmTC_d91e3/fast"
make[1]: Entering directory '/home/buildbot/slave/monero-static-win32/build/build/release/CMakeFiles/CMakeTmp'
/usr/bin/make -f CMakeFiles/cmTC_d91e3.dir/build.make CMakeFiles/cmTC_d91e3.dir/build
make[2]: Entering directory '/home/buildbot/slave/monero-static-win32/build/build/release/CMakeFiles/CMakeTmp'
Building C object CMakeFiles/cmTC_d91e3.dir/CheckFunctionExists.c.obj

/C/msys32/mingw32/bin/i686-w64-mingw32-gcc.exe   -DCHECK_FUNCTION_EXISTS=setreuid   -o CMakeFiles/cmTC_d91e3.dir/CheckFunctionExists.c.obj   -c /C/msys32/mingw32/share/cmake-3.12/Modules/CheckFunctionExists.c
Linking C executable cmTC_d91e3.exe

/C/msys32/mingw32/bin/cmake.exe -E remove -f CMakeFiles/cmTC_d91e3.dir/objects.a
ar cr CMakeFiles/cmTC_d91e3.dir/objects.a "CMakeFiles/cmTC_d91e3.dir/CheckFunctionExists.c.obj" 
/C/msys32/mingw32/bin/i686-w64-mingw32-gcc.exe  -DCHECK_FUNCTION_EXISTS=setreuid    -Wl,--whole-archive CMakeFiles/cmTC_d91e3.dir/objects.a -Wl,--no-whole-archive  -o cmTC_d91e3.exe -Wl,--major-image-version,0,--minor-image-version,0 -liphlpapi -lws2_32 -lkernel32 -luser32 -lgdi32 -lwinspool -lshell32 -lole32 -loleaut32 -luuid -lcomdlg32 -ladvapi32 
CMakeFiles/cmTC_d91e3.dir/objects.a(CheckFunctionExists.c.obj):CheckFunctionExists.c:(.text+0xc): undefined reference to `setreuid'

collect2.exe: error: ld returned 1 exit status

make[2]: *** [CMakeFiles/cmTC_d91e3.dir/build.make:88: cmTC_d91e3.exe] Error 1
make[2]: Leaving directory '/home/buildbot/slave/monero-static-win32/build/build/release/CMakeFiles/CMakeTmp'
make[1]: *** [Makefile:121: cmTC_d91e3/fast] Error 2
make[1]: Leaving directory '/home/buildbot/slave/monero-static-win32/build/build/release/CMakeFiles/CMakeTmp'


Determining if the function setrlimit exists failed with the following output:
Change Dir: C:/msys32/home/buildbot/slave/monero-static-win32/build/build/release/CMakeFiles/CMakeTmp

Run Build Command:"C:/msys32/usr/bin/make.exe" "cmTC_9a228/fast"
make[1]: Entering directory '/home/buildbot/slave/monero-static-win32/build/build/release/CMakeFiles/CMakeTmp'
/usr/bin/make -f CMakeFiles/cmTC_9a228.dir/build.make CMakeFiles/cmTC_9a228.dir/build
make[2]: Entering directory '/home/buildbot/slave/monero-static-win32/build/build/release/CMakeFiles/CMakeTmp'
Building C object CMakeFiles/cmTC_9a228.dir/CheckFunctionExists.c.obj

/C/msys32/mingw32/bin/i686-w64-mingw32-gcc.exe   -DCHECK_FUNCTION_EXISTS=setrlimit   -o CMakeFiles/cmTC_9a228.dir/CheckFunctionExists.c.obj   -c /C/msys32/mingw32/share/cmake-3.12/Modules/CheckFunctionExists.c
Linking C executable cmTC_9a228.exe

/C/msys32/mingw32/bin/cmake.exe -E remove -f CMakeFiles/cmTC_9a228.dir/objects.a
ar cr CMakeFiles/cmTC_9a228.dir/objects.a "CMakeFiles/cmTC_9a228.dir/CheckFunctionExists.c.obj" 
/C/msys32/mingw32/bin/i686-w64-mingw32-gcc.exe  -DCHECK_FUNCTION_EXISTS=setrlimit    -Wl,--whole-archive CMakeFiles/cmTC_9a228.dir/objects.a -Wl,--no-whole-archive  -o cmTC_9a228.exe -Wl,--major-image-version,0,--minor-image-version,0 -liphlpapi -lws2_32 -lkernel32 -luser32 -lgdi32 -lwinspool -lshell32 -lole32 -loleaut32 -luuid -lcomdlg32 -ladvapi32 
CMakeFiles/cmTC_9a228.dir/objects.a(CheckFunctionExists.c.obj):CheckFunctionExists.c:(.text+0xc): undefined reference to `setrlimit'

collect2.exe: error: ld returned 1 exit status

make[2]: *** [CMakeFiles/cmTC_9a228.dir/build.make:88: cmTC_9a228.exe] Error 1
make[2]: Leaving directory '/home/buildbot/slave/monero-static-win32/build/build/release/CMakeFiles/CMakeTmp'
make[1]: *** [Makefile:121: cmTC_9a228/fast] Error 2
make[1]: Leaving directory '/home/buildbot/slave/monero-static-win32/build/build/release/CMakeFiles/CMakeTmp'


Determining if the function setsid exists failed with the following output:
Change Dir: C:/msys32/home/buildbot/slave/monero-static-win32/build/build/release/CMakeFiles/CMakeTmp

Run Build Command:"C:/msys32/usr/bin/make.exe" "cmTC_d3700/fast"
make[1]: Entering directory '/home/buildbot/slave/monero-static-win32/build/build/release/CMakeFiles/CMakeTmp'
/usr/bin/make -f CMakeFiles/cmTC_d3700.dir/build.make CMakeFiles/cmTC_d3700.dir/build
make[2]: Entering directory '/home/buildbot/slave/monero-static-win32/build/build/release/CMakeFiles/CMakeTmp'
Building C object CMakeFiles/cmTC_d3700.dir/CheckFunctionExists.c.obj

/C/msys32/mingw32/bin/i686-w64-mingw32-gcc.exe   -DCHECK_FUNCTION_EXISTS=setsid   -o CMakeFiles/cmTC_d3700.dir/CheckFunctionExists.c.obj   -c /C/msys32/mingw32/share/cmake-3.12/Modules/CheckFunctionExists.c
Linking C executable cmTC_d3700.exe

/C/msys32/mingw32/bin/cmake.exe -E remove -f CMakeFiles/cmTC_d3700.dir/objects.a
ar cr CMakeFiles/cmTC_d3700.dir/objects.a "CMakeFiles/cmTC_d3700.dir/CheckFunctionExists.c.obj" 
/C/msys32/mingw32/bin/i686-w64-mingw32-gcc.exe  -DCHECK_FUNCTION_EXISTS=setsid    -Wl,--whole-archive CMakeFiles/cmTC_d3700.dir/objects.a -Wl,--no-whole-archive  -o cmTC_d3700.exe -Wl,--major-image-version,0,--minor-image-version,0 -liphlpapi -lws2_32 -lkernel32 -luser32 -lgdi32 -lwinspool -lshell32 -lole32 -loleaut32 -luuid -lcomdlg32 -ladvapi32 
CMakeFiles/cmTC_d3700.dir/objects.a(CheckFunctionExists.c.obj):CheckFunctionExists.c:(.text+0xc): undefined reference to `setsid'

collect2.exe: error: ld returned 1 exit status

make[2]: *** [CMakeFiles/cmTC_d3700.dir/build.make:88: cmTC_d3700.exe] Error 1
make[2]: Leaving directory '/home/buildbot/slave/monero-static-win32/build/build/release/CMakeFiles/CMakeTmp'
make[1]: *** [Makefile:121: cmTC_d3700/fast] Error 2
make[1]: Leaving directory '/home/buildbot/slave/monero-static-win32/build/build/release/CMakeFiles/CMakeTmp'


Determining if the function setusercontent exists failed with the following output:
Change Dir: C:/msys32/home/buildbot/slave/monero-static-win32/build/build/release/CMakeFiles/CMakeTmp

Run Build Command:"C:/msys32/usr/bin/make.exe" "cmTC_0c783/fast"
make[1]: Entering directory '/home/buildbot/slave/monero-static-win32/build/build/release/CMakeFiles/CMakeTmp'
/usr/bin/make -f CMakeFiles/cmTC_0c783.dir/build.make CMakeFiles/cmTC_0c783.dir/build
make[2]: Entering directory '/home/buildbot/slave/monero-static-win32/build/build/release/CMakeFiles/CMakeTmp'
Building C object CMakeFiles/cmTC_0c783.dir/CheckFunctionExists.c.obj

/C/msys32/mingw32/bin/i686-w64-mingw32-gcc.exe   -DCHECK_FUNCTION_EXISTS=setusercontent   -o CMakeFiles/cmTC_0c783.dir/CheckFunctionExists.c.obj   -c /C/msys32/mingw32/share/cmake-3.12/Modules/CheckFunctionExists.c
Linking C executable cmTC_0c783.exe

/C/msys32/mingw32/bin/cmake.exe -E remove -f CMakeFiles/cmTC_0c783.dir/objects.a
ar cr CMakeFiles/cmTC_0c783.dir/objects.a "CMakeFiles/cmTC_0c783.dir/CheckFunctionExists.c.obj" 
/C/msys32/mingw32/bin/i686-w64-mingw32-gcc.exe  -DCHECK_FUNCTION_EXISTS=setusercontent    -Wl,--whole-archive CMakeFiles/cmTC_0c783.dir/objects.a -Wl,--no-whole-archive  -o cmTC_0c783.exe -Wl,--major-image-version,0,--minor-image-version,0 -liphlpapi -lws2_32 -lkernel32 -luser32 -lgdi32 -lwinspool -lshell32 -lole32 -loleaut32 -luuid -lcomdlg32 -ladvapi32 
CMakeFiles/cmTC_0c783.dir/objects.a(CheckFunctionExists.c.obj):CheckFunctionExists.c:(.text+0xc): undefined reference to `setusercontent'

collect2.exe: error: ld returned 1 exit status

make[2]: *** [CMakeFiles/cmTC_0c783.dir/build.make:88: cmTC_0c783.exe] Error 1
make[2]: Leaving directory '/home/buildbot/slave/monero-static-win32/build/build/release/CMakeFiles/CMakeTmp'
make[1]: *** [Makefile:121: cmTC_0c783/fast] Error 2
make[1]: Leaving directory '/home/buildbot/slave/monero-static-win32/build/build/release/CMakeFiles/CMakeTmp'


Determining if the function sigprocmask exists failed with the following output:
Change Dir: C:/msys32/home/buildbot/slave/monero-static-win32/build/build/release/CMakeFiles/CMakeTmp

Run Build Command:"C:/msys32/usr/bin/make.exe" "cmTC_78c26/fast"
make[1]: Entering directory '/home/buildbot/slave/monero-static-win32/build/build/release/CMakeFiles/CMakeTmp'
/usr/bin/make -f CMakeFiles/cmTC_78c26.dir/build.make CMakeFiles/cmTC_78c26.dir/build
make[2]: Entering directory '/home/buildbot/slave/monero-static-win32/build/build/release/CMakeFiles/CMakeTmp'
Building C object CMakeFiles/cmTC_78c26.dir/CheckFunctionExists.c.obj

/C/msys32/mingw32/bin/i686-w64-mingw32-gcc.exe   -DCHECK_FUNCTION_EXISTS=sigprocmask   -o CMakeFiles/cmTC_78c26.dir/CheckFunctionExists.c.obj   -c /C/msys32/mingw32/share/cmake-3.12/Modules/CheckFunctionExists.c
Linking C executable cmTC_78c26.exe

/C/msys32/mingw32/bin/cmake.exe -E remove -f CMakeFiles/cmTC_78c26.dir/objects.a
ar cr CMakeFiles/cmTC_78c26.dir/objects.a "CMakeFiles/cmTC_78c26.dir/CheckFunctionExists.c.obj" 
/C/msys32/mingw32/bin/i686-w64-mingw32-gcc.exe  -DCHECK_FUNCTION_EXISTS=sigprocmask    -Wl,--whole-archive CMakeFiles/cmTC_78c26.dir/objects.a -Wl,--no-whole-archive  -o cmTC_78c26.exe -Wl,--major-image-version,0,--minor-image-version,0 -liphlpapi -lws2_32 -lkernel32 -luser32 -lgdi32 -lwinspool -lshell32 -lole32 -loleaut32 -luuid -lcomdlg32 -ladvapi32 
CMakeFiles/cmTC_78c26.dir/objects.a(CheckFunctionExists.c.obj):CheckFunctionExists.c:(.text+0xc): undefined reference to `sigprocmask'

collect2.exe: error: ld returned 1 exit status

make[2]: *** [CMakeFiles/cmTC_78c26.dir/build.make:88: cmTC_78c26.exe] Error 1
make[2]: Leaving directory '/home/buildbot/slave/monero-static-win32/build/build/release/CMakeFiles/CMakeTmp'
make[1]: *** [Makefile:121: cmTC_78c26/fast] Error 2
make[1]: Leaving directory '/home/buildbot/slave/monero-static-win32/build/build/release/CMakeFiles/CMakeTmp'


Determining if the function socketpair exists failed with the following output:
Change Dir: C:/msys32/home/buildbot/slave/monero-static-win32/build/build/release/CMakeFiles/CMakeTmp


Run Build Command:"C:/msys32/usr/bin/make.exe" "cmTC_fb78a/fast"
make[1]: Entering directory '/home/buildbot/slave/monero-static-win32/build/build/release/CMakeFiles/CMakeTmp'
/usr/bin/make -f CMakeFiles/cmTC_fb78a.dir/build.make CMakeFiles/cmTC_fb78a.dir/build
make[2]: Entering directory '/home/buildbot/slave/monero-static-win32/build/build/release/CMakeFiles/CMakeTmp'
Building C object CMakeFiles/cmTC_fb78a.dir/CheckFunctionExists.c.obj

/C/msys32/mingw32/bin/i686-w64-mingw32-gcc.exe   -DCHECK_FUNCTION_EXISTS=socketpair   -o CMakeFiles/cmTC_fb78a.dir/CheckFunctionExists.c.obj   -c /C/msys32/mingw32/share/cmake-3.12/Modules/CheckFunctionExists.c
Linking C executable cmTC_fb78a.exe

/C/msys32/mingw32/bin/cmake.exe -E remove -f CMakeFiles/cmTC_fb78a.dir/objects.a
ar cr CMakeFiles/cmTC_fb78a.dir/objects.a "CMakeFiles/cmTC_fb78a.dir/CheckFunctionExists.c.obj" 
/C/msys32/mingw32/bin/i686-w64-mingw32-gcc.exe  -DCHECK_FUNCTION_EXISTS=socketpair    -Wl,--whole-archive CMakeFiles/cmTC_fb78a.dir/objects.a -Wl,--no-whole-archive  -o cmTC_fb78a.exe -Wl,--major-image-version,0,--minor-image-version,0 -liphlpapi -lws2_32 -lkernel32 -luser32 -lgdi32 -lwinspool -lshell32 -lole32 -loleaut32 -luuid -lcomdlg32 -ladvapi32 
CMakeFiles/cmTC_fb78a.dir/objects.a(CheckFunctionExists.c.obj):CheckFunctionExists.c:(.text+0xc): undefined reference to `socketpair'

collect2.exe: error: ld returned 1 exit status

make[2]: *** [CMakeFiles/cmTC_fb78a.dir/build.make:88: cmTC_fb78a.exe] Error 1
make[2]: Leaving directory '/home/buildbot/slave/monero-static-win32/build/build/release/CMakeFiles/CMakeTmp'
make[1]: *** [Makefile:121: cmTC_fb78a/fast] Error 2
make[1]: Leaving directory '/home/buildbot/slave/monero-static-win32/build/build/release/CMakeFiles/CMakeTmp'


Determining if the function srandom exists failed with the following output:
Change Dir: C:/msys32/home/buildbot/slave/monero-static-win32/build/build/release/CMakeFiles/CMakeTmp

Run Build Command:"C:/msys32/usr/bin/make.exe" "cmTC_ccc31/fast"
make[1]: Entering directory '/home/buildbot/slave/monero-static-win32/build/build/release/CMakeFiles/CMakeTmp'
/usr/bin/make -f CMakeFiles/cmTC_ccc31.dir/build.make CMakeFiles/cmTC_ccc31.dir/build
make[2]: Entering directory '/home/buildbot/slave/monero-static-win32/build/build/release/CMakeFiles/CMakeTmp'
Building C object CMakeFiles/cmTC_ccc31.dir/CheckFunctionExists.c.obj

/C/msys32/mingw32/bin/i686-w64-mingw32-gcc.exe   -DCHECK_FUNCTION_EXISTS=srandom   -o CMakeFiles/cmTC_ccc31.dir/CheckFunctionExists.c.obj   -c /C/msys32/mingw32/share/cmake-3.12/Modules/CheckFunctionExists.c
Linking C executable cmTC_ccc31.exe

/C/msys32/mingw32/bin/cmake.exe -E remove -f CMakeFiles/cmTC_ccc31.dir/objects.a
ar cr CMakeFiles/cmTC_ccc31.dir/objects.a "CMakeFiles/cmTC_ccc31.dir/CheckFunctionExists.c.obj" 
/C/msys32/mingw32/bin/i686-w64-mingw32-gcc.exe  -DCHECK_FUNCTION_EXISTS=srandom    -Wl,--whole-archive CMakeFiles/cmTC_ccc31.dir/objects.a -Wl,--no-whole-archive  -o cmTC_ccc31.exe -Wl,--major-image-version,0,--minor-image-version,0 -liphlpapi -lws2_32 -lkernel32 -luser32 -lgdi32 -lwinspool -lshell32 -lole32 -loleaut32 -luuid -lcomdlg32 -ladvapi32 
CMakeFiles/cmTC_ccc31.dir/objects.a(CheckFunctionExists.c.obj):CheckFunctionExists.c:(.text+0xc): undefined reference to `srandom'

collect2.exe: error: ld returned 1 exit status

make[2]: *** [CMakeFiles/cmTC_ccc31.dir/build.make:88: cmTC_ccc31.exe] Error 1
make[2]: Leaving directory '/home/buildbot/slave/monero-static-win32/build/build/release/CMakeFiles/CMakeTmp'
make[1]: *** [Makefile:121: cmTC_ccc31/fast] Error 2
make[1]: Leaving directory '/home/buildbot/slave/monero-static-win32/build/build/release/CMakeFiles/CMakeTmp'


Determining if the function strsep exists failed with the following output:
Change Dir: C:/msys32/home/buildbot/slave/monero-static-win32/build/build/release/CMakeFiles/CMakeTmp

Run Build Command:"C:/msys32/usr/bin/make.exe" "cmTC_529ad/fast"
make[1]: Entering directory '/home/buildbot/slave/monero-static-win32/build/build/release/CMakeFiles/CMakeTmp'
/usr/bin/make -f CMakeFiles/cmTC_529ad.dir/build.make CMakeFiles/cmTC_529ad.dir/build
make[2]: Entering directory '/home/buildbot/slave/monero-static-win32/build/build/release/CMakeFiles/CMakeTmp'
Building C object CMakeFiles/cmTC_529ad.dir/CheckFunctionExists.c.obj

/C/msys32/mingw32/bin/i686-w64-mingw32-gcc.exe   -DCHECK_FUNCTION_EXISTS=strsep   -o CMakeFiles/cmTC_529ad.dir/CheckFunctionExists.c.obj   -c /C/msys32/mingw32/share/cmake-3.12/Modules/CheckFunctionExists.c
Linking C executable cmTC_529ad.exe

/C/msys32/mingw32/bin/cmake.exe -E remove -f CMakeFiles/cmTC_529ad.dir/objects.a
ar cr CMakeFiles/cmTC_529ad.dir/objects.a "CMakeFiles/cmTC_529ad.dir/CheckFunctionExists.c.obj" 
/C/msys32/mingw32/bin/i686-w64-mingw32-gcc.exe  -DCHECK_FUNCTION_EXISTS=strsep    -Wl,--whole-archive CMakeFiles/cmTC_529ad.dir/objects.a -Wl,--no-whole-archive  -o cmTC_529ad.exe -Wl,--major-image-version,0,--minor-image-version,0 -liphlpapi -lws2_32 -lkernel32 -luser32 -lgdi32 -lwinspool -lshell32 -lole32 -loleaut32 -luuid -lcomdlg32 -ladvapi32 
CMakeFiles/cmTC_529ad.dir/objects.a(CheckFunctionExists.c.obj):CheckFunctionExists.c:(.text+0xc): undefined reference to `strsep'

collect2.exe: error: ld returned 1 exit status

make[2]: *** [CMakeFiles/cmTC_529ad.dir/build.make:88: cmTC_529ad.exe] Error 1
make[2]: Leaving directory '/home/buildbot/slave/monero-static-win32/build/build/release/CMakeFiles/CMakeTmp'
make[1]: *** [Makefile:121: cmTC_529ad/fast] Error 2
make[1]: Leaving directory '/home/buildbot/slave/monero-static-win32/build/build/release/CMakeFiles/CMakeTmp'


Determining if the function strlcat exists failed with the following output:
Change Dir: C:/msys32/home/buildbot/slave/monero-static-win32/build/build/release/CMakeFiles/CMakeTmp

Run Build Command:"C:/msys32/usr/bin/make.exe" "cmTC_a675f/fast"
make[1]: Entering directory '/home/buildbot/slave/monero-static-win32/build/build/release/CMakeFiles/CMakeTmp'
/usr/bin/make -f CMakeFiles/cmTC_a675f.dir/build.make CMakeFiles/cmTC_a675f.dir/build
make[2]: Entering directory '/home/buildbot/slave/monero-static-win32/build/build/release/CMakeFiles/CMakeTmp'
Building C object CMakeFiles/cmTC_a675f.dir/CheckFunctionExists.c.obj

/C/msys32/mingw32/bin/i686-w64-mingw32-gcc.exe   -DCHECK_FUNCTION_EXISTS=strlcat   -o CMakeFiles/cmTC_a675f.dir/CheckFunctionExists.c.obj   -c /C/msys32/mingw32/share/cmake-3.12/Modules/CheckFunctionExists.c
Linking C executable cmTC_a675f.exe

/C/msys32/mingw32/bin/cmake.exe -E remove -f CMakeFiles/cmTC_a675f.dir/objects.a
ar cr CMakeFiles/cmTC_a675f.dir/objects.a "CMakeFiles/cmTC_a675f.dir/CheckFunctionExists.c.obj" 
/C/msys32/mingw32/bin/i686-w64-mingw32-gcc.exe  -DCHECK_FUNCTION_EXISTS=strlcat    -Wl,--whole-archive CMakeFiles/cmTC_a675f.dir/objects.a -Wl,--no-whole-archive  -o cmTC_a675f.exe -Wl,--major-image-version,0,--minor-image-version,0 -liphlpapi -lws2_32 -lkernel32 -luser32 -lgdi32 -lwinspool -lshell32 -lole32 -loleaut32 -luuid -lcomdlg32 -ladvapi32 
CMakeFiles/cmTC_a675f.dir/objects.a(CheckFunctionExists.c.obj):CheckFunctionExists.c:(.text+0xc): undefined reference to `strlcat'

collect2.exe: error: ld returned 1 exit status

make[2]: *** [CMakeFiles/cmTC_a675f.dir/build.make:88: cmTC_a675f.exe] Error 1
make[2]: Leaving directory '/home/buildbot/slave/monero-static-win32/build/build/release/CMakeFiles/CMakeTmp'
make[1]: *** [Makefile:121: cmTC_a675f/fast] Error 2
make[1]: Leaving directory '/home/buildbot/slave/monero-static-win32/build/build/release/CMakeFiles/CMakeTmp'


Determining if the function strlcpy exists failed with the following output:
Change Dir: C:/msys32/home/buildbot/slave/monero-static-win32/build/build/release/CMakeFiles/CMakeTmp

Run Build Command:"C:/msys32/usr/bin/make.exe" "cmTC_698b3/fast"
make[1]: Entering directory '/home/buildbot/slave/monero-static-win32/build/build/release/CMakeFiles/CMakeTmp'
/usr/bin/make -f CMakeFiles/cmTC_698b3.dir/build.make CMakeFiles/cmTC_698b3.dir/build
make[2]: Entering directory '/home/buildbot/slave/monero-static-win32/build/build/release/CMakeFiles/CMakeTmp'
Building C object CMakeFiles/cmTC_698b3.dir/CheckFunctionExists.c.obj

/C/msys32/mingw32/bin/i686-w64-mingw32-gcc.exe   -DCHECK_FUNCTION_EXISTS=strlcpy   -o CMakeFiles/cmTC_698b3.dir/CheckFunctionExists.c.obj   -c /C/msys32/mingw32/share/cmake-3.12/Modules/CheckFunctionExists.c
Linking C executable cmTC_698b3.exe

/C/msys32/mingw32/bin/cmake.exe -E remove -f CMakeFiles/cmTC_698b3.dir/objects.a
ar cr CMakeFiles/cmTC_698b3.dir/objects.a "CMakeFiles/cmTC_698b3.dir/CheckFunctionExists.c.obj" 
/C/msys32/mingw32/bin/i686-w64-mingw32-gcc.exe  -DCHECK_FUNCTION_EXISTS=strlcpy    -Wl,--whole-archive CMakeFiles/cmTC_698b3.dir/objects.a -Wl,--no-whole-archive  -o cmTC_698b3.exe -Wl,--major-image-version,0,--minor-image-version,0 -liphlpapi -lws2_32 -lkernel32 -luser32 -lgdi32 -lwinspool -lshell32 -lole32 -loleaut32 -luuid -lcomdlg32 -ladvapi32 
CMakeFiles/cmTC_698b3.dir/objects.a(CheckFunctionExists.c.obj):CheckFunctionExists.c:(.text+0xc): undefined reference to `strlcpy'

collect2.exe: error: ld returned 1 exit status

make[2]: *** [CMakeFiles/cmTC_698b3.dir/build.make:88: cmTC_698b3.exe] Error 1
make[2]: Leaving directory '/home/buildbot/slave/monero-static-win32/build/build/release/CMakeFiles/CMakeTmp'
make[1]: *** [Makefile:121: cmTC_698b3/fast] Error 2
make[1]: Leaving directory '/home/buildbot/slave/monero-static-win32/build/build/release/CMakeFiles/CMakeTmp'


Determining if the function strptime exists failed with the following output:
Change Dir: C:/msys32/home/buildbot/slave/monero-static-win32/build/build/release/CMakeFiles/CMakeTmp

Run Build Command:"C:/msys32/usr/bin/make.exe" "cmTC_b6b3c/fast"
make[1]: Entering directory '/home/buildbot/slave/monero-static-win32/build/build/release/CMakeFiles/CMakeTmp'
/usr/bin/make -f CMakeFiles/cmTC_b6b3c.dir/build.make CMakeFiles/cmTC_b6b3c.dir/build
make[2]: Entering directory '/home/buildbot/slave/monero-static-win32/build/build/release/CMakeFiles/CMakeTmp'
Building C object CMakeFiles/cmTC_b6b3c.dir/CheckFunctionExists.c.obj

/C/msys32/mingw32/bin/i686-w64-mingw32-gcc.exe   -DCHECK_FUNCTION_EXISTS=strptime   -o CMakeFiles/cmTC_b6b3c.dir/CheckFunctionExists.c.obj   -c /C/msys32/mingw32/share/cmake-3.12/Modules/CheckFunctionExists.c
Linking C executable cmTC_b6b3c.exe

/C/msys32/mingw32/bin/cmake.exe -E remove -f CMakeFiles/cmTC_b6b3c.dir/objects.a
ar cr CMakeFiles/cmTC_b6b3c.dir/objects.a "CMakeFiles/cmTC_b6b3c.dir/CheckFunctionExists.c.obj" 
/C/msys32/mingw32/bin/i686-w64-mingw32-gcc.exe  -DCHECK_FUNCTION_EXISTS=strptime    -Wl,--whole-archive CMakeFiles/cmTC_b6b3c.dir/objects.a -Wl,--no-whole-archive  -o cmTC_b6b3c.exe -Wl,--major-image-version,0,--minor-image-version,0 -liphlpapi -lws2_32 -lkernel32 -luser32 -lgdi32 -lwinspool -lshell32 -lole32 -loleaut32 -luuid -lcomdlg32 -ladvapi32 
CMakeFiles/cmTC_b6b3c.dir/objects.a(CheckFunctionExists.c.obj):CheckFunctionExists.c:(.text+0xc): undefined reference to `strptime'

collect2.exe: error: ld returned 1 exit status

make[2]: *** [CMakeFiles/cmTC_b6b3c.dir/build.make:88: cmTC_b6b3c.exe] Error 1
make[2]: Leaving directory '/home/buildbot/slave/monero-static-win32/build/build/release/CMakeFiles/CMakeTmp'
make[1]: *** [Makefile:121: cmTC_b6b3c/fast] Error 2
make[1]: Leaving directory '/home/buildbot/slave/monero-static-win32/build/build/release/CMakeFiles/CMakeTmp'


Determining if the function writev exists failed with the following output:
Change Dir: C:/msys32/home/buildbot/slave/monero-static-win32/build/build/release/CMakeFiles/CMakeTmp

Run Build Command:"C:/msys32/usr/bin/make.exe" "cmTC_17f98/fast"
make[1]: Entering directory '/home/buildbot/slave/monero-static-win32/build/build/release/CMakeFiles/CMakeTmp'
/usr/bin/make -f CMakeFiles/cmTC_17f98.dir/build.make CMakeFiles/cmTC_17f98.dir/build
make[2]: Entering directory '/home/buildbot/slave/monero-static-win32/build/build/release/CMakeFiles/CMakeTmp'
Building C object CMakeFiles/cmTC_17f98.dir/CheckFunctionExists.c.obj

/C/msys32/mingw32/bin/i686-w64-mingw32-gcc.exe   -DCHECK_FUNCTION_EXISTS=writev   -o CMakeFiles/cmTC_17f98.dir/CheckFunctionExists.c.obj   -c /C/msys32/mingw32/share/cmake-3.12/Modules/CheckFunctionExists.c
Linking C executable cmTC_17f98.exe

/C/msys32/mingw32/bin/cmake.exe -E remove -f CMakeFiles/cmTC_17f98.dir/objects.a
ar cr CMakeFiles/cmTC_17f98.dir/objects.a "CMakeFiles/cmTC_17f98.dir/CheckFunctionExists.c.obj" 
/C/msys32/mingw32/bin/i686-w64-mingw32-gcc.exe  -DCHECK_FUNCTION_EXISTS=writev    -Wl,--whole-archive CMakeFiles/cmTC_17f98.dir/objects.a -Wl,--no-whole-archive  -o cmTC_17f98.exe -Wl,--major-image-version,0,--minor-image-version,0 -liphlpapi -lws2_32 -lkernel32 -luser32 -lgdi32 -lwinspool -lshell32 -lole32 -loleaut32 -luuid -lcomdlg32 -ladvapi32 
CMakeFiles/cmTC_17f98.dir/objects.a(CheckFunctionExists.c.obj):CheckFunctionExists.c:(.text+0xc): undefined reference to `writev'

collect2.exe: error: ld returned 1 exit status

make[2]: *** [CMakeFiles/cmTC_17f98.dir/build.make:88: cmTC_17f98.exe] Error 1
make[2]: Leaving directory '/home/buildbot/slave/monero-static-win32/build/build/release/CMakeFiles/CMakeTmp'
make[1]: *** [Makefile:121: cmTC_17f98/fast] Error 2
make[1]: Leaving directory '/home/buildbot/slave/monero-static-win32/build/build/release/CMakeFiles/CMakeTmp'


Determining size of gid_t failed with the following output:
Change Dir: C:/msys32/home/buildbot/slave/monero-static-win32/build/build/release/CMakeFiles/CMakeTmp

Run Build Command:"C:/msys32/usr/bin/make.exe" "cmTC_5bcce/fast"
make[1]: Entering directory '/home/buildbot/slave/monero-static-win32/build/build/release/CMakeFiles/CMakeTmp'
/usr/bin/make -f CMakeFiles/cmTC_5bcce.dir/build.make CMakeFiles/cmTC_5bcce.dir/build
make[2]: Entering directory '/home/buildbot/slave/monero-static-win32/build/build/release/CMakeFiles/CMakeTmp'
Building C object CMakeFiles/cmTC_5bcce.dir/gid_t.c.obj

/C/msys32/mingw32/bin/i686-w64-mingw32-gcc.exe    -o CMakeFiles/cmTC_5bcce.dir/gid_t.c.obj   -c /C/msys32/home/buildbot/slave/monero-static-win32/build/build/release/CMakeFiles/CheckTypeSize/gid_t.c
C:/msys32/home/buildbot/slave/monero-static-win32/build/build/release/CMakeFiles/CheckTypeSize/gid_t.c:24:22: error: 'gid_t' undeclared here (not in a function); did you mean 'pid_t'?

 #define SIZE (sizeof(gid_t))

                      ^

C:/msys32/home/buildbot/slave/monero-static-win32/build/build/release/CMakeFiles/CheckTypeSize/gid_t.c:26:12: note: in expansion of macro 'SIZE'

   ('0' + ((SIZE / 10000)%10)),

            ^~~~

make[2]: *** [CMakeFiles/cmTC_5bcce.dir/build.make:66: CMakeFiles/cmTC_5bcce.dir/gid_t.c.obj] Error 1
make[2]: Leaving directory '/home/buildbot/slave/monero-static-win32/build/build/release/CMakeFiles/CMakeTmp'
make[1]: *** [Makefile:121: cmTC_5bcce/fast] Error 2
make[1]: Leaving directory '/home/buildbot/slave/monero-static-win32/build/build/release/CMakeFiles/CMakeTmp'

C:/msys32/home/buildbot/slave/monero-static-win32/build/build/release/CMakeFiles/CheckTypeSize/gid_t.c:
#include <sys/types.h>
#include <stdint.h>
#include <stddef.h>
#include "sys/types.h"


#undef KEY
#if defined(__i386)
# define KEY '_','_','i','3','8','6'
#elif defined(__x86_64)
# define KEY '_','_','x','8','6','_','6','4'
#elif defined(__ppc__)
# define KEY '_','_','p','p','c','_','_'
#elif defined(__ppc64__)
# define KEY '_','_','p','p','c','6','4','_','_'
#elif defined(__aarch64__)
# define KEY '_','_','a','a','r','c','h','6','4','_','_'
#elif defined(__ARM_ARCH_7A__)
# define KEY '_','_','A','R','M','_','A','R','C','H','_','7','A','_','_'
#elif defined(__ARM_ARCH_7S__)
# define KEY '_','_','A','R','M','_','A','R','C','H','_','7','S','_','_'
#endif

#define SIZE (sizeof(gid_t))
char info_size[] =  {'I', 'N', 'F', 'O', ':', 's','i','z','e','[',
  ('0' + ((SIZE / 10000)%10)),
  ('0' + ((SIZE / 1000)%10)),
  ('0' + ((SIZE / 100)%10)),
  ('0' + ((SIZE / 10)%10)),
  ('0' +  (SIZE    % 10)),
  ']',
#ifdef KEY
  ' ','k','e','y','[', KEY, ']',
#endif
  '\0'};

#ifdef __CLASSIC_C__
int main(argc, argv) int argc; char *argv[];
#else
int main(int argc, char *argv[])
#endif
{
  int require = 0;
  require += info_size[argc];
  (void)argv;
  return require;
}


Determining size of in_addr_t failed with the following output:
Change Dir: C:/msys32/home/buildbot/slave/monero-static-win32/build/build/release/CMakeFiles/CMakeTmp

Run Build Command:"C:/msys32/usr/bin/make.exe" "cmTC_99ab1/fast"
make[1]: Entering directory '/home/buildbot/slave/monero-static-win32/build/build/release/CMakeFiles/CMakeTmp'
/usr/bin/make -f CMakeFiles/cmTC_99ab1.dir/build.make CMakeFiles/cmTC_99ab1.dir/build
make[2]: Entering directory '/home/buildbot/slave/monero-static-win32/build/build/release/CMakeFiles/CMakeTmp'
Building C object CMakeFiles/cmTC_99ab1.dir/in_addr_t.c.obj

/C/msys32/mingw32/bin/i686-w64-mingw32-gcc.exe    -o CMakeFiles/cmTC_99ab1.dir/in_addr_t.c.obj   -c /C/msys32/home/buildbot/slave/monero-static-win32/build/build/release/CMakeFiles/CheckTypeSize/in_addr_t.c
C:/msys32/home/buildbot/slave/monero-static-win32/build/build/release/CMakeFiles/CheckTypeSize/in_addr_t.c:4:10: fatal error: netinet/in.h: No such file or directory

 #include "netinet/in.h"

          ^~~~~~~~~~~~~~

compilation terminated.

make[2]: *** [CMakeFiles/cmTC_99ab1.dir/build.make:66: CMakeFiles/cmTC_99ab1.dir/in_addr_t.c.obj] Error 1
make[2]: Leaving directory '/home/buildbot/slave/monero-static-win32/build/build/release/CMakeFiles/CMakeTmp'
make[1]: *** [Makefile:121: cmTC_99ab1/fast] Error 2
make[1]: Leaving directory '/home/buildbot/slave/monero-static-win32/build/build/release/CMakeFiles/CMakeTmp'

C:/msys32/home/buildbot/slave/monero-static-win32/build/build/release/CMakeFiles/CheckTypeSize/in_addr_t.c:
#include <sys/types.h>
#include <stdint.h>
#include <stddef.h>
#include "netinet/in.h"


#undef KEY
#if defined(__i386)
# define KEY '_','_','i','3','8','6'
#elif defined(__x86_64)
# define KEY '_','_','x','8','6','_','6','4'
#elif defined(__ppc__)
# define KEY '_','_','p','p','c','_','_'
#elif defined(__ppc64__)
# define KEY '_','_','p','p','c','6','4','_','_'
#elif defined(__aarch64__)
# define KEY '_','_','a','a','r','c','h','6','4','_','_'
#elif defined(__ARM_ARCH_7A__)
# define KEY '_','_','A','R','M','_','A','R','C','H','_','7','A','_','_'
#elif defined(__ARM_ARCH_7S__)
# define KEY '_','_','A','R','M','_','A','R','C','H','_','7','S','_','_'
#endif

#define SIZE (sizeof(in_addr_t))
char info_size[] =  {'I', 'N', 'F', 'O', ':', 's','i','z','e','[',
  ('0' + ((SIZE / 10000)%10)),
  ('0' + ((SIZE / 1000)%10)),
  ('0' + ((SIZE / 100)%10)),
  ('0' + ((SIZE / 10)%10)),
  ('0' +  (SIZE    % 10)),
  ']',
#ifdef KEY
  ' ','k','e','y','[', KEY, ']',
#endif
  '\0'};

#ifdef __CLASSIC_C__
int main(argc, argv) int argc; char *argv[];
#else
int main(int argc, char *argv[])
#endif
{
  int require = 0;
  require += info_size[argc];
  (void)argv;
  return require;
}


Determining size of in_port_t failed with the following output:
Change Dir: C:/msys32/home/buildbot/slave/monero-static-win32/build/build/release/CMakeFiles/CMakeTmp

Run Build Command:"C:/msys32/usr/bin/make.exe" "cmTC_35f83/fast"
make[1]: Entering directory '/home/buildbot/slave/monero-static-win32/build/build/release/CMakeFiles/CMakeTmp'
/usr/bin/make -f CMakeFiles/cmTC_35f83.dir/build.make CMakeFiles/cmTC_35f83.dir/build
make[2]: Entering directory '/home/buildbot/slave/monero-static-win32/build/build/release/CMakeFiles/CMakeTmp'
Building C object CMakeFiles/cmTC_35f83.dir/in_port_t.c.obj

/C/msys32/mingw32/bin/i686-w64-mingw32-gcc.exe    -o CMakeFiles/cmTC_35f83.dir/in_port_t.c.obj   -c /C/msys32/home/buildbot/slave/monero-static-win32/build/build/release/CMakeFiles/CheckTypeSize/in_port_t.c
C:/msys32/home/buildbot/slave/monero-static-win32/build/build/release/CMakeFiles/CheckTypeSize/in_port_t.c:4:10: fatal error: netinet/in.h: No such file or directory

 #include "netinet/in.h"

          ^~~~~~~~~~~~~~

compilation terminated.

make[2]: *** [CMakeFiles/cmTC_35f83.dir/build.make:66: CMakeFiles/cmTC_35f83.dir/in_port_t.c.obj] Error 1
make[2]: Leaving directory '/home/buildbot/slave/monero-static-win32/build/build/release/CMakeFiles/CMakeTmp'
make[1]: *** [Makefile:121: cmTC_35f83/fast] Error 2
make[1]: Leaving directory '/home/buildbot/slave/monero-static-win32/build/build/release/CMakeFiles/CMakeTmp'

C:/msys32/home/buildbot/slave/monero-static-win32/build/build/release/CMakeFiles/CheckTypeSize/in_port_t.c:
#include <sys/types.h>
#include <stdint.h>
#include <stddef.h>
#include "netinet/in.h"


#undef KEY
#if defined(__i386)
# define KEY '_','_','i','3','8','6'
#elif defined(__x86_64)
# define KEY '_','_','x','8','6','_','6','4'
#elif defined(__ppc__)
# define KEY '_','_','p','p','c','_','_'
#elif defined(__ppc64__)
# define KEY '_','_','p','p','c','6','4','_','_'
#elif defined(__aarch64__)
# define KEY '_','_','a','a','r','c','h','6','4','_','_'
#elif defined(__ARM_ARCH_7A__)
# define KEY '_','_','A','R','M','_','A','R','C','H','_','7','A','_','_'
#elif defined(__ARM_ARCH_7S__)
# define KEY '_','_','A','R','M','_','A','R','C','H','_','7','S','_','_'
#endif

#define SIZE (sizeof(in_port_t))
char info_size[] =  {'I', 'N', 'F', 'O', ':', 's','i','z','e','[',
  ('0' + ((SIZE / 10000)%10)),
  ('0' + ((SIZE / 1000)%10)),
  ('0' + ((SIZE / 100)%10)),
  ('0' + ((SIZE / 10)%10)),
  ('0' +  (SIZE    % 10)),
  ']',
#ifdef KEY
  ' ','k','e','y','[', KEY, ']',
#endif
  '\0'};

#ifdef __CLASSIC_C__
int main(argc, argv) int argc; char *argv[];
#else
int main(int argc, char *argv[])
#endif
{
  int require = 0;
  require += info_size[argc];
  (void)argv;
  return require;
}


Determining size of rlim_t failed with the following output:
Change Dir: C:/msys32/home/buildbot/slave/monero-static-win32/build/build/release/CMakeFiles/CMakeTmp

Run Build Command:"C:/msys32/usr/bin/make.exe" "cmTC_67153/fast"
make[1]: Entering directory '/home/buildbot/slave/monero-static-win32/build/build/release/CMakeFiles/CMakeTmp'
/usr/bin/make -f CMakeFiles/cmTC_67153.dir/build.make CMakeFiles/cmTC_67153.dir/build
make[2]: Entering directory '/home/buildbot/slave/monero-static-win32/build/build/release/CMakeFiles/CMakeTmp'
Building C object CMakeFiles/cmTC_67153.dir/rlim_t.c.obj

/C/msys32/mingw32/bin/i686-w64-mingw32-gcc.exe    -o CMakeFiles/cmTC_67153.dir/rlim_t.c.obj   -c /C/msys32/home/buildbot/slave/monero-static-win32/build/build/release/CMakeFiles/CheckTypeSize/rlim_t.c
C:/msys32/home/buildbot/slave/monero-static-win32/build/build/release/CMakeFiles/CheckTypeSize/rlim_t.c:4:10: fatal error: sys/resource.h: No such file or directory

 #include "sys/resource.h"

          ^~~~~~~~~~~~~~~~

compilation terminated.

make[2]: *** [CMakeFiles/cmTC_67153.dir/build.make:66: CMakeFiles/cmTC_67153.dir/rlim_t.c.obj] Error 1
make[2]: Leaving directory '/home/buildbot/slave/monero-static-win32/build/build/release/CMakeFiles/CMakeTmp'
make[1]: *** [Makefile:121: cmTC_67153/fast] Error 2
make[1]: Leaving directory '/home/buildbot/slave/monero-static-win32/build/build/release/CMakeFiles/CMakeTmp'

C:/msys32/home/buildbot/slave/monero-static-win32/build/build/release/CMakeFiles/CheckTypeSize/rlim_t.c:
#include <sys/types.h>
#include <stdint.h>
#include <stddef.h>
#include "sys/resource.h"


#undef KEY
#if defined(__i386)
# define KEY '_','_','i','3','8','6'
#elif defined(__x86_64)
# define KEY '_','_','x','8','6','_','6','4'
#elif defined(__ppc__)
# define KEY '_','_','p','p','c','_','_'
#elif defined(__ppc64__)
# define KEY '_','_','p','p','c','6','4','_','_'
#elif defined(__aarch64__)
# define KEY '_','_','a','a','r','c','h','6','4','_','_'
#elif defined(__ARM_ARCH_7A__)
# define KEY '_','_','A','R','M','_','A','R','C','H','_','7','A','_','_'
#elif defined(__ARM_ARCH_7S__)
# define KEY '_','_','A','R','M','_','A','R','C','H','_','7','S','_','_'
#endif

#define SIZE (sizeof(rlim_t))
char info_size[] =  {'I', 'N', 'F', 'O', ':', 's','i','z','e','[',
  ('0' + ((SIZE / 10000)%10)),
  ('0' + ((SIZE / 1000)%10)),
  ('0' + ((SIZE / 100)%10)),
  ('0' + ((SIZE / 10)%10)),
  ('0' +  (SIZE    % 10)),
  ']',
#ifdef KEY
  ' ','k','e','y','[', KEY, ']',
#endif
  '\0'};

#ifdef __CLASSIC_C__
int main(argc, argv) int argc; char *argv[];
#else
int main(int argc, char *argv[])
#endif
{
  int require = 0;
  require += info_size[argc];
  (void)argv;
  return require;
}


Determining size of uid_t failed with the following output:
Change Dir: C:/msys32/home/buildbot/slave/monero-static-win32/build/build/release/CMakeFiles/CMakeTmp

Run Build Command:"C:/msys32/usr/bin/make.exe" "cmTC_93b2c/fast"
make[1]: Entering directory '/home/buildbot/slave/monero-static-win32/build/build/release/CMakeFiles/CMakeTmp'
/usr/bin/make -f CMakeFiles/cmTC_93b2c.dir/build.make CMakeFiles/cmTC_93b2c.dir/build
make[2]: Entering directory '/home/buildbot/slave/monero-static-win32/build/build/release/CMakeFiles/CMakeTmp'
Building C object CMakeFiles/cmTC_93b2c.dir/uid_t.c.obj

/C/msys32/mingw32/bin/i686-w64-mingw32-gcc.exe    -o CMakeFiles/cmTC_93b2c.dir/uid_t.c.obj   -c /C/msys32/home/buildbot/slave/monero-static-win32/build/build/release/CMakeFiles/CheckTypeSize/uid_t.c
C:/msys32/home/buildbot/slave/monero-static-win32/build/build/release/CMakeFiles/CheckTypeSize/uid_t.c:24:22: error: 'uid_t' undeclared here (not in a function); did you mean 'pid_t'?

 #define SIZE (sizeof(uid_t))

                      ^

C:/msys32/home/buildbot/slave/monero-static-win32/build/build/release/CMakeFiles/CheckTypeSize/uid_t.c:26:12: note: in expansion of macro 'SIZE'

   ('0' + ((SIZE / 10000)%10)),

            ^~~~

make[2]: *** [CMakeFiles/cmTC_93b2c.dir/build.make:66: CMakeFiles/cmTC_93b2c.dir/uid_t.c.obj] Error 1
make[2]: Leaving directory '/home/buildbot/slave/monero-static-win32/build/build/release/CMakeFiles/CMakeTmp'
make[1]: *** [Makefile:121: cmTC_93b2c/fast] Error 2
make[1]: Leaving directory '/home/buildbot/slave/monero-static-win32/build/build/release/CMakeFiles/CMakeTmp'

C:/msys32/home/buildbot/slave/monero-static-win32/build/build/release/CMakeFiles/CheckTypeSize/uid_t.c:
#include <sys/types.h>
#include <stdint.h>
#include <stddef.h>
#include "sys/types.h"


#undef KEY
#if defined(__i386)
# define KEY '_','_','i','3','8','6'
#elif defined(__x86_64)
# define KEY '_','_','x','8','6','_','6','4'
#elif defined(__ppc__)
# define KEY '_','_','p','p','c','_','_'
#elif defined(__ppc64__)
# define KEY '_','_','p','p','c','6','4','_','_'
#elif defined(__aarch64__)
# define KEY '_','_','a','a','r','c','h','6','4','_','_'
#elif defined(__ARM_ARCH_7A__)
# define KEY '_','_','A','R','M','_','A','R','C','H','_','7','A','_','_'
#elif defined(__ARM_ARCH_7S__)
# define KEY '_','_','A','R','M','_','A','R','C','H','_','7','S','_','_'
#endif

#define SIZE (sizeof(uid_t))
char info_size[] =  {'I', 'N', 'F', 'O', ':', 's','i','z','e','[',
  ('0' + ((SIZE / 10000)%10)),
  ('0' + ((SIZE / 1000)%10)),
  ('0' + ((SIZE / 100)%10)),
  ('0' + ((SIZE / 10)%10)),
  ('0' +  (SIZE    % 10)),
  ']',
#ifdef KEY
  ' ','k','e','y','[', KEY, ']',
#endif
  '\0'};

#ifdef __CLASSIC_C__
int main(argc, argv) int argc; char *argv[];
#else
int main(int argc, char *argv[])
#endif
{
  int require = 0;
  require += info_size[argc];
  (void)argv;
  return require;
}


Determining if the pthread_rwlock_t exist failed with the following output:
Change Dir: C:/msys32/home/buildbot/slave/monero-static-win32/build/build/release/CMakeFiles/CMakeTmp

Run Build Command:"C:/msys32/usr/bin/make.exe" "cmTC_117e5/fast"
make[1]: Entering directory '/home/buildbot/slave/monero-static-win32/build/build/release/CMakeFiles/CMakeTmp'
/usr/bin/make -f CMakeFiles/cmTC_117e5.dir/build.make CMakeFiles/cmTC_117e5.dir/build
make[2]: Entering directory '/home/buildbot/slave/monero-static-win32/build/build/release/CMakeFiles/CMakeTmp'
Building C object CMakeFiles/cmTC_117e5.dir/CheckSymbolExists.c.obj

/C/msys32/mingw32/bin/i686-w64-mingw32-gcc.exe    -o CMakeFiles/cmTC_117e5.dir/CheckSymbolExists.c.obj   -c /C/msys32/home/buildbot/slave/monero-static-win32/build/build/release/CMakeFiles/CMakeTmp/CheckSymbolExists.c
C:/msys32/home/buildbot/slave/monero-static-win32/build/build/release/CMakeFiles/CMakeTmp/CheckSymbolExists.c: In function 'main':

C:/msys32/home/buildbot/slave/monero-static-win32/build/build/release/CMakeFiles/CMakeTmp/CheckSymbolExists.c:8:19: error: expected expression before 'pthread_rwlock_t'

   return ((int*)(&pthread_rwlock_t))[argc];

                   ^~~~~~~~~~~~~~~~

make[2]: *** [CMakeFiles/cmTC_117e5.dir/build.make:66: CMakeFiles/cmTC_117e5.dir/CheckSymbolExists.c.obj] Error 1
make[2]: Leaving directory '/home/buildbot/slave/monero-static-win32/build/build/release/CMakeFiles/CMakeTmp'
make[1]: *** [Makefile:121: cmTC_117e5/fast] Error 2
make[1]: Leaving directory '/home/buildbot/slave/monero-static-win32/build/build/release/CMakeFiles/CMakeTmp'

File C:/msys32/home/buildbot/slave/monero-static-win32/build/build/release/CMakeFiles/CMakeTmp/CheckSymbolExists.c:
/* */
#include <pthread.h>

int main(int argc, char** argv)
{
  (void)argv;
#ifndef pthread_rwlock_t
  return ((int*)(&pthread_rwlock_t))[argc];
#else
  (void)argc;
  return 0;
#endif
}

Determining if the pthread_spinlock_t exist failed with the following output:
Change Dir: C:/msys32/home/buildbot/slave/monero-static-win32/build/build/release/CMakeFiles/CMakeTmp

Run Build Command:"C:/msys32/usr/bin/make.exe" "cmTC_7a30d/fast"
make[1]: Entering directory '/home/buildbot/slave/monero-static-win32/build/build/release/CMakeFiles/CMakeTmp'
/usr/bin/make -f CMakeFiles/cmTC_7a30d.dir/build.make CMakeFiles/cmTC_7a30d.dir/build
make[2]: Entering directory '/home/buildbot/slave/monero-static-win32/build/build/release/CMakeFiles/CMakeTmp'
Building C object CMakeFiles/cmTC_7a30d.dir/CheckSymbolExists.c.obj

/C/msys32/mingw32/bin/i686-w64-mingw32-gcc.exe    -o CMakeFiles/cmTC_7a30d.dir/CheckSymbolExists.c.obj   -c /C/msys32/home/buildbot/slave/monero-static-win32/build/build/release/CMakeFiles/CMakeTmp/CheckSymbolExists.c
C:/msys32/home/buildbot/slave/monero-static-win32/build/build/release/CMakeFiles/CMakeTmp/CheckSymbolExists.c: In function 'main':

C:/msys32/home/buildbot/slave/monero-static-win32/build/build/release/CMakeFiles/CMakeTmp/CheckSymbolExists.c:8:19: error: expected expression before 'pthread_spinlock_t'

   return ((int*)(&pthread_spinlock_t))[argc];

                   ^~~~~~~~~~~~~~~~~~

make[2]: *** [CMakeFiles/cmTC_7a30d.dir/build.make:66: CMakeFiles/cmTC_7a30d.dir/CheckSymbolExists.c.obj] Error 1
make[2]: Leaving directory '/home/buildbot/slave/monero-static-win32/build/build/release/CMakeFiles/CMakeTmp'
make[1]: *** [Makefile:121: cmTC_7a30d/fast] Error 2
make[1]: Leaving directory '/home/buildbot/slave/monero-static-win32/build/build/release/CMakeFiles/CMakeTmp'

File C:/msys32/home/buildbot/slave/monero-static-win32/build/build/release/CMakeFiles/CMakeTmp/CheckSymbolExists.c:
/* */
#include <pthread.h>

int main(int argc, char** argv)
{
  (void)argv;
#ifndef pthread_spinlock_t
  return ((int*)(&pthread_spinlock_t))[argc];
#else
  (void)argc;
  return 0;
#endif
}

Determining if the LIBRESSL_VERSION_TEXT exist failed with the following output:
Change Dir: C:/msys32/home/buildbot/slave/monero-static-win32/build/build/release/CMakeFiles/CMakeTmp

Run Build Command:"C:/msys32/usr/bin/make.exe" "cmTC_da37b/fast"
make[1]: Entering directory '/home/buildbot/slave/monero-static-win32/build/build/release/CMakeFiles/CMakeTmp'
/usr/bin/make -f CMakeFiles/cmTC_da37b.dir/build.make CMakeFiles/cmTC_da37b.dir/build
make[2]: Entering directory '/home/buildbot/slave/monero-static-win32/build/build/release/CMakeFiles/CMakeTmp'
Building C object CMakeFiles/cmTC_da37b.dir/CheckSymbolExists.c.obj

/C/msys32/mingw32/bin/i686-w64-mingw32-gcc.exe    -o CMakeFiles/cmTC_da37b.dir/CheckSymbolExists.c.obj   -c /C/msys32/home/buildbot/slave/monero-static-win32/build/build/release/CMakeFiles/CMakeTmp/CheckSymbolExists.c
C:/msys32/home/buildbot/slave/monero-static-win32/build/build/release/CMakeFiles/CMakeTmp/CheckSymbolExists.c: In function 'main':

C:/msys32/home/buildbot/slave/monero-static-win32/build/build/release/CMakeFiles/CMakeTmp/CheckSymbolExists.c:8:19: error: 'LIBRESSL_VERSION_TEXT' undeclared (first use in this function); did you mean 'OPENSSL_VERSION_TEXT'?

   return ((int*)(&LIBRESSL_VERSION_TEXT))[argc];

                   ^~~~~~~~~~~~~~~~~~~~~

                   OPENSSL_VERSION_TEXT

C:/msys32/home/buildbot/slave/monero-static-win32/build/build/release/CMakeFiles/CMakeTmp/CheckSymbolExists.c:8:19: note: each undeclared identifier is reported only once for each function it appears in

make[2]: *** [CMakeFiles/cmTC_da37b.dir/build.make:66: CMakeFiles/cmTC_da37b.dir/CheckSymbolExists.c.obj] Error 1
make[2]: Leaving directory '/home/buildbot/slave/monero-static-win32/build/build/release/CMakeFiles/CMakeTmp'
make[1]: *** [Makefile:121: cmTC_da37b/fast] Error 2
make[1]: Leaving directory '/home/buildbot/slave/monero-static-win32/build/build/release/CMakeFiles/CMakeTmp'

File C:/msys32/home/buildbot/slave/monero-static-win32/build/build/release/CMakeFiles/CMakeTmp/CheckSymbolExists.c:
/* */
#include <openssl/opensslv.h>

int main(int argc, char** argv)
{
  (void)argv;
#ifndef LIBRESSL_VERSION_TEXT
  return ((int*)(&LIBRESSL_VERSION_TEXT))[argc];
#else
  (void)argc;
  return 0;
#endif
}

Determining if the -Wl,-z,relro linker flag is supported failed with the following output:
Change Dir: C:/msys32/home/buildbot/slave/monero-static-win32/build/build/release/CMakeFiles/CMakeTmp

Run Build Command:"C:/msys32/usr/bin/make.exe" "cmTC_99128/fast"
make[1]: Entering directory '/home/buildbot/slave/monero-static-win32/build/build/release/CMakeFiles/CMakeTmp'
/usr/bin/make -f CMakeFiles/cmTC_99128.dir/build.make CMakeFiles/cmTC_99128.dir/build
make[2]: Entering directory '/home/buildbot/slave/monero-static-win32/build/build/release/CMakeFiles/CMakeTmp'
Building C object CMakeFiles/cmTC_99128.dir/CheckLinkerFlag.c.obj

/C/msys32/mingw32/bin/i686-w64-mingw32-gcc.exe   -Wl,-z,relro    -Wl,-z,relro -o CMakeFiles/cmTC_99128.dir/CheckLinkerFlag.c.obj   -c /C/msys32/home/buildbot/slave/monero-static-win32/build/cmake/CheckLinkerFlag.c
Linking C executable cmTC_99128.exe

/C/msys32/mingw32/bin/cmake.exe -E remove -f CMakeFiles/cmTC_99128.dir/objects.a
ar cr CMakeFiles/cmTC_99128.dir/objects.a "CMakeFiles/cmTC_99128.dir/CheckLinkerFlag.c.obj" 
/C/msys32/mingw32/bin/i686-w64-mingw32-gcc.exe -Wl,-z,relro     -Wl,--whole-archive CMakeFiles/cmTC_99128.dir/objects.a -Wl,--no-whole-archive  -o cmTC_99128.exe -Wl,--major-image-version,0,--minor-image-version,0 -lkernel32 -luser32 -lgdi32 -lwinspool -lshell32 -lole32 -loleaut32 -luuid -lcomdlg32 -ladvapi32 
C:/msys32/mingw32/bin/../lib/gcc/i686-w64-mingw32/7.4.0/../../../../i686-w64-mingw32/bin/ld.exe: unrecognized option '-z'

C:/msys32/mingw32/bin/../lib/gcc/i686-w64-mingw32/7.4.0/../../../../i686-w64-mingw32/bin/ld.exe: use the --help option for usage information

collect2.exe: error: ld returned 1 exit status

make[2]: *** [CMakeFiles/cmTC_99128.dir/build.make:88: cmTC_99128.exe] Error 1
make[2]: Leaving directory '/home/buildbot/slave/monero-static-win32/build/build/release/CMakeFiles/CMakeTmp'
make[1]: *** [Makefile:121: cmTC_99128/fast] Error 2
make[1]: Leaving directory '/home/buildbot/slave/monero-static-win32/build/build/release/CMakeFiles/CMakeTmp'


Determining if the -Wl,-z,now linker flag is supported failed with the following output:
Change Dir: C:/msys32/home/buildbot/slave/monero-static-win32/build/build/release/CMakeFiles/CMakeTmp

Run Build Command:"C:/msys32/usr/bin/make.exe" "cmTC_604bc/fast"
make[1]: Entering directory '/home/buildbot/slave/monero-static-win32/build/build/release/CMakeFiles/CMakeTmp'
/usr/bin/make -f CMakeFiles/cmTC_604bc.dir/build.make CMakeFiles/cmTC_604bc.dir/build
make[2]: Entering directory '/home/buildbot/slave/monero-static-win32/build/build/release/CMakeFiles/CMakeTmp'
Building C object CMakeFiles/cmTC_604bc.dir/CheckLinkerFlag.c.obj

/C/msys32/mingw32/bin/i686-w64-mingw32-gcc.exe   -Wl,-z,now    -Wl,-z,now -o CMakeFiles/cmTC_604bc.dir/CheckLinkerFlag.c.obj   -c /C/msys32/home/buildbot/slave/monero-static-win32/build/cmake/CheckLinkerFlag.c
Linking C executable cmTC_604bc.exe

/C/msys32/mingw32/bin/cmake.exe -E remove -f CMakeFiles/cmTC_604bc.dir/objects.a
ar cr CMakeFiles/cmTC_604bc.dir/objects.a "CMakeFiles/cmTC_604bc.dir/CheckLinkerFlag.c.obj" 
/C/msys32/mingw32/bin/i686-w64-mingw32-gcc.exe -Wl,-z,now     -Wl,--whole-archive CMakeFiles/cmTC_604bc.dir/objects.a -Wl,--no-whole-archive  -o cmTC_604bc.exe -Wl,--major-image-version,0,--minor-image-version,0 -lkernel32 -luser32 -lgdi32 -lwinspool -lshell32 -lole32 -loleaut32 -luuid -lcomdlg32 -ladvapi32 
C:/msys32/mingw32/bin/../lib/gcc/i686-w64-mingw32/7.4.0/../../../../i686-w64-mingw32/bin/ld.exe: unrecognized option '-z'

C:/msys32/mingw32/bin/../lib/gcc/i686-w64-mingw32/7.4.0/../../../../i686-w64-mingw32/bin/ld.exe: use the --help option for usage information

collect2.exe: error: ld returned 1 exit status

make[2]: *** [CMakeFiles/cmTC_604bc.dir/build.make:88: cmTC_604bc.exe] Error 1
make[2]: Leaving directory '/home/buildbot/slave/monero-static-win32/build/build/release/CMakeFiles/CMakeTmp'
make[1]: *** [Makefile:121: cmTC_604bc/fast] Error 2
make[1]: Leaving directory '/home/buildbot/slave/monero-static-win32/build/build/release/CMakeFiles/CMakeTmp'


Determining if the -Wl,-z,noexecstack linker flag is supported failed with the following output:
Change Dir: C:/msys32/home/buildbot/slave/monero-static-win32/build/build/release/CMakeFiles/CMakeTmp

Run Build Command:"C:/msys32/usr/bin/make.exe" "cmTC_0fabc/fast"
make[1]: Entering directory '/home/buildbot/slave/monero-static-win32/build/build/release/CMakeFiles/CMakeTmp'
/usr/bin/make -f CMakeFiles/cmTC_0fabc.dir/build.make CMakeFiles/cmTC_0fabc.dir/build
make[2]: Entering directory '/home/buildbot/slave/monero-static-win32/build/build/release/CMakeFiles/CMakeTmp'
Building C object CMakeFiles/cmTC_0fabc.dir/CheckLinkerFlag.c.obj

/C/msys32/mingw32/bin/i686-w64-mingw32-gcc.exe   -Wl,-z,noexecstack    -Wl,-z,noexecstack -o CMakeFiles/cmTC_0fabc.dir/CheckLinkerFlag.c.obj   -c /C/msys32/home/buildbot/slave/monero-static-win32/build/cmake/CheckLinkerFlag.c
Linking C executable cmTC_0fabc.exe

/C/msys32/mingw32/bin/cmake.exe -E remove -f CMakeFiles/cmTC_0fabc.dir/objects.a
ar cr CMakeFiles/cmTC_0fabc.dir/objects.a "CMakeFiles/cmTC_0fabc.dir/CheckLinkerFlag.c.obj" 
/C/msys32/mingw32/bin/i686-w64-mingw32-gcc.exe -Wl,-z,noexecstack     -Wl,--whole-archive CMakeFiles/cmTC_0fabc.dir/objects.a -Wl,--no-whole-archive  -o cmTC_0fabc.exe -Wl,--major-image-version,0,--minor-image-version,0 -lkernel32 -luser32 -lgdi32 -lwinspool -lshell32 -lole32 -loleaut32 -luuid -lcomdlg32 -ladvapi32 
C:/msys32/mingw32/bin/../lib/gcc/i686-w64-mingw32/7.4.0/../../../../i686-w64-mingw32/bin/ld.exe: unrecognized option '-z'

C:/msys32/mingw32/bin/../lib/gcc/i686-w64-mingw32/7.4.0/../../../../i686-w64-mingw32/bin/ld.exe: use the --help option for usage information

collect2.exe: error: ld returned 1 exit status

make[2]: *** [CMakeFiles/cmTC_0fabc.dir/build.make:88: cmTC_0fabc.exe] Error 1
make[2]: Leaving directory '/home/buildbot/slave/monero-static-win32/build/build/release/CMakeFiles/CMakeTmp'
make[1]: *** [Makefile:121: cmTC_0fabc/fast] Error 2
make[1]: Leaving directory '/home/buildbot/slave/monero-static-win32/build/build/release/CMakeFiles/CMakeTmp'


Determining if the -Wl,-z,noexecheap linker flag is supported failed with the following output:
Change Dir: C:/msys32/home/buildbot/slave/monero-static-win32/build/build/release/CMakeFiles/CMakeTmp

Run Build Command:"C:/msys32/usr/bin/make.exe" "cmTC_e752f/fast"
make[1]: Entering directory '/home/buildbot/slave/monero-static-win32/build/build/release/CMakeFiles/CMakeTmp'
/usr/bin/make -f CMakeFiles/cmTC_e752f.dir/build.make CMakeFiles/cmTC_e752f.dir/build
make[2]: Entering directory '/home/buildbot/slave/monero-static-win32/build/build/release/CMakeFiles/CMakeTmp'
Building C object CMakeFiles/cmTC_e752f.dir/CheckLinkerFlag.c.obj

/C/msys32/mingw32/bin/i686-w64-mingw32-gcc.exe   -Wl,-z,noexecheap    -Wl,-z,noexecheap -o CMakeFiles/cmTC_e752f.dir/CheckLinkerFlag.c.obj   -c /C/msys32/home/buildbot/slave/monero-static-win32/build/cmake/CheckLinkerFlag.c
Linking C executable cmTC_e752f.exe

/C/msys32/mingw32/bin/cmake.exe -E remove -f CMakeFiles/cmTC_e752f.dir/objects.a
ar cr CMakeFiles/cmTC_e752f.dir/objects.a "CMakeFiles/cmTC_e752f.dir/CheckLinkerFlag.c.obj" 
/C/msys32/mingw32/bin/i686-w64-mingw32-gcc.exe -Wl,-z,noexecheap     -Wl,--whole-archive CMakeFiles/cmTC_e752f.dir/objects.a -Wl,--no-whole-archive  -o cmTC_e752f.exe -Wl,--major-image-version,0,--minor-image-version,0 -lkernel32 -luser32 -lgdi32 -lwinspool -lshell32 -lole32 -loleaut32 -luuid -lcomdlg32 -ladvapi32 
C:/msys32/mingw32/bin/../lib/gcc/i686-w64-mingw32/7.4.0/../../../../i686-w64-mingw32/bin/ld.exe: unrecognized option '-z'

C:/msys32/mingw32/bin/../lib/gcc/i686-w64-mingw32/7.4.0/../../../../i686-w64-mingw32/bin/ld.exe: use the --help option for usage information

collect2.exe: error: ld returned 1 exit status

make[2]: *** [CMakeFiles/cmTC_e752f.dir/build.make:88: cmTC_e752f.exe] Error 1
make[2]: Leaving directory '/home/buildbot/slave/monero-static-win32/build/build/release/CMakeFiles/CMakeTmp'
make[1]: *** [Makefile:121: cmTC_e752f/fast] Error 2
make[1]: Leaving directory '/home/buildbot/slave/monero-static-win32/build/build/release/CMakeFiles/CMakeTmp'


Determining if the function rl_copy_text exists failed with the following output:
Change Dir: C:/msys32/home/buildbot/slave/monero-static-win32/build/build/release/CMakeFiles/CMakeTmp

Run Build Command:"C:/msys32/usr/bin/make.exe" "cmTC_ea8cc/fast"
make[1]: Entering directory '/home/buildbot/slave/monero-static-win32/build/build/release/CMakeFiles/CMakeTmp'
/usr/bin/make -f CMakeFiles/cmTC_ea8cc.dir/build.make CMakeFiles/cmTC_ea8cc.dir/build
make[2]: Entering directory '/home/buildbot/slave/monero-static-win32/build/build/release/CMakeFiles/CMakeTmp'
Building C object CMakeFiles/cmTC_ea8cc.dir/CheckFunctionExists.c.obj

/C/msys32/mingw32/bin/i686-w64-mingw32-gcc.exe   -maes -march=i686 -fno-strict-aliasing -std=c11 -D_GNU_SOURCE -m32 -DWIN32_LEAN_AND_MEAN  -Wall -Wextra -Wpointer-arith -Wundef -Wvla -Wwrite-strings -Wno-error=extra -Wno-error=deprecated-declarations -Wno-unused-parameter -Wno-unused-variable -Wno-error=unused-variable -Wno-error=undef -Wno-error=uninitialized -Wlogical-op -Wno-error=maybe-uninitialized -Wno-error=cpp -Wno-error=unused-value -Wno-error=unused-but-set-variable -Waggregate-return -Wnested-externs -Wold-style-definition -Wstrict-prototypes  -fPIC  -U_FORTIFY_SOURCE -D_FORTIFY_SOURCE=1 -Wformat -Wformat-security -mmitigate-rop -fno-strict-aliasing -DCHECK_FUNCTION_EXISTS=rl_copy_text   -o CMakeFiles/cmTC_ea8cc.dir/CheckFunctionExists.c.obj   -c /C/msys32/mingw32/share/cmake-3.12/Modules/CheckFunctionExists.c
Linking C executable cmTC_ea8cc.exe

/C/msys32/mingw32/bin/cmake.exe -E remove -f CMakeFiles/cmTC_ea8cc.dir/objects.a
ar cr CMakeFiles/cmTC_ea8cc.dir/objects.a "CMakeFiles/cmTC_ea8cc.dir/CheckFunctionExists.c.obj" 
/C/msys32/mingw32/bin/i686-w64-mingw32-gcc.exe  -maes -march=i686 -fno-strict-aliasing -std=c11 -D_GNU_SOURCE -m32 -DWIN32_LEAN_AND_MEAN  -Wall -Wextra -Wpointer-arith -Wundef -Wvla -Wwrite-strings -Wno-error=extra -Wno-error=deprecated-declarations -Wno-unused-parameter -Wno-unused-variable -Wno-error=unused-variable -Wno-error=undef -Wno-error=uninitialized -Wlogical-op -Wno-error=maybe-uninitialized -Wno-error=cpp -Wno-error=unused-value -Wno-error=unused-but-set-variable -Waggregate-return -Wnested-externs -Wold-style-definition -Wstrict-prototypes  -fPIC  -U_FORTIFY_SOURCE -D_FORTIFY_SOURCE=1 -Wformat -Wformat-security -mmitigate-rop -fno-strict-aliasing -DCHECK_FUNCTION_EXISTS=rl_copy_text    -Wl,--whole-archive CMakeFiles/cmTC_ea8cc.dir/objects.a -Wl,--no-whole-archive  -o cmTC_ea8cc.exe -Wl,--major-image-version,0,--minor-image-version,0 /C/msys32/mingw32/lib/libreadline.a -lkernel32 -luser32 -lgdi32 -lwinspool -lshell32 -lole32 -loleaut32 -luuid -lcomdlg32 -ladvapi32 
C:/msys32/mingw32/lib/libreadline.a(terminal.o):(.text+0x1a6): undefined reference to `tgetnum'

C:/msys32/mingw32/lib/libreadline.a(terminal.o):(.text+0x2df): undefined reference to `tgetnum'

C:/msys32/mingw32/lib/libreadline.a(terminal.o):(.text+0x757): undefined reference to `tgetent'

C:/msys32/mingw32/lib/libreadline.a(terminal.o):(.text+0x793): undefined reference to `tgetstr'

C:/msys32/mingw32/lib/libreadline.a(terminal.o):(.text+0x7e6): undefined reference to `tgetflag'

C:/msys32/mingw32/lib/libreadline.a(terminal.o):(.text+0x833): undefined reference to `tgetflag'

C:/msys32/mingw32/lib/libreadline.a(terminal.o):(.text+0x948): undefined reference to `tgetflag'

C:/msys32/mingw32/lib/libreadline.a(terminal.o):(.text+0xb2c): undefined reference to `tputs'

C:/msys32/mingw32/lib/libreadline.a(terminal.o):(.text+0xc17): undefined reference to `tputs'

C:/msys32/mingw32/lib/libreadline.a(terminal.o):(.text+0xc59): undefined reference to `tputs'

C:/msys32/mingw32/lib/libreadline.a(terminal.o):(.text+0xcb7): undefined reference to `tputs'

C:/msys32/mingw32/lib/libreadline.a(terminal.o):(.text+0xcf8): undefined reference to `tputs'

C:/msys32/mingw32/lib/libreadline.a(terminal.o):(.text+0xd4a): more undefined references to `tputs' follow

collect2.exe: error: ld returned 1 exit status

make[2]: *** [CMakeFiles/cmTC_ea8cc.dir/build.make:89: cmTC_ea8cc.exe] Error 1
make[2]: Leaving directory '/home/buildbot/slave/monero-static-win32/build/build/release/CMakeFiles/CMakeTmp'
make[1]: *** [Makefile:121: cmTC_ea8cc/fast] Error 2
make[1]: Leaving directory '/home/buildbot/slave/monero-static-win32/build/build/release/CMakeFiles/CMakeTmp'


Determining if the function rl_filename_completion_function exists failed with the following output:
Change Dir: C:/msys32/home/buildbot/slave/monero-static-win32/build/build/release/CMakeFiles/CMakeTmp

Run Build Command:"C:/msys32/usr/bin/make.exe" "cmTC_d0fd5/fast"
make[1]: Entering directory '/home/buildbot/slave/monero-static-win32/build/build/release/CMakeFiles/CMakeTmp'
/usr/bin/make -f CMakeFiles/cmTC_d0fd5.dir/build.make CMakeFiles/cmTC_d0fd5.dir/build
make[2]: Entering directory '/home/buildbot/slave/monero-static-win32/build/build/release/CMakeFiles/CMakeTmp'
Building C object CMakeFiles/cmTC_d0fd5.dir/CheckFunctionExists.c.obj

/C/msys32/mingw32/bin/i686-w64-mingw32-gcc.exe   -maes -march=i686 -fno-strict-aliasing -std=c11 -D_GNU_SOURCE -m32 -DWIN32_LEAN_AND_MEAN  -Wall -Wextra -Wpointer-arith -Wundef -Wvla -Wwrite-strings -Wno-error=extra -Wno-error=deprecated-declarations -Wno-unused-parameter -Wno-unused-variable -Wno-error=unused-variable -Wno-error=undef -Wno-error=uninitialized -Wlogical-op -Wno-error=maybe-uninitialized -Wno-error=cpp -Wno-error=unused-value -Wno-error=unused-but-set-variable -Waggregate-return -Wnested-externs -Wold-style-definition -Wstrict-prototypes  -fPIC  -U_FORTIFY_SOURCE -D_FORTIFY_SOURCE=1 -Wformat -Wformat-security -mmitigate-rop -fno-strict-aliasing -DCHECK_FUNCTION_EXISTS=rl_filename_completion_function   -o CMakeFiles/cmTC_d0fd5.dir/CheckFunctionExists.c.obj   -c /C/msys32/mingw32/share/cmake-3.12/Modules/CheckFunctionExists.c
Linking C executable cmTC_d0fd5.exe

/C/msys32/mingw32/bin/cmake.exe -E remove -f CMakeFiles/cmTC_d0fd5.dir/objects.a
ar cr CMakeFiles/cmTC_d0fd5.dir/objects.a "CMakeFiles/cmTC_d0fd5.dir/CheckFunctionExists.c.obj" 
/C/msys32/mingw32/bin/i686-w64-mingw32-gcc.exe  -maes -march=i686 -fno-strict-aliasing -std=c11 -D_GNU_SOURCE -m32 -DWIN32_LEAN_AND_MEAN  -Wall -Wextra -Wpointer-arith -Wundef -Wvla -Wwrite-strings -Wno-error=extra -Wno-error=deprecated-declarations -Wno-unused-parameter -Wno-unused-variable -Wno-error=unused-variable -Wno-error=undef -Wno-error=uninitialized -Wlogical-op -Wno-error=maybe-uninitialized -Wno-error=cpp -Wno-error=unused-value -Wno-error=unused-but-set-variable -Waggregate-return -Wnested-externs -Wold-style-definition -Wstrict-prototypes  -fPIC  -U_FORTIFY_SOURCE -D_FORTIFY_SOURCE=1 -Wformat -Wformat-security -mmitigate-rop -fno-strict-aliasing -DCHECK_FUNCTION_EXISTS=rl_filename_completion_function    -Wl,--whole-archive CMakeFiles/cmTC_d0fd5.dir/objects.a -Wl,--no-whole-archive  -o cmTC_d0fd5.exe -Wl,--major-image-version,0,--minor-image-version,0 /C/msys32/mingw32/lib/libreadline.a -lkernel32 -luser32 -lgdi32 -lwinspool -lshell32 -lole32 -loleaut32 -luuid -lcomdlg32 -ladvapi32 
C:/msys32/mingw32/lib/libreadline.a(display.o):(.text+0x99f): undefined reference to `tputs'

C:/msys32/mingw32/lib/libreadline.a(display.o):(.text+0xa9a): undefined reference to `tputs'

C:/msys32/mingw32/lib/libreadline.a(display.o):(.text+0xaec): undefined reference to `tputs'

C:/msys32/mingw32/lib/libreadline.a(display.o):(.text+0x12e4): undefined reference to `tputs'

C:/msys32/mingw32/lib/libreadline.a(display.o):(.text+0x18b3): undefined reference to `tputs'

C:/msys32/mingw32/lib/libreadline.a(display.o):(.text+0x29ad): more undefined references to `tputs' follow

C:/msys32/mingw32/lib/libreadline.a(terminal.o):(.text+0x1a6): undefined reference to `tgetnum'

C:/msys32/mingw32/lib/libreadline.a(terminal.o):(.text+0x2df): undefined reference to `tgetnum'

C:/msys32/mingw32/lib/libreadline.a(terminal.o):(.text+0x757): undefined reference to `tgetent'

C:/msys32/mingw32/lib/libreadline.a(terminal.o):(.text+0x793): undefined reference to `tgetstr'

C:/msys32/mingw32/lib/libreadline.a(terminal.o):(.text+0x7e6): undefined reference to `tgetflag'

C:/msys32/mingw32/lib/libreadline.a(terminal.o):(.text+0x833): undefined reference to `tgetflag'

C:/msys32/mingw32/lib/libreadline.a(terminal.o):(.text+0x948): undefined reference to `tgetflag'

C:/msys32/mingw32/lib/libreadline.a(terminal.o):(.text+0xb2c): undefined reference to `tputs'

C:/msys32/mingw32/lib/libreadline.a(terminal.o):(.text+0xc17): undefined reference to `tputs'

C:/msys32/mingw32/lib/libreadline.a(terminal.o):(.text+0xc59): undefined reference to `tputs'

C:/msys32/mingw32/lib/libreadline.a(terminal.o):(.text+0xcb7): undefined reference to `tputs'

C:/msys32/mingw32/lib/libreadline.a(terminal.o):(.text+0xcf8): undefined reference to `tputs'

C:/msys32/mingw32/lib/libreadline.a(terminal.o):(.text+0xd4a): more undefined references to `tputs' follow

collect2.exe: error: ld returned 1 exit status

make[2]: *** [CMakeFiles/cmTC_d0fd5.dir/build.make:89: cmTC_d0fd5.exe] Error 1
make[2]: Leaving directory '/home/buildbot/slave/monero-static-win32/build/build/release/CMakeFiles/CMakeTmp'
make[1]: *** [Makefile:121: cmTC_d0fd5/fast] Error 2
make[1]: Leaving directory '/home/buildbot/slave/monero-static-win32/build/build/release/CMakeFiles/CMakeTmp'