(view as text)
Determining if the function memset_s exists in the c failed with the following output:
Change Dir: C:/msys32/home/buildbot/slave/monero-static-win32/build/build/release/CMakeFiles/CMakeTmp

Run Build Command:"C:/msys32/usr/bin/make.exe" "cmTC_4a266/fast"
make[1]: Entering directory '/home/buildbot/slave/monero-static-win32/build/build/release/CMakeFiles/CMakeTmp'
/usr/bin/make -f CMakeFiles/cmTC_4a266.dir/build.make CMakeFiles/cmTC_4a266.dir/build
make[2]: Entering directory '/home/buildbot/slave/monero-static-win32/build/build/release/CMakeFiles/CMakeTmp'
Building C object CMakeFiles/cmTC_4a266.dir/CheckFunctionExists.c.obj

/C/msys32/mingw32/bin/i686-w64-mingw32-gcc.exe   -DCHECK_FUNCTION_EXISTS=memset_s   -o CMakeFiles/cmTC_4a266.dir/CheckFunctionExists.c.obj   -c /C/msys32/mingw32/share/cmake-3.12/Modules/CheckFunctionExists.c
Linking C executable cmTC_4a266.exe

/C/msys32/mingw32/bin/cmake.exe -E remove -f CMakeFiles/cmTC_4a266.dir/objects.a
ar cr CMakeFiles/cmTC_4a266.dir/objects.a "CMakeFiles/cmTC_4a266.dir/CheckFunctionExists.c.obj" 
/C/msys32/mingw32/bin/i686-w64-mingw32-gcc.exe  -DCHECK_FUNCTION_EXISTS=memset_s    -Wl,--whole-archive CMakeFiles/cmTC_4a266.dir/objects.a -Wl,--no-whole-archive  -o cmTC_4a266.exe -Wl,--major-image-version,0,--minor-image-version,0  -L/C/msys32/home/buildbot/slave/monero-static-win32/build/build/release/CMakeFiles/CMakeTmp/string.h -lc -lkernel32 -luser32 -lgdi32 -lwinspool -lshell32 -lole32 -loleaut32 -luuid -lcomdlg32 -ladvapi32 
C:/msys32/mingw32/bin/../lib/gcc/i686-w64-mingw32/7.4.0/../../../../i686-w64-mingw32/bin/ld.exe: cannot find -lc

collect2.exe: error: ld returned 1 exit status

make[2]: *** [CMakeFiles/cmTC_4a266.dir/build.make:88: cmTC_4a266.exe] Error 1
make[2]: Leaving directory '/home/buildbot/slave/monero-static-win32/build/build/release/CMakeFiles/CMakeTmp'
make[1]: *** [Makefile:121: cmTC_4a266/fast] Error 2
make[1]: Leaving directory '/home/buildbot/slave/monero-static-win32/build/build/release/CMakeFiles/CMakeTmp'


Determining if the function explicit_bzero exists in the c failed with the following output:
Change Dir: C:/msys32/home/buildbot/slave/monero-static-win32/build/build/release/CMakeFiles/CMakeTmp

Run Build Command:"C:/msys32/usr/bin/make.exe" "cmTC_6e939/fast"
make[1]: Entering directory '/home/buildbot/slave/monero-static-win32/build/build/release/CMakeFiles/CMakeTmp'
/usr/bin/make -f CMakeFiles/cmTC_6e939.dir/build.make CMakeFiles/cmTC_6e939.dir/build
make[2]: Entering directory '/home/buildbot/slave/monero-static-win32/build/build/release/CMakeFiles/CMakeTmp'
Building C object CMakeFiles/cmTC_6e939.dir/CheckFunctionExists.c.obj

/C/msys32/mingw32/bin/i686-w64-mingw32-gcc.exe   -DCHECK_FUNCTION_EXISTS=explicit_bzero   -o CMakeFiles/cmTC_6e939.dir/CheckFunctionExists.c.obj   -c /C/msys32/mingw32/share/cmake-3.12/Modules/CheckFunctionExists.c
Linking C executable cmTC_6e939.exe

/C/msys32/mingw32/bin/cmake.exe -E remove -f CMakeFiles/cmTC_6e939.dir/objects.a
ar cr CMakeFiles/cmTC_6e939.dir/objects.a "CMakeFiles/cmTC_6e939.dir/CheckFunctionExists.c.obj" 
/C/msys32/mingw32/bin/i686-w64-mingw32-gcc.exe  -DCHECK_FUNCTION_EXISTS=explicit_bzero    -Wl,--whole-archive CMakeFiles/cmTC_6e939.dir/objects.a -Wl,--no-whole-archive  -o cmTC_6e939.exe -Wl,--major-image-version,0,--minor-image-version,0  -L/C/msys32/home/buildbot/slave/monero-static-win32/build/build/release/CMakeFiles/CMakeTmp/strings.h -lc -lkernel32 -luser32 -lgdi32 -lwinspool -lshell32 -lole32 -loleaut32 -luuid -lcomdlg32 -ladvapi32 
C:/msys32/mingw32/bin/../lib/gcc/i686-w64-mingw32/7.4.0/../../../../i686-w64-mingw32/bin/ld.exe: cannot find -lc

collect2.exe: error: ld returned 1 exit status

make[2]: *** [CMakeFiles/cmTC_6e939.dir/build.make:88: cmTC_6e939.exe] Error 1
make[2]: Leaving directory '/home/buildbot/slave/monero-static-win32/build/build/release/CMakeFiles/CMakeTmp'
make[1]: *** [Makefile:121: cmTC_6e939/fast] Error 2
make[1]: Leaving directory '/home/buildbot/slave/monero-static-win32/build/build/release/CMakeFiles/CMakeTmp'


Determining if the function strptime exists failed with the following output:
Change Dir: C:/msys32/home/buildbot/slave/monero-static-win32/build/build/release/CMakeFiles/CMakeTmp

Run Build Command:"C:/msys32/usr/bin/make.exe" "cmTC_23a4e/fast"
make[1]: Entering directory '/home/buildbot/slave/monero-static-win32/build/build/release/CMakeFiles/CMakeTmp'
/usr/bin/make -f CMakeFiles/cmTC_23a4e.dir/build.make CMakeFiles/cmTC_23a4e.dir/build
make[2]: Entering directory '/home/buildbot/slave/monero-static-win32/build/build/release/CMakeFiles/CMakeTmp'
Building C object CMakeFiles/cmTC_23a4e.dir/CheckFunctionExists.c.obj

/C/msys32/mingw32/bin/i686-w64-mingw32-gcc.exe   -DCHECK_FUNCTION_EXISTS=strptime   -o CMakeFiles/cmTC_23a4e.dir/CheckFunctionExists.c.obj   -c /C/msys32/mingw32/share/cmake-3.12/Modules/CheckFunctionExists.c
Linking C executable cmTC_23a4e.exe

/C/msys32/mingw32/bin/cmake.exe -E remove -f CMakeFiles/cmTC_23a4e.dir/objects.a
ar cr CMakeFiles/cmTC_23a4e.dir/objects.a "CMakeFiles/cmTC_23a4e.dir/CheckFunctionExists.c.obj" 
/C/msys32/mingw32/bin/i686-w64-mingw32-gcc.exe  -DCHECK_FUNCTION_EXISTS=strptime    -Wl,--whole-archive CMakeFiles/cmTC_23a4e.dir/objects.a -Wl,--no-whole-archive  -o cmTC_23a4e.exe -Wl,--major-image-version,0,--minor-image-version,0 -lkernel32 -luser32 -lgdi32 -lwinspool -lshell32 -lole32 -loleaut32 -luuid -lcomdlg32 -ladvapi32 
CMakeFiles/cmTC_23a4e.dir/objects.a(CheckFunctionExists.c.obj):CheckFunctionExists.c:(.text+0xc): undefined reference to `strptime'

collect2.exe: error: ld returned 1 exit status

make[2]: *** [CMakeFiles/cmTC_23a4e.dir/build.make:88: cmTC_23a4e.exe] Error 1
make[2]: Leaving directory '/home/buildbot/slave/monero-static-win32/build/build/release/CMakeFiles/CMakeTmp'
make[1]: *** [Makefile:121: cmTC_23a4e/fast] Error 2
make[1]: Leaving directory '/home/buildbot/slave/monero-static-win32/build/build/release/CMakeFiles/CMakeTmp'


Determining if the include file arpa/inet.h exists failed with the following output:
Change Dir: C:/msys32/home/buildbot/slave/monero-static-win32/build/build/release/CMakeFiles/CMakeTmp

Run Build Command:"C:/msys32/usr/bin/make.exe" "cmTC_30000/fast"
make[1]: Entering directory '/home/buildbot/slave/monero-static-win32/build/build/release/CMakeFiles/CMakeTmp'
/usr/bin/make -f CMakeFiles/cmTC_30000.dir/build.make CMakeFiles/cmTC_30000.dir/build
make[2]: Entering directory '/home/buildbot/slave/monero-static-win32/build/build/release/CMakeFiles/CMakeTmp'
Building C object CMakeFiles/cmTC_30000.dir/CheckIncludeFile.c.obj

/C/msys32/mingw32/bin/i686-w64-mingw32-gcc.exe    -o CMakeFiles/cmTC_30000.dir/CheckIncludeFile.c.obj   -c /C/msys32/home/buildbot/slave/monero-static-win32/build/build/release/CMakeFiles/CMakeTmp/CheckIncludeFile.c
C:/msys32/home/buildbot/slave/monero-static-win32/build/build/release/CMakeFiles/CMakeTmp/CheckIncludeFile.c:1:10: fatal error: arpa/inet.h: No such file or directory

 #include <arpa/inet.h>

          ^~~~~~~~~~~~~

compilation terminated.

make[2]: *** [CMakeFiles/cmTC_30000.dir/build.make:66: CMakeFiles/cmTC_30000.dir/CheckIncludeFile.c.obj] Error 1
make[2]: Leaving directory '/home/buildbot/slave/monero-static-win32/build/build/release/CMakeFiles/CMakeTmp'
make[1]: *** [Makefile:121: cmTC_30000/fast] Error 2
make[1]: Leaving directory '/home/buildbot/slave/monero-static-win32/build/build/release/CMakeFiles/CMakeTmp'


Determining if the include file endian.h exists failed with the following output:
Change Dir: C:/msys32/home/buildbot/slave/monero-static-win32/build/build/release/CMakeFiles/CMakeTmp

Run Build Command:"C:/msys32/usr/bin/make.exe" "cmTC_6f09c/fast"
make[1]: Entering directory '/home/buildbot/slave/monero-static-win32/build/build/release/CMakeFiles/CMakeTmp'
/usr/bin/make -f CMakeFiles/cmTC_6f09c.dir/build.make CMakeFiles/cmTC_6f09c.dir/build
make[2]: Entering directory '/home/buildbot/slave/monero-static-win32/build/build/release/CMakeFiles/CMakeTmp'
Building C object CMakeFiles/cmTC_6f09c.dir/CheckIncludeFile.c.obj

/C/msys32/mingw32/bin/i686-w64-mingw32-gcc.exe    -o CMakeFiles/cmTC_6f09c.dir/CheckIncludeFile.c.obj   -c /C/msys32/home/buildbot/slave/monero-static-win32/build/build/release/CMakeFiles/CMakeTmp/CheckIncludeFile.c
C:/msys32/home/buildbot/slave/monero-static-win32/build/build/release/CMakeFiles/CMakeTmp/CheckIncludeFile.c:1:10: fatal error: endian.h: No such file or directory

 #include <endian.h>

          ^~~~~~~~~~

compilation terminated.

make[2]: *** [CMakeFiles/cmTC_6f09c.dir/build.make:66: CMakeFiles/cmTC_6f09c.dir/CheckIncludeFile.c.obj] Error 1
make[2]: Leaving directory '/home/buildbot/slave/monero-static-win32/build/build/release/CMakeFiles/CMakeTmp'
make[1]: *** [Makefile:121: cmTC_6f09c/fast] Error 2
make[1]: Leaving directory '/home/buildbot/slave/monero-static-win32/build/build/release/CMakeFiles/CMakeTmp'


Determining if the include file dlfcn.h exists failed with the following output:
Change Dir: C:/msys32/home/buildbot/slave/monero-static-win32/build/build/release/CMakeFiles/CMakeTmp

Run Build Command:"C:/msys32/usr/bin/make.exe" "cmTC_2f835/fast"
make[1]: Entering directory '/home/buildbot/slave/monero-static-win32/build/build/release/CMakeFiles/CMakeTmp'
/usr/bin/make -f CMakeFiles/cmTC_2f835.dir/build.make CMakeFiles/cmTC_2f835.dir/build
make[2]: Entering directory '/home/buildbot/slave/monero-static-win32/build/build/release/CMakeFiles/CMakeTmp'
Building C object CMakeFiles/cmTC_2f835.dir/CheckIncludeFile.c.obj

/C/msys32/mingw32/bin/i686-w64-mingw32-gcc.exe    -o CMakeFiles/cmTC_2f835.dir/CheckIncludeFile.c.obj   -c /C/msys32/home/buildbot/slave/monero-static-win32/build/build/release/CMakeFiles/CMakeTmp/CheckIncludeFile.c
C:/msys32/home/buildbot/slave/monero-static-win32/build/build/release/CMakeFiles/CMakeTmp/CheckIncludeFile.c:1:10: fatal error: dlfcn.h: No such file or directory

 #include <dlfcn.h>

          ^~~~~~~~~

compilation terminated.

make[2]: *** [CMakeFiles/cmTC_2f835.dir/build.make:66: CMakeFiles/cmTC_2f835.dir/CheckIncludeFile.c.obj] Error 1
make[2]: Leaving directory '/home/buildbot/slave/monero-static-win32/build/build/release/CMakeFiles/CMakeTmp'
make[1]: *** [Makefile:121: cmTC_2f835/fast] Error 2
make[1]: Leaving directory '/home/buildbot/slave/monero-static-win32/build/build/release/CMakeFiles/CMakeTmp'


Determining if the include file event.h exists failed with the following output:
Change Dir: C:/msys32/home/buildbot/slave/monero-static-win32/build/build/release/CMakeFiles/CMakeTmp

Run Build Command:"C:/msys32/usr/bin/make.exe" "cmTC_a898c/fast"
make[1]: Entering directory '/home/buildbot/slave/monero-static-win32/build/build/release/CMakeFiles/CMakeTmp'
/usr/bin/make -f CMakeFiles/cmTC_a898c.dir/build.make CMakeFiles/cmTC_a898c.dir/build
make[2]: Entering directory '/home/buildbot/slave/monero-static-win32/build/build/release/CMakeFiles/CMakeTmp'
Building C object CMakeFiles/cmTC_a898c.dir/CheckIncludeFile.c.obj

/C/msys32/mingw32/bin/i686-w64-mingw32-gcc.exe    -o CMakeFiles/cmTC_a898c.dir/CheckIncludeFile.c.obj   -c /C/msys32/home/buildbot/slave/monero-static-win32/build/build/release/CMakeFiles/CMakeTmp/CheckIncludeFile.c
C:/msys32/home/buildbot/slave/monero-static-win32/build/build/release/CMakeFiles/CMakeTmp/CheckIncludeFile.c:1:10: fatal error: event.h: No such file or directory

 #include <event.h>

          ^~~~~~~~~

compilation terminated.

make[2]: *** [CMakeFiles/cmTC_a898c.dir/build.make:66: CMakeFiles/cmTC_a898c.dir/CheckIncludeFile.c.obj] Error 1
make[2]: Leaving directory '/home/buildbot/slave/monero-static-win32/build/build/release/CMakeFiles/CMakeTmp'
make[1]: *** [Makefile:121: cmTC_a898c/fast] Error 2
make[1]: Leaving directory '/home/buildbot/slave/monero-static-win32/build/build/release/CMakeFiles/CMakeTmp'


Determining if the include file glob.h exists failed with the following output:
Change Dir: C:/msys32/home/buildbot/slave/monero-static-win32/build/build/release/CMakeFiles/CMakeTmp

Run Build Command:"C:/msys32/usr/bin/make.exe" "cmTC_a4454/fast"
make[1]: Entering directory '/home/buildbot/slave/monero-static-win32/build/build/release/CMakeFiles/CMakeTmp'
/usr/bin/make -f CMakeFiles/cmTC_a4454.dir/build.make CMakeFiles/cmTC_a4454.dir/build
make[2]: Entering directory '/home/buildbot/slave/monero-static-win32/build/build/release/CMakeFiles/CMakeTmp'
Building C object CMakeFiles/cmTC_a4454.dir/CheckIncludeFile.c.obj

/C/msys32/mingw32/bin/i686-w64-mingw32-gcc.exe    -o CMakeFiles/cmTC_a4454.dir/CheckIncludeFile.c.obj   -c /C/msys32/home/buildbot/slave/monero-static-win32/build/build/release/CMakeFiles/CMakeTmp/CheckIncludeFile.c
C:/msys32/home/buildbot/slave/monero-static-win32/build/build/release/CMakeFiles/CMakeTmp/CheckIncludeFile.c:1:10: fatal error: glob.h: No such file or directory

 #include <glob.h>

          ^~~~~~~~

compilation terminated.

make[2]: *** [CMakeFiles/cmTC_a4454.dir/build.make:66: CMakeFiles/cmTC_a4454.dir/CheckIncludeFile.c.obj] Error 1
make[2]: Leaving directory '/home/buildbot/slave/monero-static-win32/build/build/release/CMakeFiles/CMakeTmp'
make[1]: *** [Makefile:121: cmTC_a4454/fast] Error 2
make[1]: Leaving directory '/home/buildbot/slave/monero-static-win32/build/build/release/CMakeFiles/CMakeTmp'


Determining if the include file grp.h exists failed with the following output:
Change Dir: C:/msys32/home/buildbot/slave/monero-static-win32/build/build/release/CMakeFiles/CMakeTmp

Run Build Command:"C:/msys32/usr/bin/make.exe" "cmTC_bac8e/fast"
make[1]: Entering directory '/home/buildbot/slave/monero-static-win32/build/build/release/CMakeFiles/CMakeTmp'
/usr/bin/make -f CMakeFiles/cmTC_bac8e.dir/build.make CMakeFiles/cmTC_bac8e.dir/build
make[2]: Entering directory '/home/buildbot/slave/monero-static-win32/build/build/release/CMakeFiles/CMakeTmp'
Building C object CMakeFiles/cmTC_bac8e.dir/CheckIncludeFile.c.obj

/C/msys32/mingw32/bin/i686-w64-mingw32-gcc.exe    -o CMakeFiles/cmTC_bac8e.dir/CheckIncludeFile.c.obj   -c /C/msys32/home/buildbot/slave/monero-static-win32/build/build/release/CMakeFiles/CMakeTmp/CheckIncludeFile.c
C:/msys32/home/buildbot/slave/monero-static-win32/build/build/release/CMakeFiles/CMakeTmp/CheckIncludeFile.c:1:10: fatal error: grp.h: No such file or directory

 #include <grp.h>

          ^~~~~~~

compilation terminated.

make[2]: *** [CMakeFiles/cmTC_bac8e.dir/build.make:66: CMakeFiles/cmTC_bac8e.dir/CheckIncludeFile.c.obj] Error 1
make[2]: Leaving directory '/home/buildbot/slave/monero-static-win32/build/build/release/CMakeFiles/CMakeTmp'
make[1]: *** [Makefile:121: cmTC_bac8e/fast] Error 2
make[1]: Leaving directory '/home/buildbot/slave/monero-static-win32/build/build/release/CMakeFiles/CMakeTmp'


Determining if the include file login_cap.h exists failed with the following output:
Change Dir: C:/msys32/home/buildbot/slave/monero-static-win32/build/build/release/CMakeFiles/CMakeTmp

Run Build Command:"C:/msys32/usr/bin/make.exe" "cmTC_60c46/fast"
make[1]: Entering directory '/home/buildbot/slave/monero-static-win32/build/build/release/CMakeFiles/CMakeTmp'
/usr/bin/make -f CMakeFiles/cmTC_60c46.dir/build.make CMakeFiles/cmTC_60c46.dir/build
make[2]: Entering directory '/home/buildbot/slave/monero-static-win32/build/build/release/CMakeFiles/CMakeTmp'
Building C object CMakeFiles/cmTC_60c46.dir/CheckIncludeFile.c.obj

/C/msys32/mingw32/bin/i686-w64-mingw32-gcc.exe    -o CMakeFiles/cmTC_60c46.dir/CheckIncludeFile.c.obj   -c /C/msys32/home/buildbot/slave/monero-static-win32/build/build/release/CMakeFiles/CMakeTmp/CheckIncludeFile.c
C:/msys32/home/buildbot/slave/monero-static-win32/build/build/release/CMakeFiles/CMakeTmp/CheckIncludeFile.c:1:10: fatal error: login_cap.h: No such file or directory

 #include <login_cap.h>

          ^~~~~~~~~~~~~

compilation terminated.

make[2]: *** [CMakeFiles/cmTC_60c46.dir/build.make:66: CMakeFiles/cmTC_60c46.dir/CheckIncludeFile.c.obj] Error 1
make[2]: Leaving directory '/home/buildbot/slave/monero-static-win32/build/build/release/CMakeFiles/CMakeTmp'
make[1]: *** [Makefile:121: cmTC_60c46/fast] Error 2
make[1]: Leaving directory '/home/buildbot/slave/monero-static-win32/build/build/release/CMakeFiles/CMakeTmp'


Determining if the include file netdb.h exists failed with the following output:
Change Dir: C:/msys32/home/buildbot/slave/monero-static-win32/build/build/release/CMakeFiles/CMakeTmp

Run Build Command:"C:/msys32/usr/bin/make.exe" "cmTC_c06a5/fast"
make[1]: Entering directory '/home/buildbot/slave/monero-static-win32/build/build/release/CMakeFiles/CMakeTmp'
/usr/bin/make -f CMakeFiles/cmTC_c06a5.dir/build.make CMakeFiles/cmTC_c06a5.dir/build
make[2]: Entering directory '/home/buildbot/slave/monero-static-win32/build/build/release/CMakeFiles/CMakeTmp'
Building C object CMakeFiles/cmTC_c06a5.dir/CheckIncludeFile.c.obj

/C/msys32/mingw32/bin/i686-w64-mingw32-gcc.exe    -o CMakeFiles/cmTC_c06a5.dir/CheckIncludeFile.c.obj   -c /C/msys32/home/buildbot/slave/monero-static-win32/build/build/release/CMakeFiles/CMakeTmp/CheckIncludeFile.c
C:/msys32/home/buildbot/slave/monero-static-win32/build/build/release/CMakeFiles/CMakeTmp/CheckIncludeFile.c:1:10: fatal error: netdb.h: No such file or directory

 #include <netdb.h>

          ^~~~~~~~~

compilation terminated.

make[2]: *** [CMakeFiles/cmTC_c06a5.dir/build.make:66: CMakeFiles/cmTC_c06a5.dir/CheckIncludeFile.c.obj] Error 1
make[2]: Leaving directory '/home/buildbot/slave/monero-static-win32/build/build/release/CMakeFiles/CMakeTmp'
make[1]: *** [Makefile:121: cmTC_c06a5/fast] Error 2
make[1]: Leaving directory '/home/buildbot/slave/monero-static-win32/build/build/release/CMakeFiles/CMakeTmp'


Determining if the include file netinet/in.h exists failed with the following output:
Change Dir: C:/msys32/home/buildbot/slave/monero-static-win32/build/build/release/CMakeFiles/CMakeTmp

Run Build Command:"C:/msys32/usr/bin/make.exe" "cmTC_9bc70/fast"
make[1]: Entering directory '/home/buildbot/slave/monero-static-win32/build/build/release/CMakeFiles/CMakeTmp'
/usr/bin/make -f CMakeFiles/cmTC_9bc70.dir/build.make CMakeFiles/cmTC_9bc70.dir/build
make[2]: Entering directory '/home/buildbot/slave/monero-static-win32/build/build/release/CMakeFiles/CMakeTmp'
Building C object CMakeFiles/cmTC_9bc70.dir/CheckIncludeFile.c.obj

/C/msys32/mingw32/bin/i686-w64-mingw32-gcc.exe    -o CMakeFiles/cmTC_9bc70.dir/CheckIncludeFile.c.obj   -c /C/msys32/home/buildbot/slave/monero-static-win32/build/build/release/CMakeFiles/CMakeTmp/CheckIncludeFile.c
C:/msys32/home/buildbot/slave/monero-static-win32/build/build/release/CMakeFiles/CMakeTmp/CheckIncludeFile.c:1:10: fatal error: netinet/in.h: No such file or directory

 #include <netinet/in.h>

          ^~~~~~~~~~~~~~

compilation terminated.

make[2]: *** [CMakeFiles/cmTC_9bc70.dir/build.make:66: CMakeFiles/cmTC_9bc70.dir/CheckIncludeFile.c.obj] Error 1
make[2]: Leaving directory '/home/buildbot/slave/monero-static-win32/build/build/release/CMakeFiles/CMakeTmp'
make[1]: *** [Makefile:121: cmTC_9bc70/fast] Error 2
make[1]: Leaving directory '/home/buildbot/slave/monero-static-win32/build/build/release/CMakeFiles/CMakeTmp'


Determining if the include file pwd.h exists failed with the following output:
Change Dir: C:/msys32/home/buildbot/slave/monero-static-win32/build/build/release/CMakeFiles/CMakeTmp

Run Build Command:"C:/msys32/usr/bin/make.exe" "cmTC_0d122/fast"
make[1]: Entering directory '/home/buildbot/slave/monero-static-win32/build/build/release/CMakeFiles/CMakeTmp'
/usr/bin/make -f CMakeFiles/cmTC_0d122.dir/build.make CMakeFiles/cmTC_0d122.dir/build
make[2]: Entering directory '/home/buildbot/slave/monero-static-win32/build/build/release/CMakeFiles/CMakeTmp'
Building C object CMakeFiles/cmTC_0d122.dir/CheckIncludeFile.c.obj

/C/msys32/mingw32/bin/i686-w64-mingw32-gcc.exe    -o CMakeFiles/cmTC_0d122.dir/CheckIncludeFile.c.obj   -c /C/msys32/home/buildbot/slave/monero-static-win32/build/build/release/CMakeFiles/CMakeTmp/CheckIncludeFile.c
C:/msys32/home/buildbot/slave/monero-static-win32/build/build/release/CMakeFiles/CMakeTmp/CheckIncludeFile.c:1:10: fatal error: pwd.h: No such file or directory

 #include <pwd.h>

          ^~~~~~~

compilation terminated.

make[2]: *** [CMakeFiles/cmTC_0d122.dir/build.make:66: CMakeFiles/cmTC_0d122.dir/CheckIncludeFile.c.obj] Error 1
make[2]: Leaving directory '/home/buildbot/slave/monero-static-win32/build/build/release/CMakeFiles/CMakeTmp'
make[1]: *** [Makefile:121: cmTC_0d122/fast] Error 2
make[1]: Leaving directory '/home/buildbot/slave/monero-static-win32/build/build/release/CMakeFiles/CMakeTmp'


Determining if the include file sys/resource.h exists failed with the following output:
Change Dir: C:/msys32/home/buildbot/slave/monero-static-win32/build/build/release/CMakeFiles/CMakeTmp

Run Build Command:"C:/msys32/usr/bin/make.exe" "cmTC_d81cd/fast"
make[1]: Entering directory '/home/buildbot/slave/monero-static-win32/build/build/release/CMakeFiles/CMakeTmp'
/usr/bin/make -f CMakeFiles/cmTC_d81cd.dir/build.make CMakeFiles/cmTC_d81cd.dir/build
make[2]: Entering directory '/home/buildbot/slave/monero-static-win32/build/build/release/CMakeFiles/CMakeTmp'
Building C object CMakeFiles/cmTC_d81cd.dir/CheckIncludeFile.c.obj

/C/msys32/mingw32/bin/i686-w64-mingw32-gcc.exe    -o CMakeFiles/cmTC_d81cd.dir/CheckIncludeFile.c.obj   -c /C/msys32/home/buildbot/slave/monero-static-win32/build/build/release/CMakeFiles/CMakeTmp/CheckIncludeFile.c
C:/msys32/home/buildbot/slave/monero-static-win32/build/build/release/CMakeFiles/CMakeTmp/CheckIncludeFile.c:1:10: fatal error: sys/resource.h: No such file or directory

 #include <sys/resource.h>

          ^~~~~~~~~~~~~~~~

compilation terminated.

make[2]: *** [CMakeFiles/cmTC_d81cd.dir/build.make:66: CMakeFiles/cmTC_d81cd.dir/CheckIncludeFile.c.obj] Error 1
make[2]: Leaving directory '/home/buildbot/slave/monero-static-win32/build/build/release/CMakeFiles/CMakeTmp'
make[1]: *** [Makefile:121: cmTC_d81cd/fast] Error 2
make[1]: Leaving directory '/home/buildbot/slave/monero-static-win32/build/build/release/CMakeFiles/CMakeTmp'


Determining if the include file sys/sha2.h exists failed with the following output:
Change Dir: C:/msys32/home/buildbot/slave/monero-static-win32/build/build/release/CMakeFiles/CMakeTmp

Run Build Command:"C:/msys32/usr/bin/make.exe" "cmTC_d1b80/fast"
make[1]: Entering directory '/home/buildbot/slave/monero-static-win32/build/build/release/CMakeFiles/CMakeTmp'
/usr/bin/make -f CMakeFiles/cmTC_d1b80.dir/build.make CMakeFiles/cmTC_d1b80.dir/build
make[2]: Entering directory '/home/buildbot/slave/monero-static-win32/build/build/release/CMakeFiles/CMakeTmp'
Building C object CMakeFiles/cmTC_d1b80.dir/CheckIncludeFile.c.obj

/C/msys32/mingw32/bin/i686-w64-mingw32-gcc.exe    -o CMakeFiles/cmTC_d1b80.dir/CheckIncludeFile.c.obj   -c /C/msys32/home/buildbot/slave/monero-static-win32/build/build/release/CMakeFiles/CMakeTmp/CheckIncludeFile.c
C:/msys32/home/buildbot/slave/monero-static-win32/build/build/release/CMakeFiles/CMakeTmp/CheckIncludeFile.c:1:10: fatal error: sys/sha2.h: No such file or directory

 #include <sys/sha2.h>

          ^~~~~~~~~~~~

compilation terminated.

make[2]: *** [CMakeFiles/cmTC_d1b80.dir/build.make:66: CMakeFiles/cmTC_d1b80.dir/CheckIncludeFile.c.obj] Error 1
make[2]: Leaving directory '/home/buildbot/slave/monero-static-win32/build/build/release/CMakeFiles/CMakeTmp'
make[1]: *** [Makefile:121: cmTC_d1b80/fast] Error 2
make[1]: Leaving directory '/home/buildbot/slave/monero-static-win32/build/build/release/CMakeFiles/CMakeTmp'


Determining if the include file sys/socket.h exists failed with the following output:
Change Dir: C:/msys32/home/buildbot/slave/monero-static-win32/build/build/release/CMakeFiles/CMakeTmp

Run Build Command:"C:/msys32/usr/bin/make.exe" "cmTC_771d5/fast"
make[1]: Entering directory '/home/buildbot/slave/monero-static-win32/build/build/release/CMakeFiles/CMakeTmp'
/usr/bin/make -f CMakeFiles/cmTC_771d5.dir/build.make CMakeFiles/cmTC_771d5.dir/build
make[2]: Entering directory '/home/buildbot/slave/monero-static-win32/build/build/release/CMakeFiles/CMakeTmp'
Building C object CMakeFiles/cmTC_771d5.dir/CheckIncludeFile.c.obj

/C/msys32/mingw32/bin/i686-w64-mingw32-gcc.exe    -o CMakeFiles/cmTC_771d5.dir/CheckIncludeFile.c.obj   -c /C/msys32/home/buildbot/slave/monero-static-win32/build/build/release/CMakeFiles/CMakeTmp/CheckIncludeFile.c
C:/msys32/home/buildbot/slave/monero-static-win32/build/build/release/CMakeFiles/CMakeTmp/CheckIncludeFile.c:1:10: fatal error: sys/socket.h: No such file or directory

 #include <sys/socket.h>

          ^~~~~~~~~~~~~~

compilation terminated.

make[2]: *** [CMakeFiles/cmTC_771d5.dir/build.make:66: CMakeFiles/cmTC_771d5.dir/CheckIncludeFile.c.obj] Error 1
make[2]: Leaving directory '/home/buildbot/slave/monero-static-win32/build/build/release/CMakeFiles/CMakeTmp'
make[1]: *** [Makefile:121: cmTC_771d5/fast] Error 2
make[1]: Leaving directory '/home/buildbot/slave/monero-static-win32/build/build/release/CMakeFiles/CMakeTmp'


Determining if the include file sys/sysctl.h exists failed with the following output:
Change Dir: C:/msys32/home/buildbot/slave/monero-static-win32/build/build/release/CMakeFiles/CMakeTmp

Run Build Command:"C:/msys32/usr/bin/make.exe" "cmTC_dad46/fast"
make[1]: Entering directory '/home/buildbot/slave/monero-static-win32/build/build/release/CMakeFiles/CMakeTmp'
/usr/bin/make -f CMakeFiles/cmTC_dad46.dir/build.make CMakeFiles/cmTC_dad46.dir/build
make[2]: Entering directory '/home/buildbot/slave/monero-static-win32/build/build/release/CMakeFiles/CMakeTmp'
Building C object CMakeFiles/cmTC_dad46.dir/CheckIncludeFile.c.obj

/C/msys32/mingw32/bin/i686-w64-mingw32-gcc.exe    -o CMakeFiles/cmTC_dad46.dir/CheckIncludeFile.c.obj   -c /C/msys32/home/buildbot/slave/monero-static-win32/build/build/release/CMakeFiles/CMakeTmp/CheckIncludeFile.c
C:/msys32/home/buildbot/slave/monero-static-win32/build/build/release/CMakeFiles/CMakeTmp/CheckIncludeFile.c:1:10: fatal error: sys/sysctl.h: No such file or directory

 #include <sys/sysctl.h>

          ^~~~~~~~~~~~~~

compilation terminated.

make[2]: *** [CMakeFiles/cmTC_dad46.dir/build.make:66: CMakeFiles/cmTC_dad46.dir/CheckIncludeFile.c.obj] Error 1
make[2]: Leaving directory '/home/buildbot/slave/monero-static-win32/build/build/release/CMakeFiles/CMakeTmp'
make[1]: *** [Makefile:121: cmTC_dad46/fast] Error 2
make[1]: Leaving directory '/home/buildbot/slave/monero-static-win32/build/build/release/CMakeFiles/CMakeTmp'


Determining if the include file sys/uio.h exists failed with the following output:
Change Dir: C:/msys32/home/buildbot/slave/monero-static-win32/build/build/release/CMakeFiles/CMakeTmp

Run Build Command:"C:/msys32/usr/bin/make.exe" "cmTC_e2a20/fast"
make[1]: Entering directory '/home/buildbot/slave/monero-static-win32/build/build/release/CMakeFiles/CMakeTmp'
/usr/bin/make -f CMakeFiles/cmTC_e2a20.dir/build.make CMakeFiles/cmTC_e2a20.dir/build
make[2]: Entering directory '/home/buildbot/slave/monero-static-win32/build/build/release/CMakeFiles/CMakeTmp'
Building C object CMakeFiles/cmTC_e2a20.dir/CheckIncludeFile.c.obj

/C/msys32/mingw32/bin/i686-w64-mingw32-gcc.exe    -o CMakeFiles/cmTC_e2a20.dir/CheckIncludeFile.c.obj   -c /C/msys32/home/buildbot/slave/monero-static-win32/build/build/release/CMakeFiles/CMakeTmp/CheckIncludeFile.c
C:/msys32/home/buildbot/slave/monero-static-win32/build/build/release/CMakeFiles/CMakeTmp/CheckIncludeFile.c:1:10: fatal error: sys/uio.h: No such file or directory

 #include <sys/uio.h>

          ^~~~~~~~~~~

compilation terminated.

make[2]: *** [CMakeFiles/cmTC_e2a20.dir/build.make:66: CMakeFiles/cmTC_e2a20.dir/CheckIncludeFile.c.obj] Error 1
make[2]: Leaving directory '/home/buildbot/slave/monero-static-win32/build/build/release/CMakeFiles/CMakeTmp'
make[1]: *** [Makefile:121: cmTC_e2a20/fast] Error 2
make[1]: Leaving directory '/home/buildbot/slave/monero-static-win32/build/build/release/CMakeFiles/CMakeTmp'


Determining if the include file sys/un.h exists failed with the following output:
Change Dir: C:/msys32/home/buildbot/slave/monero-static-win32/build/build/release/CMakeFiles/CMakeTmp

Run Build Command:"C:/msys32/usr/bin/make.exe" "cmTC_89a66/fast"
make[1]: Entering directory '/home/buildbot/slave/monero-static-win32/build/build/release/CMakeFiles/CMakeTmp'
/usr/bin/make -f CMakeFiles/cmTC_89a66.dir/build.make CMakeFiles/cmTC_89a66.dir/build
make[2]: Entering directory '/home/buildbot/slave/monero-static-win32/build/build/release/CMakeFiles/CMakeTmp'
Building C object CMakeFiles/cmTC_89a66.dir/CheckIncludeFile.c.obj

/C/msys32/mingw32/bin/i686-w64-mingw32-gcc.exe    -o CMakeFiles/cmTC_89a66.dir/CheckIncludeFile.c.obj   -c /C/msys32/home/buildbot/slave/monero-static-win32/build/build/release/CMakeFiles/CMakeTmp/CheckIncludeFile.c
C:/msys32/home/buildbot/slave/monero-static-win32/build/build/release/CMakeFiles/CMakeTmp/CheckIncludeFile.c:1:10: fatal error: sys/un.h: No such file or directory

 #include <sys/un.h>

          ^~~~~~~~~~

compilation terminated.

make[2]: *** [CMakeFiles/cmTC_89a66.dir/build.make:66: CMakeFiles/cmTC_89a66.dir/CheckIncludeFile.c.obj] Error 1
make[2]: Leaving directory '/home/buildbot/slave/monero-static-win32/build/build/release/CMakeFiles/CMakeTmp'
make[1]: *** [Makefile:121: cmTC_89a66/fast] Error 2
make[1]: Leaving directory '/home/buildbot/slave/monero-static-win32/build/build/release/CMakeFiles/CMakeTmp'


Determining if the include file sys/wait.h exists failed with the following output:
Change Dir: C:/msys32/home/buildbot/slave/monero-static-win32/build/build/release/CMakeFiles/CMakeTmp

Run Build Command:"C:/msys32/usr/bin/make.exe" "cmTC_3f79a/fast"
make[1]: Entering directory '/home/buildbot/slave/monero-static-win32/build/build/release/CMakeFiles/CMakeTmp'
/usr/bin/make -f CMakeFiles/cmTC_3f79a.dir/build.make CMakeFiles/cmTC_3f79a.dir/build
make[2]: Entering directory '/home/buildbot/slave/monero-static-win32/build/build/release/CMakeFiles/CMakeTmp'
Building C object CMakeFiles/cmTC_3f79a.dir/CheckIncludeFile.c.obj

/C/msys32/mingw32/bin/i686-w64-mingw32-gcc.exe    -o CMakeFiles/cmTC_3f79a.dir/CheckIncludeFile.c.obj   -c /C/msys32/home/buildbot/slave/monero-static-win32/build/build/release/CMakeFiles/CMakeTmp/CheckIncludeFile.c
C:/msys32/home/buildbot/slave/monero-static-win32/build/build/release/CMakeFiles/CMakeTmp/CheckIncludeFile.c:1:10: fatal error: sys/wait.h: No such file or directory

 #include <sys/wait.h>

          ^~~~~~~~~~~~

compilation terminated.

make[2]: *** [CMakeFiles/cmTC_3f79a.dir/build.make:66: CMakeFiles/cmTC_3f79a.dir/CheckIncludeFile.c.obj] Error 1
make[2]: Leaving directory '/home/buildbot/slave/monero-static-win32/build/build/release/CMakeFiles/CMakeTmp'
make[1]: *** [Makefile:121: cmTC_3f79a/fast] Error 2
make[1]: Leaving directory '/home/buildbot/slave/monero-static-win32/build/build/release/CMakeFiles/CMakeTmp'


Determining if the include file syslog.h exists failed with the following output:
Change Dir: C:/msys32/home/buildbot/slave/monero-static-win32/build/build/release/CMakeFiles/CMakeTmp

Run Build Command:"C:/msys32/usr/bin/make.exe" "cmTC_f3332/fast"
make[1]: Entering directory '/home/buildbot/slave/monero-static-win32/build/build/release/CMakeFiles/CMakeTmp'
/usr/bin/make -f CMakeFiles/cmTC_f3332.dir/build.make CMakeFiles/cmTC_f3332.dir/build
make[2]: Entering directory '/home/buildbot/slave/monero-static-win32/build/build/release/CMakeFiles/CMakeTmp'
Building C object CMakeFiles/cmTC_f3332.dir/CheckIncludeFile.c.obj

/C/msys32/mingw32/bin/i686-w64-mingw32-gcc.exe    -o CMakeFiles/cmTC_f3332.dir/CheckIncludeFile.c.obj   -c /C/msys32/home/buildbot/slave/monero-static-win32/build/build/release/CMakeFiles/CMakeTmp/CheckIncludeFile.c
C:/msys32/home/buildbot/slave/monero-static-win32/build/build/release/CMakeFiles/CMakeTmp/CheckIncludeFile.c:1:10: fatal error: syslog.h: No such file or directory

 #include <syslog.h>

          ^~~~~~~~~~

compilation terminated.

make[2]: *** [CMakeFiles/cmTC_f3332.dir/build.make:66: CMakeFiles/cmTC_f3332.dir/CheckIncludeFile.c.obj] Error 1
make[2]: Leaving directory '/home/buildbot/slave/monero-static-win32/build/build/release/CMakeFiles/CMakeTmp'
make[1]: *** [Makefile:121: cmTC_f3332/fast] Error 2
make[1]: Leaving directory '/home/buildbot/slave/monero-static-win32/build/build/release/CMakeFiles/CMakeTmp'


Determining if the include file vfork.h exists failed with the following output:
Change Dir: C:/msys32/home/buildbot/slave/monero-static-win32/build/build/release/CMakeFiles/CMakeTmp

Run Build Command:"C:/msys32/usr/bin/make.exe" "cmTC_985d0/fast"
make[1]: Entering directory '/home/buildbot/slave/monero-static-win32/build/build/release/CMakeFiles/CMakeTmp'
/usr/bin/make -f CMakeFiles/cmTC_985d0.dir/build.make CMakeFiles/cmTC_985d0.dir/build
make[2]: Entering directory '/home/buildbot/slave/monero-static-win32/build/build/release/CMakeFiles/CMakeTmp'
Building C object CMakeFiles/cmTC_985d0.dir/CheckIncludeFile.c.obj

/C/msys32/mingw32/bin/i686-w64-mingw32-gcc.exe    -o CMakeFiles/cmTC_985d0.dir/CheckIncludeFile.c.obj   -c /C/msys32/home/buildbot/slave/monero-static-win32/build/build/release/CMakeFiles/CMakeTmp/CheckIncludeFile.c
C:/msys32/home/buildbot/slave/monero-static-win32/build/build/release/CMakeFiles/CMakeTmp/CheckIncludeFile.c:1:10: fatal error: vfork.h: No such file or directory

 #include <vfork.h>

          ^~~~~~~~~

compilation terminated.

make[2]: *** [CMakeFiles/cmTC_985d0.dir/build.make:66: CMakeFiles/cmTC_985d0.dir/CheckIncludeFile.c.obj] Error 1
make[2]: Leaving directory '/home/buildbot/slave/monero-static-win32/build/build/release/CMakeFiles/CMakeTmp'
make[1]: *** [Makefile:121: cmTC_985d0/fast] Error 2
make[1]: Leaving directory '/home/buildbot/slave/monero-static-win32/build/build/release/CMakeFiles/CMakeTmp'


Determining if the function arc4random exists failed with the following output:
Change Dir: C:/msys32/home/buildbot/slave/monero-static-win32/build/build/release/CMakeFiles/CMakeTmp

Run Build Command:"C:/msys32/usr/bin/make.exe" "cmTC_b4bcb/fast"
make[1]: Entering directory '/home/buildbot/slave/monero-static-win32/build/build/release/CMakeFiles/CMakeTmp'
/usr/bin/make -f CMakeFiles/cmTC_b4bcb.dir/build.make CMakeFiles/cmTC_b4bcb.dir/build
make[2]: Entering directory '/home/buildbot/slave/monero-static-win32/build/build/release/CMakeFiles/CMakeTmp'
Building C object CMakeFiles/cmTC_b4bcb.dir/CheckFunctionExists.c.obj

/C/msys32/mingw32/bin/i686-w64-mingw32-gcc.exe   -DCHECK_FUNCTION_EXISTS=arc4random   -o CMakeFiles/cmTC_b4bcb.dir/CheckFunctionExists.c.obj   -c /C/msys32/mingw32/share/cmake-3.12/Modules/CheckFunctionExists.c
Linking C executable cmTC_b4bcb.exe

/C/msys32/mingw32/bin/cmake.exe -E remove -f CMakeFiles/cmTC_b4bcb.dir/objects.a
ar cr CMakeFiles/cmTC_b4bcb.dir/objects.a "CMakeFiles/cmTC_b4bcb.dir/CheckFunctionExists.c.obj" 
/C/msys32/mingw32/bin/i686-w64-mingw32-gcc.exe  -DCHECK_FUNCTION_EXISTS=arc4random    -Wl,--whole-archive CMakeFiles/cmTC_b4bcb.dir/objects.a -Wl,--no-whole-archive  -o cmTC_b4bcb.exe -Wl,--major-image-version,0,--minor-image-version,0 -liphlpapi -lws2_32 -lkernel32 -luser32 -lgdi32 -lwinspool -lshell32 -lole32 -loleaut32 -luuid -lcomdlg32 -ladvapi32 
CMakeFiles/cmTC_b4bcb.dir/objects.a(CheckFunctionExists.c.obj):CheckFunctionExists.c:(.text+0xc): undefined reference to `arc4random'

collect2.exe: error: ld returned 1 exit status

make[2]: *** [CMakeFiles/cmTC_b4bcb.dir/build.make:88: cmTC_b4bcb.exe] Error 1
make[2]: Leaving directory '/home/buildbot/slave/monero-static-win32/build/build/release/CMakeFiles/CMakeTmp'
make[1]: *** [Makefile:121: cmTC_b4bcb/fast] Error 2
make[1]: Leaving directory '/home/buildbot/slave/monero-static-win32/build/build/release/CMakeFiles/CMakeTmp'


Determining if the function arc4random_uniform exists failed with the following output:
Change Dir: C:/msys32/home/buildbot/slave/monero-static-win32/build/build/release/CMakeFiles/CMakeTmp

Run Build Command:"C:/msys32/usr/bin/make.exe" "cmTC_d00d2/fast"
make[1]: Entering directory '/home/buildbot/slave/monero-static-win32/build/build/release/CMakeFiles/CMakeTmp'
/usr/bin/make -f CMakeFiles/cmTC_d00d2.dir/build.make CMakeFiles/cmTC_d00d2.dir/build
make[2]: Entering directory '/home/buildbot/slave/monero-static-win32/build/build/release/CMakeFiles/CMakeTmp'
Building C object CMakeFiles/cmTC_d00d2.dir/CheckFunctionExists.c.obj

/C/msys32/mingw32/bin/i686-w64-mingw32-gcc.exe   -DCHECK_FUNCTION_EXISTS=arc4random_uniform   -o CMakeFiles/cmTC_d00d2.dir/CheckFunctionExists.c.obj   -c /C/msys32/mingw32/share/cmake-3.12/Modules/CheckFunctionExists.c
Linking C executable cmTC_d00d2.exe

/C/msys32/mingw32/bin/cmake.exe -E remove -f CMakeFiles/cmTC_d00d2.dir/objects.a
ar cr CMakeFiles/cmTC_d00d2.dir/objects.a "CMakeFiles/cmTC_d00d2.dir/CheckFunctionExists.c.obj" 
/C/msys32/mingw32/bin/i686-w64-mingw32-gcc.exe  -DCHECK_FUNCTION_EXISTS=arc4random_uniform    -Wl,--whole-archive CMakeFiles/cmTC_d00d2.dir/objects.a -Wl,--no-whole-archive  -o cmTC_d00d2.exe -Wl,--major-image-version,0,--minor-image-version,0 -liphlpapi -lws2_32 -lkernel32 -luser32 -lgdi32 -lwinspool -lshell32 -lole32 -loleaut32 -luuid -lcomdlg32 -ladvapi32 
CMakeFiles/cmTC_d00d2.dir/objects.a(CheckFunctionExists.c.obj):CheckFunctionExists.c:(.text+0xc): undefined reference to `arc4random_uniform'

collect2.exe: error: ld returned 1 exit status

make[2]: *** [CMakeFiles/cmTC_d00d2.dir/build.make:88: cmTC_d00d2.exe] Error 1
make[2]: Leaving directory '/home/buildbot/slave/monero-static-win32/build/build/release/CMakeFiles/CMakeTmp'
make[1]: *** [Makefile:121: cmTC_d00d2/fast] Error 2
make[1]: Leaving directory '/home/buildbot/slave/monero-static-win32/build/build/release/CMakeFiles/CMakeTmp'


Determining if the function chown exists failed with the following output:
Change Dir: C:/msys32/home/buildbot/slave/monero-static-win32/build/build/release/CMakeFiles/CMakeTmp

Run Build Command:"C:/msys32/usr/bin/make.exe" "cmTC_91710/fast"
make[1]: Entering directory '/home/buildbot/slave/monero-static-win32/build/build/release/CMakeFiles/CMakeTmp'
/usr/bin/make -f CMakeFiles/cmTC_91710.dir/build.make CMakeFiles/cmTC_91710.dir/build
make[2]: Entering directory '/home/buildbot/slave/monero-static-win32/build/build/release/CMakeFiles/CMakeTmp'
Building C object CMakeFiles/cmTC_91710.dir/CheckFunctionExists.c.obj

/C/msys32/mingw32/bin/i686-w64-mingw32-gcc.exe   -DCHECK_FUNCTION_EXISTS=chown   -o CMakeFiles/cmTC_91710.dir/CheckFunctionExists.c.obj   -c /C/msys32/mingw32/share/cmake-3.12/Modules/CheckFunctionExists.c
Linking C executable cmTC_91710.exe

/C/msys32/mingw32/bin/cmake.exe -E remove -f CMakeFiles/cmTC_91710.dir/objects.a
ar cr CMakeFiles/cmTC_91710.dir/objects.a "CMakeFiles/cmTC_91710.dir/CheckFunctionExists.c.obj" 
/C/msys32/mingw32/bin/i686-w64-mingw32-gcc.exe  -DCHECK_FUNCTION_EXISTS=chown    -Wl,--whole-archive CMakeFiles/cmTC_91710.dir/objects.a -Wl,--no-whole-archive  -o cmTC_91710.exe -Wl,--major-image-version,0,--minor-image-version,0 -liphlpapi -lws2_32 -lkernel32 -luser32 -lgdi32 -lwinspool -lshell32 -lole32 -loleaut32 -luuid -lcomdlg32 -ladvapi32 
CMakeFiles/cmTC_91710.dir/objects.a(CheckFunctionExists.c.obj):CheckFunctionExists.c:(.text+0xc): undefined reference to `chown'

collect2.exe: error: ld returned 1 exit status

make[2]: *** [CMakeFiles/cmTC_91710.dir/build.make:88: cmTC_91710.exe] Error 1
make[2]: Leaving directory '/home/buildbot/slave/monero-static-win32/build/build/release/CMakeFiles/CMakeTmp'
make[1]: *** [Makefile:121: cmTC_91710/fast] Error 2
make[1]: Leaving directory '/home/buildbot/slave/monero-static-win32/build/build/release/CMakeFiles/CMakeTmp'


Determining if the function chroot exists failed with the following output:
Change Dir: C:/msys32/home/buildbot/slave/monero-static-win32/build/build/release/CMakeFiles/CMakeTmp

Run Build Command:"C:/msys32/usr/bin/make.exe" "cmTC_cc4a7/fast"
make[1]: Entering directory '/home/buildbot/slave/monero-static-win32/build/build/release/CMakeFiles/CMakeTmp'
/usr/bin/make -f CMakeFiles/cmTC_cc4a7.dir/build.make CMakeFiles/cmTC_cc4a7.dir/build
make[2]: Entering directory '/home/buildbot/slave/monero-static-win32/build/build/release/CMakeFiles/CMakeTmp'
Building C object CMakeFiles/cmTC_cc4a7.dir/CheckFunctionExists.c.obj

/C/msys32/mingw32/bin/i686-w64-mingw32-gcc.exe   -DCHECK_FUNCTION_EXISTS=chroot   -o CMakeFiles/cmTC_cc4a7.dir/CheckFunctionExists.c.obj   -c /C/msys32/mingw32/share/cmake-3.12/Modules/CheckFunctionExists.c
Linking C executable cmTC_cc4a7.exe

/C/msys32/mingw32/bin/cmake.exe -E remove -f CMakeFiles/cmTC_cc4a7.dir/objects.a
ar cr CMakeFiles/cmTC_cc4a7.dir/objects.a "CMakeFiles/cmTC_cc4a7.dir/CheckFunctionExists.c.obj" 
/C/msys32/mingw32/bin/i686-w64-mingw32-gcc.exe  -DCHECK_FUNCTION_EXISTS=chroot    -Wl,--whole-archive CMakeFiles/cmTC_cc4a7.dir/objects.a -Wl,--no-whole-archive  -o cmTC_cc4a7.exe -Wl,--major-image-version,0,--minor-image-version,0 -liphlpapi -lws2_32 -lkernel32 -luser32 -lgdi32 -lwinspool -lshell32 -lole32 -loleaut32 -luuid -lcomdlg32 -ladvapi32 
CMakeFiles/cmTC_cc4a7.dir/objects.a(CheckFunctionExists.c.obj):CheckFunctionExists.c:(.text+0xc): undefined reference to `chroot'

collect2.exe: error: ld returned 1 exit status

make[2]: *** [CMakeFiles/cmTC_cc4a7.dir/build.make:88: cmTC_cc4a7.exe] Error 1
make[2]: Leaving directory '/home/buildbot/slave/monero-static-win32/build/build/release/CMakeFiles/CMakeTmp'
make[1]: *** [Makefile:121: cmTC_cc4a7/fast] Error 2
make[1]: Leaving directory '/home/buildbot/slave/monero-static-win32/build/build/release/CMakeFiles/CMakeTmp'


Determining if the function ctime_r exists failed with the following output:
Change Dir: C:/msys32/home/buildbot/slave/monero-static-win32/build/build/release/CMakeFiles/CMakeTmp

Run Build Command:"C:/msys32/usr/bin/make.exe" "cmTC_da428/fast"
make[1]: Entering directory '/home/buildbot/slave/monero-static-win32/build/build/release/CMakeFiles/CMakeTmp'
/usr/bin/make -f CMakeFiles/cmTC_da428.dir/build.make CMakeFiles/cmTC_da428.dir/build
make[2]: Entering directory '/home/buildbot/slave/monero-static-win32/build/build/release/CMakeFiles/CMakeTmp'
Building C object CMakeFiles/cmTC_da428.dir/CheckFunctionExists.c.obj

/C/msys32/mingw32/bin/i686-w64-mingw32-gcc.exe   -DCHECK_FUNCTION_EXISTS=ctime_r   -o CMakeFiles/cmTC_da428.dir/CheckFunctionExists.c.obj   -c /C/msys32/mingw32/share/cmake-3.12/Modules/CheckFunctionExists.c
Linking C executable cmTC_da428.exe

/C/msys32/mingw32/bin/cmake.exe -E remove -f CMakeFiles/cmTC_da428.dir/objects.a
ar cr CMakeFiles/cmTC_da428.dir/objects.a "CMakeFiles/cmTC_da428.dir/CheckFunctionExists.c.obj" 
/C/msys32/mingw32/bin/i686-w64-mingw32-gcc.exe  -DCHECK_FUNCTION_EXISTS=ctime_r    -Wl,--whole-archive CMakeFiles/cmTC_da428.dir/objects.a -Wl,--no-whole-archive  -o cmTC_da428.exe -Wl,--major-image-version,0,--minor-image-version,0 -liphlpapi -lws2_32 -lkernel32 -luser32 -lgdi32 -lwinspool -lshell32 -lole32 -loleaut32 -luuid -lcomdlg32 -ladvapi32 
CMakeFiles/cmTC_da428.dir/objects.a(CheckFunctionExists.c.obj):CheckFunctionExists.c:(.text+0xc): undefined reference to `ctime_r'

collect2.exe: error: ld returned 1 exit status

make[2]: *** [CMakeFiles/cmTC_da428.dir/build.make:88: cmTC_da428.exe] Error 1
make[2]: Leaving directory '/home/buildbot/slave/monero-static-win32/build/build/release/CMakeFiles/CMakeTmp'
make[1]: *** [Makefile:121: cmTC_da428/fast] Error 2
make[1]: Leaving directory '/home/buildbot/slave/monero-static-win32/build/build/release/CMakeFiles/CMakeTmp'


Determining if the function daemon exists failed with the following output:
Change Dir: C:/msys32/home/buildbot/slave/monero-static-win32/build/build/release/CMakeFiles/CMakeTmp

Run Build Command:"C:/msys32/usr/bin/make.exe" "cmTC_fd2c1/fast"
make[1]: Entering directory '/home/buildbot/slave/monero-static-win32/build/build/release/CMakeFiles/CMakeTmp'
/usr/bin/make -f CMakeFiles/cmTC_fd2c1.dir/build.make CMakeFiles/cmTC_fd2c1.dir/build
make[2]: Entering directory '/home/buildbot/slave/monero-static-win32/build/build/release/CMakeFiles/CMakeTmp'
Building C object CMakeFiles/cmTC_fd2c1.dir/CheckFunctionExists.c.obj

/C/msys32/mingw32/bin/i686-w64-mingw32-gcc.exe   -DCHECK_FUNCTION_EXISTS=daemon   -o CMakeFiles/cmTC_fd2c1.dir/CheckFunctionExists.c.obj   -c /C/msys32/mingw32/share/cmake-3.12/Modules/CheckFunctionExists.c
Linking C executable cmTC_fd2c1.exe

/C/msys32/mingw32/bin/cmake.exe -E remove -f CMakeFiles/cmTC_fd2c1.dir/objects.a
ar cr CMakeFiles/cmTC_fd2c1.dir/objects.a "CMakeFiles/cmTC_fd2c1.dir/CheckFunctionExists.c.obj" 
/C/msys32/mingw32/bin/i686-w64-mingw32-gcc.exe  -DCHECK_FUNCTION_EXISTS=daemon    -Wl,--whole-archive CMakeFiles/cmTC_fd2c1.dir/objects.a -Wl,--no-whole-archive  -o cmTC_fd2c1.exe -Wl,--major-image-version,0,--minor-image-version,0 -liphlpapi -lws2_32 -lkernel32 -luser32 -lgdi32 -lwinspool -lshell32 -lole32 -loleaut32 -luuid -lcomdlg32 -ladvapi32 
CMakeFiles/cmTC_fd2c1.dir/objects.a(CheckFunctionExists.c.obj):CheckFunctionExists.c:(.text+0xc): undefined reference to `daemon'

collect2.exe: error: ld returned 1 exit status

make[2]: *** [CMakeFiles/cmTC_fd2c1.dir/build.make:88: cmTC_fd2c1.exe] Error 1
make[2]: Leaving directory '/home/buildbot/slave/monero-static-win32/build/build/release/CMakeFiles/CMakeTmp'
make[1]: *** [Makefile:121: cmTC_fd2c1/fast] Error 2
make[1]: Leaving directory '/home/buildbot/slave/monero-static-win32/build/build/release/CMakeFiles/CMakeTmp'


Determining if the function endprotoent exists failed with the following output:
Change Dir: C:/msys32/home/buildbot/slave/monero-static-win32/build/build/release/CMakeFiles/CMakeTmp

Run Build Command:"C:/msys32/usr/bin/make.exe" "cmTC_87e03/fast"
make[1]: Entering directory '/home/buildbot/slave/monero-static-win32/build/build/release/CMakeFiles/CMakeTmp'
/usr/bin/make -f CMakeFiles/cmTC_87e03.dir/build.make CMakeFiles/cmTC_87e03.dir/build
make[2]: Entering directory '/home/buildbot/slave/monero-static-win32/build/build/release/CMakeFiles/CMakeTmp'
Building C object CMakeFiles/cmTC_87e03.dir/CheckFunctionExists.c.obj

/C/msys32/mingw32/bin/i686-w64-mingw32-gcc.exe   -DCHECK_FUNCTION_EXISTS=endprotoent   -o CMakeFiles/cmTC_87e03.dir/CheckFunctionExists.c.obj   -c /C/msys32/mingw32/share/cmake-3.12/Modules/CheckFunctionExists.c
Linking C executable cmTC_87e03.exe

/C/msys32/mingw32/bin/cmake.exe -E remove -f CMakeFiles/cmTC_87e03.dir/objects.a
ar cr CMakeFiles/cmTC_87e03.dir/objects.a "CMakeFiles/cmTC_87e03.dir/CheckFunctionExists.c.obj" 
/C/msys32/mingw32/bin/i686-w64-mingw32-gcc.exe  -DCHECK_FUNCTION_EXISTS=endprotoent    -Wl,--whole-archive CMakeFiles/cmTC_87e03.dir/objects.a -Wl,--no-whole-archive  -o cmTC_87e03.exe -Wl,--major-image-version,0,--minor-image-version,0 -liphlpapi -lws2_32 -lkernel32 -luser32 -lgdi32 -lwinspool -lshell32 -lole32 -loleaut32 -luuid -lcomdlg32 -ladvapi32 
CMakeFiles/cmTC_87e03.dir/objects.a(CheckFunctionExists.c.obj):CheckFunctionExists.c:(.text+0xc): undefined reference to `endprotoent'

collect2.exe: error: ld returned 1 exit status

make[2]: *** [CMakeFiles/cmTC_87e03.dir/build.make:88: cmTC_87e03.exe] Error 1
make[2]: Leaving directory '/home/buildbot/slave/monero-static-win32/build/build/release/CMakeFiles/CMakeTmp'
make[1]: *** [Makefile:121: cmTC_87e03/fast] Error 2
make[1]: Leaving directory '/home/buildbot/slave/monero-static-win32/build/build/release/CMakeFiles/CMakeTmp'


Determining if the function endservent exists failed with the following output:
Change Dir: C:/msys32/home/buildbot/slave/monero-static-win32/build/build/release/CMakeFiles/CMakeTmp

Run Build Command:"C:/msys32/usr/bin/make.exe" "cmTC_a9ed2/fast"
make[1]: Entering directory '/home/buildbot/slave/monero-static-win32/build/build/release/CMakeFiles/CMakeTmp'
/usr/bin/make -f CMakeFiles/cmTC_a9ed2.dir/build.make CMakeFiles/cmTC_a9ed2.dir/build
make[2]: Entering directory '/home/buildbot/slave/monero-static-win32/build/build/release/CMakeFiles/CMakeTmp'
Building C object CMakeFiles/cmTC_a9ed2.dir/CheckFunctionExists.c.obj

/C/msys32/mingw32/bin/i686-w64-mingw32-gcc.exe   -DCHECK_FUNCTION_EXISTS=endservent   -o CMakeFiles/cmTC_a9ed2.dir/CheckFunctionExists.c.obj   -c /C/msys32/mingw32/share/cmake-3.12/Modules/CheckFunctionExists.c
Linking C executable cmTC_a9ed2.exe

/C/msys32/mingw32/bin/cmake.exe -E remove -f CMakeFiles/cmTC_a9ed2.dir/objects.a
ar cr CMakeFiles/cmTC_a9ed2.dir/objects.a "CMakeFiles/cmTC_a9ed2.dir/CheckFunctionExists.c.obj" 
/C/msys32/mingw32/bin/i686-w64-mingw32-gcc.exe  -DCHECK_FUNCTION_EXISTS=endservent    -Wl,--whole-archive CMakeFiles/cmTC_a9ed2.dir/objects.a -Wl,--no-whole-archive  -o cmTC_a9ed2.exe -Wl,--major-image-version,0,--minor-image-version,0 -liphlpapi -lws2_32 -lkernel32 -luser32 -lgdi32 -lwinspool -lshell32 -lole32 -loleaut32 -luuid -lcomdlg32 -ladvapi32 
CMakeFiles/cmTC_a9ed2.dir/objects.a(CheckFunctionExists.c.obj):CheckFunctionExists.c:(.text+0xc): undefined reference to `endservent'

collect2.exe: error: ld returned 1 exit status

make[2]: *** [CMakeFiles/cmTC_a9ed2.dir/build.make:88: cmTC_a9ed2.exe] Error 1
make[2]: Leaving directory '/home/buildbot/slave/monero-static-win32/build/build/release/CMakeFiles/CMakeTmp'
make[1]: *** [Makefile:121: cmTC_a9ed2/fast] Error 2
make[1]: Leaving directory '/home/buildbot/slave/monero-static-win32/build/build/release/CMakeFiles/CMakeTmp'


Determining if the function fork exists failed with the following output:
Change Dir: C:/msys32/home/buildbot/slave/monero-static-win32/build/build/release/CMakeFiles/CMakeTmp

Run Build Command:"C:/msys32/usr/bin/make.exe" "cmTC_fc9f3/fast"
make[1]: Entering directory '/home/buildbot/slave/monero-static-win32/build/build/release/CMakeFiles/CMakeTmp'
/usr/bin/make -f CMakeFiles/cmTC_fc9f3.dir/build.make CMakeFiles/cmTC_fc9f3.dir/build
make[2]: Entering directory '/home/buildbot/slave/monero-static-win32/build/build/release/CMakeFiles/CMakeTmp'
Building C object CMakeFiles/cmTC_fc9f3.dir/CheckFunctionExists.c.obj

/C/msys32/mingw32/bin/i686-w64-mingw32-gcc.exe   -DCHECK_FUNCTION_EXISTS=fork   -o CMakeFiles/cmTC_fc9f3.dir/CheckFunctionExists.c.obj   -c /C/msys32/mingw32/share/cmake-3.12/Modules/CheckFunctionExists.c
<command-line>:0:23: warning: conflicting types for built-in function 'fork' [-Wbuiltin-declaration-mismatch]

C:/msys32/mingw32/share/cmake-3.12/Modules/CheckFunctionExists.c:7:3: note: in expansion of macro 'CHECK_FUNCTION_EXISTS'

   CHECK_FUNCTION_EXISTS(void);

   ^~~~~~~~~~~~~~~~~~~~~

Linking C executable cmTC_fc9f3.exe

/C/msys32/mingw32/bin/cmake.exe -E remove -f CMakeFiles/cmTC_fc9f3.dir/objects.a
ar cr CMakeFiles/cmTC_fc9f3.dir/objects.a "CMakeFiles/cmTC_fc9f3.dir/CheckFunctionExists.c.obj" 
/C/msys32/mingw32/bin/i686-w64-mingw32-gcc.exe  -DCHECK_FUNCTION_EXISTS=fork    -Wl,--whole-archive CMakeFiles/cmTC_fc9f3.dir/objects.a -Wl,--no-whole-archive  -o cmTC_fc9f3.exe -Wl,--major-image-version,0,--minor-image-version,0 -liphlpapi -lws2_32 -lkernel32 -luser32 -lgdi32 -lwinspool -lshell32 -lole32 -loleaut32 -luuid -lcomdlg32 -ladvapi32 
CMakeFiles/cmTC_fc9f3.dir/objects.a(CheckFunctionExists.c.obj):CheckFunctionExists.c:(.text+0xc): undefined reference to `fork'

collect2.exe: error: ld returned 1 exit status

make[2]: *** [CMakeFiles/cmTC_fc9f3.dir/build.make:88: cmTC_fc9f3.exe] Error 1
make[2]: Leaving directory '/home/buildbot/slave/monero-static-win32/build/build/release/CMakeFiles/CMakeTmp'
make[1]: *** [Makefile:121: cmTC_fc9f3/fast] Error 2
make[1]: Leaving directory '/home/buildbot/slave/monero-static-win32/build/build/release/CMakeFiles/CMakeTmp'


Determining if the function fsync exists failed with the following output:
Change Dir: C:/msys32/home/buildbot/slave/monero-static-win32/build/build/release/CMakeFiles/CMakeTmp

Run Build Command:"C:/msys32/usr/bin/make.exe" "cmTC_72d79/fast"
make[1]: Entering directory '/home/buildbot/slave/monero-static-win32/build/build/release/CMakeFiles/CMakeTmp'
/usr/bin/make -f CMakeFiles/cmTC_72d79.dir/build.make CMakeFiles/cmTC_72d79.dir/build
make[2]: Entering directory '/home/buildbot/slave/monero-static-win32/build/build/release/CMakeFiles/CMakeTmp'
Building C object CMakeFiles/cmTC_72d79.dir/CheckFunctionExists.c.obj

/C/msys32/mingw32/bin/i686-w64-mingw32-gcc.exe   -DCHECK_FUNCTION_EXISTS=fsync   -o CMakeFiles/cmTC_72d79.dir/CheckFunctionExists.c.obj   -c /C/msys32/mingw32/share/cmake-3.12/Modules/CheckFunctionExists.c
Linking C executable cmTC_72d79.exe

/C/msys32/mingw32/bin/cmake.exe -E remove -f CMakeFiles/cmTC_72d79.dir/objects.a
ar cr CMakeFiles/cmTC_72d79.dir/objects.a "CMakeFiles/cmTC_72d79.dir/CheckFunctionExists.c.obj" 
/C/msys32/mingw32/bin/i686-w64-mingw32-gcc.exe  -DCHECK_FUNCTION_EXISTS=fsync    -Wl,--whole-archive CMakeFiles/cmTC_72d79.dir/objects.a -Wl,--no-whole-archive  -o cmTC_72d79.exe -Wl,--major-image-version,0,--minor-image-version,0 -liphlpapi -lws2_32 -lkernel32 -luser32 -lgdi32 -lwinspool -lshell32 -lole32 -loleaut32 -luuid -lcomdlg32 -ladvapi32 
CMakeFiles/cmTC_72d79.dir/objects.a(CheckFunctionExists.c.obj):CheckFunctionExists.c:(.text+0xc): undefined reference to `fsync'

collect2.exe: error: ld returned 1 exit status

make[2]: *** [CMakeFiles/cmTC_72d79.dir/build.make:88: cmTC_72d79.exe] Error 1
make[2]: Leaving directory '/home/buildbot/slave/monero-static-win32/build/build/release/CMakeFiles/CMakeTmp'
make[1]: *** [Makefile:121: cmTC_72d79/fast] Error 2
make[1]: Leaving directory '/home/buildbot/slave/monero-static-win32/build/build/release/CMakeFiles/CMakeTmp'


Determining if the function getauxval exists failed with the following output:
Change Dir: C:/msys32/home/buildbot/slave/monero-static-win32/build/build/release/CMakeFiles/CMakeTmp

Run Build Command:"C:/msys32/usr/bin/make.exe" "cmTC_fe2c0/fast"
make[1]: Entering directory '/home/buildbot/slave/monero-static-win32/build/build/release/CMakeFiles/CMakeTmp'
/usr/bin/make -f CMakeFiles/cmTC_fe2c0.dir/build.make CMakeFiles/cmTC_fe2c0.dir/build
make[2]: Entering directory '/home/buildbot/slave/monero-static-win32/build/build/release/CMakeFiles/CMakeTmp'
Building C object CMakeFiles/cmTC_fe2c0.dir/CheckFunctionExists.c.obj

/C/msys32/mingw32/bin/i686-w64-mingw32-gcc.exe   -DCHECK_FUNCTION_EXISTS=getauxval   -o CMakeFiles/cmTC_fe2c0.dir/CheckFunctionExists.c.obj   -c /C/msys32/mingw32/share/cmake-3.12/Modules/CheckFunctionExists.c
Linking C executable cmTC_fe2c0.exe

/C/msys32/mingw32/bin/cmake.exe -E remove -f CMakeFiles/cmTC_fe2c0.dir/objects.a
ar cr CMakeFiles/cmTC_fe2c0.dir/objects.a "CMakeFiles/cmTC_fe2c0.dir/CheckFunctionExists.c.obj" 
/C/msys32/mingw32/bin/i686-w64-mingw32-gcc.exe  -DCHECK_FUNCTION_EXISTS=getauxval    -Wl,--whole-archive CMakeFiles/cmTC_fe2c0.dir/objects.a -Wl,--no-whole-archive  -o cmTC_fe2c0.exe -Wl,--major-image-version,0,--minor-image-version,0 -liphlpapi -lws2_32 -lkernel32 -luser32 -lgdi32 -lwinspool -lshell32 -lole32 -loleaut32 -luuid -lcomdlg32 -ladvapi32 
CMakeFiles/cmTC_fe2c0.dir/objects.a(CheckFunctionExists.c.obj):CheckFunctionExists.c:(.text+0xc): undefined reference to `getauxval'

collect2.exe: error: ld returned 1 exit status

make[2]: *** [CMakeFiles/cmTC_fe2c0.dir/build.make:88: cmTC_fe2c0.exe] Error 1
make[2]: Leaving directory '/home/buildbot/slave/monero-static-win32/build/build/release/CMakeFiles/CMakeTmp'
make[1]: *** [Makefile:121: cmTC_fe2c0/fast] Error 2
make[1]: Leaving directory '/home/buildbot/slave/monero-static-win32/build/build/release/CMakeFiles/CMakeTmp'


Determining if the function getentropy exists failed with the following output:
Change Dir: C:/msys32/home/buildbot/slave/monero-static-win32/build/build/release/CMakeFiles/CMakeTmp

Run Build Command:"C:/msys32/usr/bin/make.exe" "cmTC_3aac0/fast"
make[1]: Entering directory '/home/buildbot/slave/monero-static-win32/build/build/release/CMakeFiles/CMakeTmp'
/usr/bin/make -f CMakeFiles/cmTC_3aac0.dir/build.make CMakeFiles/cmTC_3aac0.dir/build
make[2]: Entering directory '/home/buildbot/slave/monero-static-win32/build/build/release/CMakeFiles/CMakeTmp'
Building C object CMakeFiles/cmTC_3aac0.dir/CheckFunctionExists.c.obj

/C/msys32/mingw32/bin/i686-w64-mingw32-gcc.exe   -DCHECK_FUNCTION_EXISTS=getentropy   -o CMakeFiles/cmTC_3aac0.dir/CheckFunctionExists.c.obj   -c /C/msys32/mingw32/share/cmake-3.12/Modules/CheckFunctionExists.c
Linking C executable cmTC_3aac0.exe

/C/msys32/mingw32/bin/cmake.exe -E remove -f CMakeFiles/cmTC_3aac0.dir/objects.a
ar cr CMakeFiles/cmTC_3aac0.dir/objects.a "CMakeFiles/cmTC_3aac0.dir/CheckFunctionExists.c.obj" 
/C/msys32/mingw32/bin/i686-w64-mingw32-gcc.exe  -DCHECK_FUNCTION_EXISTS=getentropy    -Wl,--whole-archive CMakeFiles/cmTC_3aac0.dir/objects.a -Wl,--no-whole-archive  -o cmTC_3aac0.exe -Wl,--major-image-version,0,--minor-image-version,0 -liphlpapi -lws2_32 -lkernel32 -luser32 -lgdi32 -lwinspool -lshell32 -lole32 -loleaut32 -luuid -lcomdlg32 -ladvapi32 
CMakeFiles/cmTC_3aac0.dir/objects.a(CheckFunctionExists.c.obj):CheckFunctionExists.c:(.text+0xc): undefined reference to `getentropy'

collect2.exe: error: ld returned 1 exit status

make[2]: *** [CMakeFiles/cmTC_3aac0.dir/build.make:88: cmTC_3aac0.exe] Error 1
make[2]: Leaving directory '/home/buildbot/slave/monero-static-win32/build/build/release/CMakeFiles/CMakeTmp'
make[1]: *** [Makefile:121: cmTC_3aac0/fast] Error 2
make[1]: Leaving directory '/home/buildbot/slave/monero-static-win32/build/build/release/CMakeFiles/CMakeTmp'


Determining if the function getpwnam exists failed with the following output:
Change Dir: C:/msys32/home/buildbot/slave/monero-static-win32/build/build/release/CMakeFiles/CMakeTmp

Run Build Command:"C:/msys32/usr/bin/make.exe" "cmTC_15c45/fast"
make[1]: Entering directory '/home/buildbot/slave/monero-static-win32/build/build/release/CMakeFiles/CMakeTmp'
/usr/bin/make -f CMakeFiles/cmTC_15c45.dir/build.make CMakeFiles/cmTC_15c45.dir/build
make[2]: Entering directory '/home/buildbot/slave/monero-static-win32/build/build/release/CMakeFiles/CMakeTmp'
Building C object CMakeFiles/cmTC_15c45.dir/CheckFunctionExists.c.obj

/C/msys32/mingw32/bin/i686-w64-mingw32-gcc.exe   -DCHECK_FUNCTION_EXISTS=getpwnam   -o CMakeFiles/cmTC_15c45.dir/CheckFunctionExists.c.obj   -c /C/msys32/mingw32/share/cmake-3.12/Modules/CheckFunctionExists.c
Linking C executable cmTC_15c45.exe

/C/msys32/mingw32/bin/cmake.exe -E remove -f CMakeFiles/cmTC_15c45.dir/objects.a
ar cr CMakeFiles/cmTC_15c45.dir/objects.a "CMakeFiles/cmTC_15c45.dir/CheckFunctionExists.c.obj" 
/C/msys32/mingw32/bin/i686-w64-mingw32-gcc.exe  -DCHECK_FUNCTION_EXISTS=getpwnam    -Wl,--whole-archive CMakeFiles/cmTC_15c45.dir/objects.a -Wl,--no-whole-archive  -o cmTC_15c45.exe -Wl,--major-image-version,0,--minor-image-version,0 -liphlpapi -lws2_32 -lkernel32 -luser32 -lgdi32 -lwinspool -lshell32 -lole32 -loleaut32 -luuid -lcomdlg32 -ladvapi32 
CMakeFiles/cmTC_15c45.dir/objects.a(CheckFunctionExists.c.obj):CheckFunctionExists.c:(.text+0xc): undefined reference to `getpwnam'

collect2.exe: error: ld returned 1 exit status

make[2]: *** [CMakeFiles/cmTC_15c45.dir/build.make:88: cmTC_15c45.exe] Error 1
make[2]: Leaving directory '/home/buildbot/slave/monero-static-win32/build/build/release/CMakeFiles/CMakeTmp'
make[1]: *** [Makefile:121: cmTC_15c45/fast] Error 2
make[1]: Leaving directory '/home/buildbot/slave/monero-static-win32/build/build/release/CMakeFiles/CMakeTmp'


Determining if the function getrlimit exists failed with the following output:
Change Dir: C:/msys32/home/buildbot/slave/monero-static-win32/build/build/release/CMakeFiles/CMakeTmp

Run Build Command:"C:/msys32/usr/bin/make.exe" "cmTC_1fb45/fast"
make[1]: Entering directory '/home/buildbot/slave/monero-static-win32/build/build/release/CMakeFiles/CMakeTmp'
/usr/bin/make -f CMakeFiles/cmTC_1fb45.dir/build.make CMakeFiles/cmTC_1fb45.dir/build
make[2]: Entering directory '/home/buildbot/slave/monero-static-win32/build/build/release/CMakeFiles/CMakeTmp'
Building C object CMakeFiles/cmTC_1fb45.dir/CheckFunctionExists.c.obj

/C/msys32/mingw32/bin/i686-w64-mingw32-gcc.exe   -DCHECK_FUNCTION_EXISTS=getrlimit   -o CMakeFiles/cmTC_1fb45.dir/CheckFunctionExists.c.obj   -c /C/msys32/mingw32/share/cmake-3.12/Modules/CheckFunctionExists.c
Linking C executable cmTC_1fb45.exe

/C/msys32/mingw32/bin/cmake.exe -E remove -f CMakeFiles/cmTC_1fb45.dir/objects.a
ar cr CMakeFiles/cmTC_1fb45.dir/objects.a "CMakeFiles/cmTC_1fb45.dir/CheckFunctionExists.c.obj" 
/C/msys32/mingw32/bin/i686-w64-mingw32-gcc.exe  -DCHECK_FUNCTION_EXISTS=getrlimit    -Wl,--whole-archive CMakeFiles/cmTC_1fb45.dir/objects.a -Wl,--no-whole-archive  -o cmTC_1fb45.exe -Wl,--major-image-version,0,--minor-image-version,0 -liphlpapi -lws2_32 -lkernel32 -luser32 -lgdi32 -lwinspool -lshell32 -lole32 -loleaut32 -luuid -lcomdlg32 -ladvapi32 
CMakeFiles/cmTC_1fb45.dir/objects.a(CheckFunctionExists.c.obj):CheckFunctionExists.c:(.text+0xc): undefined reference to `getrlimit'

collect2.exe: error: ld returned 1 exit status

make[2]: *** [CMakeFiles/cmTC_1fb45.dir/build.make:88: cmTC_1fb45.exe] Error 1
make[2]: Leaving directory '/home/buildbot/slave/monero-static-win32/build/build/release/CMakeFiles/CMakeTmp'
make[1]: *** [Makefile:121: cmTC_1fb45/fast] Error 2
make[1]: Leaving directory '/home/buildbot/slave/monero-static-win32/build/build/release/CMakeFiles/CMakeTmp'


Determining if the function glob exists failed with the following output:
Change Dir: C:/msys32/home/buildbot/slave/monero-static-win32/build/build/release/CMakeFiles/CMakeTmp

Run Build Command:"C:/msys32/usr/bin/make.exe" "cmTC_fc8a3/fast"
make[1]: Entering directory '/home/buildbot/slave/monero-static-win32/build/build/release/CMakeFiles/CMakeTmp'
/usr/bin/make -f CMakeFiles/cmTC_fc8a3.dir/build.make CMakeFiles/cmTC_fc8a3.dir/build
make[2]: Entering directory '/home/buildbot/slave/monero-static-win32/build/build/release/CMakeFiles/CMakeTmp'
Building C object CMakeFiles/cmTC_fc8a3.dir/CheckFunctionExists.c.obj

/C/msys32/mingw32/bin/i686-w64-mingw32-gcc.exe   -DCHECK_FUNCTION_EXISTS=glob   -o CMakeFiles/cmTC_fc8a3.dir/CheckFunctionExists.c.obj   -c /C/msys32/mingw32/share/cmake-3.12/Modules/CheckFunctionExists.c
Linking C executable cmTC_fc8a3.exe

/C/msys32/mingw32/bin/cmake.exe -E remove -f CMakeFiles/cmTC_fc8a3.dir/objects.a
ar cr CMakeFiles/cmTC_fc8a3.dir/objects.a "CMakeFiles/cmTC_fc8a3.dir/CheckFunctionExists.c.obj" 
/C/msys32/mingw32/bin/i686-w64-mingw32-gcc.exe  -DCHECK_FUNCTION_EXISTS=glob    -Wl,--whole-archive CMakeFiles/cmTC_fc8a3.dir/objects.a -Wl,--no-whole-archive  -o cmTC_fc8a3.exe -Wl,--major-image-version,0,--minor-image-version,0 -liphlpapi -lws2_32 -lkernel32 -luser32 -lgdi32 -lwinspool -lshell32 -lole32 -loleaut32 -luuid -lcomdlg32 -ladvapi32 
CMakeFiles/cmTC_fc8a3.dir/objects.a(CheckFunctionExists.c.obj):CheckFunctionExists.c:(.text+0xc): undefined reference to `glob'

collect2.exe: error: ld returned 1 exit status

make[2]: *** [CMakeFiles/cmTC_fc8a3.dir/build.make:88: cmTC_fc8a3.exe] Error 1
make[2]: Leaving directory '/home/buildbot/slave/monero-static-win32/build/build/release/CMakeFiles/CMakeTmp'
make[1]: *** [Makefile:121: cmTC_fc8a3/fast] Error 2
make[1]: Leaving directory '/home/buildbot/slave/monero-static-win32/build/build/release/CMakeFiles/CMakeTmp'


Determining if the function gmtime_r exists failed with the following output:
Change Dir: C:/msys32/home/buildbot/slave/monero-static-win32/build/build/release/CMakeFiles/CMakeTmp

Run Build Command:"C:/msys32/usr/bin/make.exe" "cmTC_a55e3/fast"
make[1]: Entering directory '/home/buildbot/slave/monero-static-win32/build/build/release/CMakeFiles/CMakeTmp'
/usr/bin/make -f CMakeFiles/cmTC_a55e3.dir/build.make CMakeFiles/cmTC_a55e3.dir/build
make[2]: Entering directory '/home/buildbot/slave/monero-static-win32/build/build/release/CMakeFiles/CMakeTmp'
Building C object CMakeFiles/cmTC_a55e3.dir/CheckFunctionExists.c.obj

/C/msys32/mingw32/bin/i686-w64-mingw32-gcc.exe   -DCHECK_FUNCTION_EXISTS=gmtime_r   -o CMakeFiles/cmTC_a55e3.dir/CheckFunctionExists.c.obj   -c /C/msys32/mingw32/share/cmake-3.12/Modules/CheckFunctionExists.c
Linking C executable cmTC_a55e3.exe

/C/msys32/mingw32/bin/cmake.exe -E remove -f CMakeFiles/cmTC_a55e3.dir/objects.a
ar cr CMakeFiles/cmTC_a55e3.dir/objects.a "CMakeFiles/cmTC_a55e3.dir/CheckFunctionExists.c.obj" 
/C/msys32/mingw32/bin/i686-w64-mingw32-gcc.exe  -DCHECK_FUNCTION_EXISTS=gmtime_r    -Wl,--whole-archive CMakeFiles/cmTC_a55e3.dir/objects.a -Wl,--no-whole-archive  -o cmTC_a55e3.exe -Wl,--major-image-version,0,--minor-image-version,0 -liphlpapi -lws2_32 -lkernel32 -luser32 -lgdi32 -lwinspool -lshell32 -lole32 -loleaut32 -luuid -lcomdlg32 -ladvapi32 
CMakeFiles/cmTC_a55e3.dir/objects.a(CheckFunctionExists.c.obj):CheckFunctionExists.c:(.text+0xc): undefined reference to `gmtime_r'

collect2.exe: error: ld returned 1 exit status

make[2]: *** [CMakeFiles/cmTC_a55e3.dir/build.make:88: cmTC_a55e3.exe] Error 1
make[2]: Leaving directory '/home/buildbot/slave/monero-static-win32/build/build/release/CMakeFiles/CMakeTmp'
make[1]: *** [Makefile:121: cmTC_a55e3/fast] Error 2
make[1]: Leaving directory '/home/buildbot/slave/monero-static-win32/build/build/release/CMakeFiles/CMakeTmp'


Determining if the function fcntl exists failed with the following output:
Change Dir: C:/msys32/home/buildbot/slave/monero-static-win32/build/build/release/CMakeFiles/CMakeTmp

Run Build Command:"C:/msys32/usr/bin/make.exe" "cmTC_e1dcf/fast"
make[1]: Entering directory '/home/buildbot/slave/monero-static-win32/build/build/release/CMakeFiles/CMakeTmp'
/usr/bin/make -f CMakeFiles/cmTC_e1dcf.dir/build.make CMakeFiles/cmTC_e1dcf.dir/build
make[2]: Entering directory '/home/buildbot/slave/monero-static-win32/build/build/release/CMakeFiles/CMakeTmp'
Building C object CMakeFiles/cmTC_e1dcf.dir/CheckFunctionExists.c.obj

/C/msys32/mingw32/bin/i686-w64-mingw32-gcc.exe   -DCHECK_FUNCTION_EXISTS=fcntl   -o CMakeFiles/cmTC_e1dcf.dir/CheckFunctionExists.c.obj   -c /C/msys32/mingw32/share/cmake-3.12/Modules/CheckFunctionExists.c
Linking C executable cmTC_e1dcf.exe

/C/msys32/mingw32/bin/cmake.exe -E remove -f CMakeFiles/cmTC_e1dcf.dir/objects.a
ar cr CMakeFiles/cmTC_e1dcf.dir/objects.a "CMakeFiles/cmTC_e1dcf.dir/CheckFunctionExists.c.obj" 
/C/msys32/mingw32/bin/i686-w64-mingw32-gcc.exe  -DCHECK_FUNCTION_EXISTS=fcntl    -Wl,--whole-archive CMakeFiles/cmTC_e1dcf.dir/objects.a -Wl,--no-whole-archive  -o cmTC_e1dcf.exe -Wl,--major-image-version,0,--minor-image-version,0 -liphlpapi -lws2_32 -lkernel32 -luser32 -lgdi32 -lwinspool -lshell32 -lole32 -loleaut32 -luuid -lcomdlg32 -ladvapi32 
CMakeFiles/cmTC_e1dcf.dir/objects.a(CheckFunctionExists.c.obj):CheckFunctionExists.c:(.text+0xc): undefined reference to `fcntl'

collect2.exe: error: ld returned 1 exit status

make[2]: *** [CMakeFiles/cmTC_e1dcf.dir/build.make:88: cmTC_e1dcf.exe] Error 1
make[2]: Leaving directory '/home/buildbot/slave/monero-static-win32/build/build/release/CMakeFiles/CMakeTmp'
make[1]: *** [Makefile:121: cmTC_e1dcf/fast] Error 2
make[1]: Leaving directory '/home/buildbot/slave/monero-static-win32/build/build/release/CMakeFiles/CMakeTmp'


Determining if the function inet_aton exists failed with the following output:
Change Dir: C:/msys32/home/buildbot/slave/monero-static-win32/build/build/release/CMakeFiles/CMakeTmp

Run Build Command:"C:/msys32/usr/bin/make.exe" "cmTC_b1a70/fast"
make[1]: Entering directory '/home/buildbot/slave/monero-static-win32/build/build/release/CMakeFiles/CMakeTmp'
/usr/bin/make -f CMakeFiles/cmTC_b1a70.dir/build.make CMakeFiles/cmTC_b1a70.dir/build
make[2]: Entering directory '/home/buildbot/slave/monero-static-win32/build/build/release/CMakeFiles/CMakeTmp'
Building C object CMakeFiles/cmTC_b1a70.dir/CheckFunctionExists.c.obj

/C/msys32/mingw32/bin/i686-w64-mingw32-gcc.exe   -DCHECK_FUNCTION_EXISTS=inet_aton   -o CMakeFiles/cmTC_b1a70.dir/CheckFunctionExists.c.obj   -c /C/msys32/mingw32/share/cmake-3.12/Modules/CheckFunctionExists.c
Linking C executable cmTC_b1a70.exe

/C/msys32/mingw32/bin/cmake.exe -E remove -f CMakeFiles/cmTC_b1a70.dir/objects.a
ar cr CMakeFiles/cmTC_b1a70.dir/objects.a "CMakeFiles/cmTC_b1a70.dir/CheckFunctionExists.c.obj" 
/C/msys32/mingw32/bin/i686-w64-mingw32-gcc.exe  -DCHECK_FUNCTION_EXISTS=inet_aton    -Wl,--whole-archive CMakeFiles/cmTC_b1a70.dir/objects.a -Wl,--no-whole-archive  -o cmTC_b1a70.exe -Wl,--major-image-version,0,--minor-image-version,0 -liphlpapi -lws2_32 -lkernel32 -luser32 -lgdi32 -lwinspool -lshell32 -lole32 -loleaut32 -luuid -lcomdlg32 -ladvapi32 
CMakeFiles/cmTC_b1a70.dir/objects.a(CheckFunctionExists.c.obj):CheckFunctionExists.c:(.text+0xc): undefined reference to `inet_aton'

collect2.exe: error: ld returned 1 exit status

make[2]: *** [CMakeFiles/cmTC_b1a70.dir/build.make:88: cmTC_b1a70.exe] Error 1
make[2]: Leaving directory '/home/buildbot/slave/monero-static-win32/build/build/release/CMakeFiles/CMakeTmp'
make[1]: *** [Makefile:121: cmTC_b1a70/fast] Error 2
make[1]: Leaving directory '/home/buildbot/slave/monero-static-win32/build/build/release/CMakeFiles/CMakeTmp'


Determining if the function inet_ntop exists failed with the following output:
Change Dir: C:/msys32/home/buildbot/slave/monero-static-win32/build/build/release/CMakeFiles/CMakeTmp

Run Build Command:"C:/msys32/usr/bin/make.exe" "cmTC_31255/fast"
make[1]: Entering directory '/home/buildbot/slave/monero-static-win32/build/build/release/CMakeFiles/CMakeTmp'
/usr/bin/make -f CMakeFiles/cmTC_31255.dir/build.make CMakeFiles/cmTC_31255.dir/build
make[2]: Entering directory '/home/buildbot/slave/monero-static-win32/build/build/release/CMakeFiles/CMakeTmp'
Building C object CMakeFiles/cmTC_31255.dir/CheckFunctionExists.c.obj

/C/msys32/mingw32/bin/i686-w64-mingw32-gcc.exe   -DCHECK_FUNCTION_EXISTS=inet_ntop   -o CMakeFiles/cmTC_31255.dir/CheckFunctionExists.c.obj   -c /C/msys32/mingw32/share/cmake-3.12/Modules/CheckFunctionExists.c
Linking C executable cmTC_31255.exe

/C/msys32/mingw32/bin/cmake.exe -E remove -f CMakeFiles/cmTC_31255.dir/objects.a
ar cr CMakeFiles/cmTC_31255.dir/objects.a "CMakeFiles/cmTC_31255.dir/CheckFunctionExists.c.obj" 
/C/msys32/mingw32/bin/i686-w64-mingw32-gcc.exe  -DCHECK_FUNCTION_EXISTS=inet_ntop    -Wl,--whole-archive CMakeFiles/cmTC_31255.dir/objects.a -Wl,--no-whole-archive  -o cmTC_31255.exe -Wl,--major-image-version,0,--minor-image-version,0 -liphlpapi -lws2_32 -lkernel32 -luser32 -lgdi32 -lwinspool -lshell32 -lole32 -loleaut32 -luuid -lcomdlg32 -ladvapi32 
CMakeFiles/cmTC_31255.dir/objects.a(CheckFunctionExists.c.obj):CheckFunctionExists.c:(.text+0xc): undefined reference to `inet_ntop'

collect2.exe: error: ld returned 1 exit status

make[2]: *** [CMakeFiles/cmTC_31255.dir/build.make:88: cmTC_31255.exe] Error 1
make[2]: Leaving directory '/home/buildbot/slave/monero-static-win32/build/build/release/CMakeFiles/CMakeTmp'
make[1]: *** [Makefile:121: cmTC_31255/fast] Error 2
make[1]: Leaving directory '/home/buildbot/slave/monero-static-win32/build/build/release/CMakeFiles/CMakeTmp'


Determining if the function inet_pton exists failed with the following output:
Change Dir: C:/msys32/home/buildbot/slave/monero-static-win32/build/build/release/CMakeFiles/CMakeTmp

Run Build Command:"C:/msys32/usr/bin/make.exe" "cmTC_d3711/fast"
make[1]: Entering directory '/home/buildbot/slave/monero-static-win32/build/build/release/CMakeFiles/CMakeTmp'
/usr/bin/make -f CMakeFiles/cmTC_d3711.dir/build.make CMakeFiles/cmTC_d3711.dir/build
make[2]: Entering directory '/home/buildbot/slave/monero-static-win32/build/build/release/CMakeFiles/CMakeTmp'
Building C object CMakeFiles/cmTC_d3711.dir/CheckFunctionExists.c.obj

/C/msys32/mingw32/bin/i686-w64-mingw32-gcc.exe   -DCHECK_FUNCTION_EXISTS=inet_pton   -o CMakeFiles/cmTC_d3711.dir/CheckFunctionExists.c.obj   -c /C/msys32/mingw32/share/cmake-3.12/Modules/CheckFunctionExists.c
Linking C executable cmTC_d3711.exe

/C/msys32/mingw32/bin/cmake.exe -E remove -f CMakeFiles/cmTC_d3711.dir/objects.a
ar cr CMakeFiles/cmTC_d3711.dir/objects.a "CMakeFiles/cmTC_d3711.dir/CheckFunctionExists.c.obj" 
/C/msys32/mingw32/bin/i686-w64-mingw32-gcc.exe  -DCHECK_FUNCTION_EXISTS=inet_pton    -Wl,--whole-archive CMakeFiles/cmTC_d3711.dir/objects.a -Wl,--no-whole-archive  -o cmTC_d3711.exe -Wl,--major-image-version,0,--minor-image-version,0 -liphlpapi -lws2_32 -lkernel32 -luser32 -lgdi32 -lwinspool -lshell32 -lole32 -loleaut32 -luuid -lcomdlg32 -ladvapi32 
CMakeFiles/cmTC_d3711.dir/objects.a(CheckFunctionExists.c.obj):CheckFunctionExists.c:(.text+0xc): undefined reference to `inet_pton'

collect2.exe: error: ld returned 1 exit status

make[2]: *** [CMakeFiles/cmTC_d3711.dir/build.make:88: cmTC_d3711.exe] Error 1
make[2]: Leaving directory '/home/buildbot/slave/monero-static-win32/build/build/release/CMakeFiles/CMakeTmp'
make[1]: *** [Makefile:121: cmTC_d3711/fast] Error 2
make[1]: Leaving directory '/home/buildbot/slave/monero-static-win32/build/build/release/CMakeFiles/CMakeTmp'


Determining if the function initgroups exists failed with the following output:
Change Dir: C:/msys32/home/buildbot/slave/monero-static-win32/build/build/release/CMakeFiles/CMakeTmp

Run Build Command:"C:/msys32/usr/bin/make.exe" "cmTC_e0c32/fast"
make[1]: Entering directory '/home/buildbot/slave/monero-static-win32/build/build/release/CMakeFiles/CMakeTmp'
/usr/bin/make -f CMakeFiles/cmTC_e0c32.dir/build.make CMakeFiles/cmTC_e0c32.dir/build
make[2]: Entering directory '/home/buildbot/slave/monero-static-win32/build/build/release/CMakeFiles/CMakeTmp'
Building C object CMakeFiles/cmTC_e0c32.dir/CheckFunctionExists.c.obj

/C/msys32/mingw32/bin/i686-w64-mingw32-gcc.exe   -DCHECK_FUNCTION_EXISTS=initgroups   -o CMakeFiles/cmTC_e0c32.dir/CheckFunctionExists.c.obj   -c /C/msys32/mingw32/share/cmake-3.12/Modules/CheckFunctionExists.c
Linking C executable cmTC_e0c32.exe

/C/msys32/mingw32/bin/cmake.exe -E remove -f CMakeFiles/cmTC_e0c32.dir/objects.a
ar cr CMakeFiles/cmTC_e0c32.dir/objects.a "CMakeFiles/cmTC_e0c32.dir/CheckFunctionExists.c.obj" 
/C/msys32/mingw32/bin/i686-w64-mingw32-gcc.exe  -DCHECK_FUNCTION_EXISTS=initgroups    -Wl,--whole-archive CMakeFiles/cmTC_e0c32.dir/objects.a -Wl,--no-whole-archive  -o cmTC_e0c32.exe -Wl,--major-image-version,0,--minor-image-version,0 -liphlpapi -lws2_32 -lkernel32 -luser32 -lgdi32 -lwinspool -lshell32 -lole32 -loleaut32 -luuid -lcomdlg32 -ladvapi32 
CMakeFiles/cmTC_e0c32.dir/objects.a(CheckFunctionExists.c.obj):CheckFunctionExists.c:(.text+0xc): undefined reference to `initgroups'

collect2.exe: error: ld returned 1 exit status

make[2]: *** [CMakeFiles/cmTC_e0c32.dir/build.make:88: cmTC_e0c32.exe] Error 1
make[2]: Leaving directory '/home/buildbot/slave/monero-static-win32/build/build/release/CMakeFiles/CMakeTmp'
make[1]: *** [Makefile:121: cmTC_e0c32/fast] Error 2
make[1]: Leaving directory '/home/buildbot/slave/monero-static-win32/build/build/release/CMakeFiles/CMakeTmp'


Determining if the function ioctlsocket exists failed with the following output:
Change Dir: C:/msys32/home/buildbot/slave/monero-static-win32/build/build/release/CMakeFiles/CMakeTmp

Run Build Command:"C:/msys32/usr/bin/make.exe" "cmTC_58b2f/fast"
make[1]: Entering directory '/home/buildbot/slave/monero-static-win32/build/build/release/CMakeFiles/CMakeTmp'
/usr/bin/make -f CMakeFiles/cmTC_58b2f.dir/build.make CMakeFiles/cmTC_58b2f.dir/build
make[2]: Entering directory '/home/buildbot/slave/monero-static-win32/build/build/release/CMakeFiles/CMakeTmp'
Building C object CMakeFiles/cmTC_58b2f.dir/CheckFunctionExists.c.obj

/C/msys32/mingw32/bin/i686-w64-mingw32-gcc.exe   -DCHECK_FUNCTION_EXISTS=ioctlsocket   -o CMakeFiles/cmTC_58b2f.dir/CheckFunctionExists.c.obj   -c /C/msys32/mingw32/share/cmake-3.12/Modules/CheckFunctionExists.c
Linking C executable cmTC_58b2f.exe

/C/msys32/mingw32/bin/cmake.exe -E remove -f CMakeFiles/cmTC_58b2f.dir/objects.a
ar cr CMakeFiles/cmTC_58b2f.dir/objects.a "CMakeFiles/cmTC_58b2f.dir/CheckFunctionExists.c.obj" 
/C/msys32/mingw32/bin/i686-w64-mingw32-gcc.exe  -DCHECK_FUNCTION_EXISTS=ioctlsocket    -Wl,--whole-archive CMakeFiles/cmTC_58b2f.dir/objects.a -Wl,--no-whole-archive  -o cmTC_58b2f.exe -Wl,--major-image-version,0,--minor-image-version,0 -liphlpapi -lws2_32 -lkernel32 -luser32 -lgdi32 -lwinspool -lshell32 -lole32 -loleaut32 -luuid -lcomdlg32 -ladvapi32 
CMakeFiles/cmTC_58b2f.dir/objects.a(CheckFunctionExists.c.obj):CheckFunctionExists.c:(.text+0xc): undefined reference to `ioctlsocket'

collect2.exe: error: ld returned 1 exit status

make[2]: *** [CMakeFiles/cmTC_58b2f.dir/build.make:88: cmTC_58b2f.exe] Error 1
make[2]: Leaving directory '/home/buildbot/slave/monero-static-win32/build/build/release/CMakeFiles/CMakeTmp'
make[1]: *** [Makefile:121: cmTC_58b2f/fast] Error 2
make[1]: Leaving directory '/home/buildbot/slave/monero-static-win32/build/build/release/CMakeFiles/CMakeTmp'


Determining if the function kill exists failed with the following output:
Change Dir: C:/msys32/home/buildbot/slave/monero-static-win32/build/build/release/CMakeFiles/CMakeTmp

Run Build Command:"C:/msys32/usr/bin/make.exe" "cmTC_c6391/fast"
make[1]: Entering directory '/home/buildbot/slave/monero-static-win32/build/build/release/CMakeFiles/CMakeTmp'
/usr/bin/make -f CMakeFiles/cmTC_c6391.dir/build.make CMakeFiles/cmTC_c6391.dir/build
make[2]: Entering directory '/home/buildbot/slave/monero-static-win32/build/build/release/CMakeFiles/CMakeTmp'
Building C object CMakeFiles/cmTC_c6391.dir/CheckFunctionExists.c.obj

/C/msys32/mingw32/bin/i686-w64-mingw32-gcc.exe   -DCHECK_FUNCTION_EXISTS=kill   -o CMakeFiles/cmTC_c6391.dir/CheckFunctionExists.c.obj   -c /C/msys32/mingw32/share/cmake-3.12/Modules/CheckFunctionExists.c
Linking C executable cmTC_c6391.exe

/C/msys32/mingw32/bin/cmake.exe -E remove -f CMakeFiles/cmTC_c6391.dir/objects.a
ar cr CMakeFiles/cmTC_c6391.dir/objects.a "CMakeFiles/cmTC_c6391.dir/CheckFunctionExists.c.obj" 
/C/msys32/mingw32/bin/i686-w64-mingw32-gcc.exe  -DCHECK_FUNCTION_EXISTS=kill    -Wl,--whole-archive CMakeFiles/cmTC_c6391.dir/objects.a -Wl,--no-whole-archive  -o cmTC_c6391.exe -Wl,--major-image-version,0,--minor-image-version,0 -liphlpapi -lws2_32 -lkernel32 -luser32 -lgdi32 -lwinspool -lshell32 -lole32 -loleaut32 -luuid -lcomdlg32 -ladvapi32 
CMakeFiles/cmTC_c6391.dir/objects.a(CheckFunctionExists.c.obj):CheckFunctionExists.c:(.text+0xc): undefined reference to `kill'

collect2.exe: error: ld returned 1 exit status

make[2]: *** [CMakeFiles/cmTC_c6391.dir/build.make:88: cmTC_c6391.exe] Error 1
make[2]: Leaving directory '/home/buildbot/slave/monero-static-win32/build/build/release/CMakeFiles/CMakeTmp'
make[1]: *** [Makefile:121: cmTC_c6391/fast] Error 2
make[1]: Leaving directory '/home/buildbot/slave/monero-static-win32/build/build/release/CMakeFiles/CMakeTmp'


Determining if the function localtime_r exists failed with the following output:
Change Dir: C:/msys32/home/buildbot/slave/monero-static-win32/build/build/release/CMakeFiles/CMakeTmp

Run Build Command:"C:/msys32/usr/bin/make.exe" "cmTC_1aef6/fast"
make[1]: Entering directory '/home/buildbot/slave/monero-static-win32/build/build/release/CMakeFiles/CMakeTmp'
/usr/bin/make -f CMakeFiles/cmTC_1aef6.dir/build.make CMakeFiles/cmTC_1aef6.dir/build
make[2]: Entering directory '/home/buildbot/slave/monero-static-win32/build/build/release/CMakeFiles/CMakeTmp'
Building C object CMakeFiles/cmTC_1aef6.dir/CheckFunctionExists.c.obj

/C/msys32/mingw32/bin/i686-w64-mingw32-gcc.exe   -DCHECK_FUNCTION_EXISTS=localtime_r   -o CMakeFiles/cmTC_1aef6.dir/CheckFunctionExists.c.obj   -c /C/msys32/mingw32/share/cmake-3.12/Modules/CheckFunctionExists.c
Linking C executable cmTC_1aef6.exe

/C/msys32/mingw32/bin/cmake.exe -E remove -f CMakeFiles/cmTC_1aef6.dir/objects.a
ar cr CMakeFiles/cmTC_1aef6.dir/objects.a "CMakeFiles/cmTC_1aef6.dir/CheckFunctionExists.c.obj" 
/C/msys32/mingw32/bin/i686-w64-mingw32-gcc.exe  -DCHECK_FUNCTION_EXISTS=localtime_r    -Wl,--whole-archive CMakeFiles/cmTC_1aef6.dir/objects.a -Wl,--no-whole-archive  -o cmTC_1aef6.exe -Wl,--major-image-version,0,--minor-image-version,0 -liphlpapi -lws2_32 -lkernel32 -luser32 -lgdi32 -lwinspool -lshell32 -lole32 -loleaut32 -luuid -lcomdlg32 -ladvapi32 
CMakeFiles/cmTC_1aef6.dir/objects.a(CheckFunctionExists.c.obj):CheckFunctionExists.c:(.text+0xc): undefined reference to `localtime_r'

collect2.exe: error: ld returned 1 exit status

make[2]: *** [CMakeFiles/cmTC_1aef6.dir/build.make:88: cmTC_1aef6.exe] Error 1
make[2]: Leaving directory '/home/buildbot/slave/monero-static-win32/build/build/release/CMakeFiles/CMakeTmp'
make[1]: *** [Makefile:121: cmTC_1aef6/fast] Error 2
make[1]: Leaving directory '/home/buildbot/slave/monero-static-win32/build/build/release/CMakeFiles/CMakeTmp'


Determining if the function random exists failed with the following output:
Change Dir: C:/msys32/home/buildbot/slave/monero-static-win32/build/build/release/CMakeFiles/CMakeTmp

Run Build Command:"C:/msys32/usr/bin/make.exe" "cmTC_7b245/fast"
make[1]: Entering directory '/home/buildbot/slave/monero-static-win32/build/build/release/CMakeFiles/CMakeTmp'
/usr/bin/make -f CMakeFiles/cmTC_7b245.dir/build.make CMakeFiles/cmTC_7b245.dir/build
make[2]: Entering directory '/home/buildbot/slave/monero-static-win32/build/build/release/CMakeFiles/CMakeTmp'
Building C object CMakeFiles/cmTC_7b245.dir/CheckFunctionExists.c.obj

/C/msys32/mingw32/bin/i686-w64-mingw32-gcc.exe   -DCHECK_FUNCTION_EXISTS=random   -o CMakeFiles/cmTC_7b245.dir/CheckFunctionExists.c.obj   -c /C/msys32/mingw32/share/cmake-3.12/Modules/CheckFunctionExists.c
Linking C executable cmTC_7b245.exe

/C/msys32/mingw32/bin/cmake.exe -E remove -f CMakeFiles/cmTC_7b245.dir/objects.a
ar cr CMakeFiles/cmTC_7b245.dir/objects.a "CMakeFiles/cmTC_7b245.dir/CheckFunctionExists.c.obj" 
/C/msys32/mingw32/bin/i686-w64-mingw32-gcc.exe  -DCHECK_FUNCTION_EXISTS=random    -Wl,--whole-archive CMakeFiles/cmTC_7b245.dir/objects.a -Wl,--no-whole-archive  -o cmTC_7b245.exe -Wl,--major-image-version,0,--minor-image-version,0 -liphlpapi -lws2_32 -lkernel32 -luser32 -lgdi32 -lwinspool -lshell32 -lole32 -loleaut32 -luuid -lcomdlg32 -ladvapi32 
CMakeFiles/cmTC_7b245.dir/objects.a(CheckFunctionExists.c.obj):CheckFunctionExists.c:(.text+0xc): undefined reference to `random'

collect2.exe: error: ld returned 1 exit status

make[2]: *** [CMakeFiles/cmTC_7b245.dir/build.make:88: cmTC_7b245.exe] Error 1
make[2]: Leaving directory '/home/buildbot/slave/monero-static-win32/build/build/release/CMakeFiles/CMakeTmp'
make[1]: *** [Makefile:121: cmTC_7b245/fast] Error 2
make[1]: Leaving directory '/home/buildbot/slave/monero-static-win32/build/build/release/CMakeFiles/CMakeTmp'


Determining if the function reallocarray exists failed with the following output:
Change Dir: C:/msys32/home/buildbot/slave/monero-static-win32/build/build/release/CMakeFiles/CMakeTmp

Run Build Command:"C:/msys32/usr/bin/make.exe" "cmTC_9555a/fast"
make[1]: Entering directory '/home/buildbot/slave/monero-static-win32/build/build/release/CMakeFiles/CMakeTmp'
/usr/bin/make -f CMakeFiles/cmTC_9555a.dir/build.make CMakeFiles/cmTC_9555a.dir/build
make[2]: Entering directory '/home/buildbot/slave/monero-static-win32/build/build/release/CMakeFiles/CMakeTmp'
Building C object CMakeFiles/cmTC_9555a.dir/CheckFunctionExists.c.obj

/C/msys32/mingw32/bin/i686-w64-mingw32-gcc.exe   -DCHECK_FUNCTION_EXISTS=reallocarray   -o CMakeFiles/cmTC_9555a.dir/CheckFunctionExists.c.obj   -c /C/msys32/mingw32/share/cmake-3.12/Modules/CheckFunctionExists.c
Linking C executable cmTC_9555a.exe

/C/msys32/mingw32/bin/cmake.exe -E remove -f CMakeFiles/cmTC_9555a.dir/objects.a
ar cr CMakeFiles/cmTC_9555a.dir/objects.a "CMakeFiles/cmTC_9555a.dir/CheckFunctionExists.c.obj" 
/C/msys32/mingw32/bin/i686-w64-mingw32-gcc.exe  -DCHECK_FUNCTION_EXISTS=reallocarray    -Wl,--whole-archive CMakeFiles/cmTC_9555a.dir/objects.a -Wl,--no-whole-archive  -o cmTC_9555a.exe -Wl,--major-image-version,0,--minor-image-version,0 -liphlpapi -lws2_32 -lkernel32 -luser32 -lgdi32 -lwinspool -lshell32 -lole32 -loleaut32 -luuid -lcomdlg32 -ladvapi32 
CMakeFiles/cmTC_9555a.dir/objects.a(CheckFunctionExists.c.obj):CheckFunctionExists.c:(.text+0xc): undefined reference to `reallocarray'

collect2.exe: error: ld returned 1 exit status

make[2]: *** [CMakeFiles/cmTC_9555a.dir/build.make:88: cmTC_9555a.exe] Error 1
make[2]: Leaving directory '/home/buildbot/slave/monero-static-win32/build/build/release/CMakeFiles/CMakeTmp'
make[1]: *** [Makefile:121: cmTC_9555a/fast] Error 2
make[1]: Leaving directory '/home/buildbot/slave/monero-static-win32/build/build/release/CMakeFiles/CMakeTmp'


Determining if the function recvmsg exists failed with the following output:
Change Dir: C:/msys32/home/buildbot/slave/monero-static-win32/build/build/release/CMakeFiles/CMakeTmp

Run Build Command:"C:/msys32/usr/bin/make.exe" "cmTC_084f3/fast"
make[1]: Entering directory '/home/buildbot/slave/monero-static-win32/build/build/release/CMakeFiles/CMakeTmp'
/usr/bin/make -f CMakeFiles/cmTC_084f3.dir/build.make CMakeFiles/cmTC_084f3.dir/build
make[2]: Entering directory '/home/buildbot/slave/monero-static-win32/build/build/release/CMakeFiles/CMakeTmp'
Building C object CMakeFiles/cmTC_084f3.dir/CheckFunctionExists.c.obj

/C/msys32/mingw32/bin/i686-w64-mingw32-gcc.exe   -DCHECK_FUNCTION_EXISTS=recvmsg   -o CMakeFiles/cmTC_084f3.dir/CheckFunctionExists.c.obj   -c /C/msys32/mingw32/share/cmake-3.12/Modules/CheckFunctionExists.c
Linking C executable cmTC_084f3.exe

/C/msys32/mingw32/bin/cmake.exe -E remove -f CMakeFiles/cmTC_084f3.dir/objects.a
ar cr CMakeFiles/cmTC_084f3.dir/objects.a "CMakeFiles/cmTC_084f3.dir/CheckFunctionExists.c.obj" 
/C/msys32/mingw32/bin/i686-w64-mingw32-gcc.exe  -DCHECK_FUNCTION_EXISTS=recvmsg    -Wl,--whole-archive CMakeFiles/cmTC_084f3.dir/objects.a -Wl,--no-whole-archive  -o cmTC_084f3.exe -Wl,--major-image-version,0,--minor-image-version,0 -liphlpapi -lws2_32 -lkernel32 -luser32 -lgdi32 -lwinspool -lshell32 -lole32 -loleaut32 -luuid -lcomdlg32 -ladvapi32 
CMakeFiles/cmTC_084f3.dir/objects.a(CheckFunctionExists.c.obj):CheckFunctionExists.c:(.text+0xc): undefined reference to `recvmsg'

collect2.exe: error: ld returned 1 exit status

make[2]: *** [CMakeFiles/cmTC_084f3.dir/build.make:88: cmTC_084f3.exe] Error 1
make[2]: Leaving directory '/home/buildbot/slave/monero-static-win32/build/build/release/CMakeFiles/CMakeTmp'
make[1]: *** [Makefile:121: cmTC_084f3/fast] Error 2
make[1]: Leaving directory '/home/buildbot/slave/monero-static-win32/build/build/release/CMakeFiles/CMakeTmp'


Determining if the function sbrk exists failed with the following output:
Change Dir: C:/msys32/home/buildbot/slave/monero-static-win32/build/build/release/CMakeFiles/CMakeTmp

Run Build Command:"C:/msys32/usr/bin/make.exe" "cmTC_1be9b/fast"
make[1]: Entering directory '/home/buildbot/slave/monero-static-win32/build/build/release/CMakeFiles/CMakeTmp'
/usr/bin/make -f CMakeFiles/cmTC_1be9b.dir/build.make CMakeFiles/cmTC_1be9b.dir/build
make[2]: Entering directory '/home/buildbot/slave/monero-static-win32/build/build/release/CMakeFiles/CMakeTmp'
Building C object CMakeFiles/cmTC_1be9b.dir/CheckFunctionExists.c.obj

/C/msys32/mingw32/bin/i686-w64-mingw32-gcc.exe   -DCHECK_FUNCTION_EXISTS=sbrk   -o CMakeFiles/cmTC_1be9b.dir/CheckFunctionExists.c.obj   -c /C/msys32/mingw32/share/cmake-3.12/Modules/CheckFunctionExists.c
Linking C executable cmTC_1be9b.exe

/C/msys32/mingw32/bin/cmake.exe -E remove -f CMakeFiles/cmTC_1be9b.dir/objects.a
ar cr CMakeFiles/cmTC_1be9b.dir/objects.a "CMakeFiles/cmTC_1be9b.dir/CheckFunctionExists.c.obj" 
/C/msys32/mingw32/bin/i686-w64-mingw32-gcc.exe  -DCHECK_FUNCTION_EXISTS=sbrk    -Wl,--whole-archive CMakeFiles/cmTC_1be9b.dir/objects.a -Wl,--no-whole-archive  -o cmTC_1be9b.exe -Wl,--major-image-version,0,--minor-image-version,0 -liphlpapi -lws2_32 -lkernel32 -luser32 -lgdi32 -lwinspool -lshell32 -lole32 -loleaut32 -luuid -lcomdlg32 -ladvapi32 
CMakeFiles/cmTC_1be9b.dir/objects.a(CheckFunctionExists.c.obj):CheckFunctionExists.c:(.text+0xc): undefined reference to `sbrk'

collect2.exe: error: ld returned 1 exit status

make[2]: *** [CMakeFiles/cmTC_1be9b.dir/build.make:88: cmTC_1be9b.exe] Error 1
make[2]: Leaving directory '/home/buildbot/slave/monero-static-win32/build/build/release/CMakeFiles/CMakeTmp'
make[1]: *** [Makefile:121: cmTC_1be9b/fast] Error 2
make[1]: Leaving directory '/home/buildbot/slave/monero-static-win32/build/build/release/CMakeFiles/CMakeTmp'


Determining if the function sendmsg exists failed with the following output:
Change Dir: C:/msys32/home/buildbot/slave/monero-static-win32/build/build/release/CMakeFiles/CMakeTmp

Run Build Command:"C:/msys32/usr/bin/make.exe" "cmTC_ad072/fast"
make[1]: Entering directory '/home/buildbot/slave/monero-static-win32/build/build/release/CMakeFiles/CMakeTmp'
/usr/bin/make -f CMakeFiles/cmTC_ad072.dir/build.make CMakeFiles/cmTC_ad072.dir/build
make[2]: Entering directory '/home/buildbot/slave/monero-static-win32/build/build/release/CMakeFiles/CMakeTmp'
Building C object CMakeFiles/cmTC_ad072.dir/CheckFunctionExists.c.obj

/C/msys32/mingw32/bin/i686-w64-mingw32-gcc.exe   -DCHECK_FUNCTION_EXISTS=sendmsg   -o CMakeFiles/cmTC_ad072.dir/CheckFunctionExists.c.obj   -c /C/msys32/mingw32/share/cmake-3.12/Modules/CheckFunctionExists.c
Linking C executable cmTC_ad072.exe

/C/msys32/mingw32/bin/cmake.exe -E remove -f CMakeFiles/cmTC_ad072.dir/objects.a
ar cr CMakeFiles/cmTC_ad072.dir/objects.a "CMakeFiles/cmTC_ad072.dir/CheckFunctionExists.c.obj" 
/C/msys32/mingw32/bin/i686-w64-mingw32-gcc.exe  -DCHECK_FUNCTION_EXISTS=sendmsg    -Wl,--whole-archive CMakeFiles/cmTC_ad072.dir/objects.a -Wl,--no-whole-archive  -o cmTC_ad072.exe -Wl,--major-image-version,0,--minor-image-version,0 -liphlpapi -lws2_32 -lkernel32 -luser32 -lgdi32 -lwinspool -lshell32 -lole32 -loleaut32 -luuid -lcomdlg32 -ladvapi32 
CMakeFiles/cmTC_ad072.dir/objects.a(CheckFunctionExists.c.obj):CheckFunctionExists.c:(.text+0xc): undefined reference to `sendmsg'

collect2.exe: error: ld returned 1 exit status

make[2]: *** [CMakeFiles/cmTC_ad072.dir/build.make:88: cmTC_ad072.exe] Error 1
make[2]: Leaving directory '/home/buildbot/slave/monero-static-win32/build/build/release/CMakeFiles/CMakeTmp'
make[1]: *** [Makefile:121: cmTC_ad072/fast] Error 2
make[1]: Leaving directory '/home/buildbot/slave/monero-static-win32/build/build/release/CMakeFiles/CMakeTmp'


Determining if the function setregid exists failed with the following output:
Change Dir: C:/msys32/home/buildbot/slave/monero-static-win32/build/build/release/CMakeFiles/CMakeTmp

Run Build Command:"C:/msys32/usr/bin/make.exe" "cmTC_24dfd/fast"
make[1]: Entering directory '/home/buildbot/slave/monero-static-win32/build/build/release/CMakeFiles/CMakeTmp'
/usr/bin/make -f CMakeFiles/cmTC_24dfd.dir/build.make CMakeFiles/cmTC_24dfd.dir/build
make[2]: Entering directory '/home/buildbot/slave/monero-static-win32/build/build/release/CMakeFiles/CMakeTmp'
Building C object CMakeFiles/cmTC_24dfd.dir/CheckFunctionExists.c.obj

/C/msys32/mingw32/bin/i686-w64-mingw32-gcc.exe   -DCHECK_FUNCTION_EXISTS=setregid   -o CMakeFiles/cmTC_24dfd.dir/CheckFunctionExists.c.obj   -c /C/msys32/mingw32/share/cmake-3.12/Modules/CheckFunctionExists.c
Linking C executable cmTC_24dfd.exe

/C/msys32/mingw32/bin/cmake.exe -E remove -f CMakeFiles/cmTC_24dfd.dir/objects.a
ar cr CMakeFiles/cmTC_24dfd.dir/objects.a "CMakeFiles/cmTC_24dfd.dir/CheckFunctionExists.c.obj" 
/C/msys32/mingw32/bin/i686-w64-mingw32-gcc.exe  -DCHECK_FUNCTION_EXISTS=setregid    -Wl,--whole-archive CMakeFiles/cmTC_24dfd.dir/objects.a -Wl,--no-whole-archive  -o cmTC_24dfd.exe -Wl,--major-image-version,0,--minor-image-version,0 -liphlpapi -lws2_32 -lkernel32 -luser32 -lgdi32 -lwinspool -lshell32 -lole32 -loleaut32 -luuid -lcomdlg32 -ladvapi32 
CMakeFiles/cmTC_24dfd.dir/objects.a(CheckFunctionExists.c.obj):CheckFunctionExists.c:(.text+0xc): undefined reference to `setregid'

collect2.exe: error: ld returned 1 exit status

make[2]: *** [CMakeFiles/cmTC_24dfd.dir/build.make:88: cmTC_24dfd.exe] Error 1
make[2]: Leaving directory '/home/buildbot/slave/monero-static-win32/build/build/release/CMakeFiles/CMakeTmp'
make[1]: *** [Makefile:121: cmTC_24dfd/fast] Error 2
make[1]: Leaving directory '/home/buildbot/slave/monero-static-win32/build/build/release/CMakeFiles/CMakeTmp'


Determining if the function setresgid exists failed with the following output:
Change Dir: C:/msys32/home/buildbot/slave/monero-static-win32/build/build/release/CMakeFiles/CMakeTmp

Run Build Command:"C:/msys32/usr/bin/make.exe" "cmTC_71306/fast"
make[1]: Entering directory '/home/buildbot/slave/monero-static-win32/build/build/release/CMakeFiles/CMakeTmp'
/usr/bin/make -f CMakeFiles/cmTC_71306.dir/build.make CMakeFiles/cmTC_71306.dir/build
make[2]: Entering directory '/home/buildbot/slave/monero-static-win32/build/build/release/CMakeFiles/CMakeTmp'
Building C object CMakeFiles/cmTC_71306.dir/CheckFunctionExists.c.obj

/C/msys32/mingw32/bin/i686-w64-mingw32-gcc.exe   -DCHECK_FUNCTION_EXISTS=setresgid   -o CMakeFiles/cmTC_71306.dir/CheckFunctionExists.c.obj   -c /C/msys32/mingw32/share/cmake-3.12/Modules/CheckFunctionExists.c
Linking C executable cmTC_71306.exe

/C/msys32/mingw32/bin/cmake.exe -E remove -f CMakeFiles/cmTC_71306.dir/objects.a
ar cr CMakeFiles/cmTC_71306.dir/objects.a "CMakeFiles/cmTC_71306.dir/CheckFunctionExists.c.obj" 
/C/msys32/mingw32/bin/i686-w64-mingw32-gcc.exe  -DCHECK_FUNCTION_EXISTS=setresgid    -Wl,--whole-archive CMakeFiles/cmTC_71306.dir/objects.a -Wl,--no-whole-archive  -o cmTC_71306.exe -Wl,--major-image-version,0,--minor-image-version,0 -liphlpapi -lws2_32 -lkernel32 -luser32 -lgdi32 -lwinspool -lshell32 -lole32 -loleaut32 -luuid -lcomdlg32 -ladvapi32 
CMakeFiles/cmTC_71306.dir/objects.a(CheckFunctionExists.c.obj):CheckFunctionExists.c:(.text+0xc): undefined reference to `setresgid'

collect2.exe: error: ld returned 1 exit status

make[2]: *** [CMakeFiles/cmTC_71306.dir/build.make:88: cmTC_71306.exe] Error 1
make[2]: Leaving directory '/home/buildbot/slave/monero-static-win32/build/build/release/CMakeFiles/CMakeTmp'
make[1]: *** [Makefile:121: cmTC_71306/fast] Error 2
make[1]: Leaving directory '/home/buildbot/slave/monero-static-win32/build/build/release/CMakeFiles/CMakeTmp'


Determining if the function setresuid exists failed with the following output:
Change Dir: C:/msys32/home/buildbot/slave/monero-static-win32/build/build/release/CMakeFiles/CMakeTmp

Run Build Command:"C:/msys32/usr/bin/make.exe" "cmTC_84a6b/fast"
make[1]: Entering directory '/home/buildbot/slave/monero-static-win32/build/build/release/CMakeFiles/CMakeTmp'
/usr/bin/make -f CMakeFiles/cmTC_84a6b.dir/build.make CMakeFiles/cmTC_84a6b.dir/build
make[2]: Entering directory '/home/buildbot/slave/monero-static-win32/build/build/release/CMakeFiles/CMakeTmp'
Building C object CMakeFiles/cmTC_84a6b.dir/CheckFunctionExists.c.obj

/C/msys32/mingw32/bin/i686-w64-mingw32-gcc.exe   -DCHECK_FUNCTION_EXISTS=setresuid   -o CMakeFiles/cmTC_84a6b.dir/CheckFunctionExists.c.obj   -c /C/msys32/mingw32/share/cmake-3.12/Modules/CheckFunctionExists.c
Linking C executable cmTC_84a6b.exe

/C/msys32/mingw32/bin/cmake.exe -E remove -f CMakeFiles/cmTC_84a6b.dir/objects.a
ar cr CMakeFiles/cmTC_84a6b.dir/objects.a "CMakeFiles/cmTC_84a6b.dir/CheckFunctionExists.c.obj" 
/C/msys32/mingw32/bin/i686-w64-mingw32-gcc.exe  -DCHECK_FUNCTION_EXISTS=setresuid    -Wl,--whole-archive CMakeFiles/cmTC_84a6b.dir/objects.a -Wl,--no-whole-archive  -o cmTC_84a6b.exe -Wl,--major-image-version,0,--minor-image-version,0 -liphlpapi -lws2_32 -lkernel32 -luser32 -lgdi32 -lwinspool -lshell32 -lole32 -loleaut32 -luuid -lcomdlg32 -ladvapi32 
CMakeFiles/cmTC_84a6b.dir/objects.a(CheckFunctionExists.c.obj):CheckFunctionExists.c:(.text+0xc): undefined reference to `setresuid'

collect2.exe: error: ld returned 1 exit status

make[2]: *** [CMakeFiles/cmTC_84a6b.dir/build.make:88: cmTC_84a6b.exe] Error 1
make[2]: Leaving directory '/home/buildbot/slave/monero-static-win32/build/build/release/CMakeFiles/CMakeTmp'
make[1]: *** [Makefile:121: cmTC_84a6b/fast] Error 2
make[1]: Leaving directory '/home/buildbot/slave/monero-static-win32/build/build/release/CMakeFiles/CMakeTmp'


Determining if the function setreuid exists failed with the following output:
Change Dir: C:/msys32/home/buildbot/slave/monero-static-win32/build/build/release/CMakeFiles/CMakeTmp

Run Build Command:"C:/msys32/usr/bin/make.exe" "cmTC_b5d16/fast"
make[1]: Entering directory '/home/buildbot/slave/monero-static-win32/build/build/release/CMakeFiles/CMakeTmp'
/usr/bin/make -f CMakeFiles/cmTC_b5d16.dir/build.make CMakeFiles/cmTC_b5d16.dir/build
make[2]: Entering directory '/home/buildbot/slave/monero-static-win32/build/build/release/CMakeFiles/CMakeTmp'
Building C object CMakeFiles/cmTC_b5d16.dir/CheckFunctionExists.c.obj

/C/msys32/mingw32/bin/i686-w64-mingw32-gcc.exe   -DCHECK_FUNCTION_EXISTS=setreuid   -o CMakeFiles/cmTC_b5d16.dir/CheckFunctionExists.c.obj   -c /C/msys32/mingw32/share/cmake-3.12/Modules/CheckFunctionExists.c
Linking C executable cmTC_b5d16.exe

/C/msys32/mingw32/bin/cmake.exe -E remove -f CMakeFiles/cmTC_b5d16.dir/objects.a
ar cr CMakeFiles/cmTC_b5d16.dir/objects.a "CMakeFiles/cmTC_b5d16.dir/CheckFunctionExists.c.obj" 
/C/msys32/mingw32/bin/i686-w64-mingw32-gcc.exe  -DCHECK_FUNCTION_EXISTS=setreuid    -Wl,--whole-archive CMakeFiles/cmTC_b5d16.dir/objects.a -Wl,--no-whole-archive  -o cmTC_b5d16.exe -Wl,--major-image-version,0,--minor-image-version,0 -liphlpapi -lws2_32 -lkernel32 -luser32 -lgdi32 -lwinspool -lshell32 -lole32 -loleaut32 -luuid -lcomdlg32 -ladvapi32 
CMakeFiles/cmTC_b5d16.dir/objects.a(CheckFunctionExists.c.obj):CheckFunctionExists.c:(.text+0xc): undefined reference to `setreuid'

collect2.exe: error: ld returned 1 exit status

make[2]: *** [CMakeFiles/cmTC_b5d16.dir/build.make:88: cmTC_b5d16.exe] Error 1
make[2]: Leaving directory '/home/buildbot/slave/monero-static-win32/build/build/release/CMakeFiles/CMakeTmp'
make[1]: *** [Makefile:121: cmTC_b5d16/fast] Error 2
make[1]: Leaving directory '/home/buildbot/slave/monero-static-win32/build/build/release/CMakeFiles/CMakeTmp'


Determining if the function setrlimit exists failed with the following output:
Change Dir: C:/msys32/home/buildbot/slave/monero-static-win32/build/build/release/CMakeFiles/CMakeTmp

Run Build Command:"C:/msys32/usr/bin/make.exe" "cmTC_cb095/fast"
make[1]: Entering directory '/home/buildbot/slave/monero-static-win32/build/build/release/CMakeFiles/CMakeTmp'
/usr/bin/make -f CMakeFiles/cmTC_cb095.dir/build.make CMakeFiles/cmTC_cb095.dir/build
make[2]: Entering directory '/home/buildbot/slave/monero-static-win32/build/build/release/CMakeFiles/CMakeTmp'
Building C object CMakeFiles/cmTC_cb095.dir/CheckFunctionExists.c.obj

/C/msys32/mingw32/bin/i686-w64-mingw32-gcc.exe   -DCHECK_FUNCTION_EXISTS=setrlimit   -o CMakeFiles/cmTC_cb095.dir/CheckFunctionExists.c.obj   -c /C/msys32/mingw32/share/cmake-3.12/Modules/CheckFunctionExists.c
Linking C executable cmTC_cb095.exe

/C/msys32/mingw32/bin/cmake.exe -E remove -f CMakeFiles/cmTC_cb095.dir/objects.a
ar cr CMakeFiles/cmTC_cb095.dir/objects.a "CMakeFiles/cmTC_cb095.dir/CheckFunctionExists.c.obj" 
/C/msys32/mingw32/bin/i686-w64-mingw32-gcc.exe  -DCHECK_FUNCTION_EXISTS=setrlimit    -Wl,--whole-archive CMakeFiles/cmTC_cb095.dir/objects.a -Wl,--no-whole-archive  -o cmTC_cb095.exe -Wl,--major-image-version,0,--minor-image-version,0 -liphlpapi -lws2_32 -lkernel32 -luser32 -lgdi32 -lwinspool -lshell32 -lole32 -loleaut32 -luuid -lcomdlg32 -ladvapi32 
CMakeFiles/cmTC_cb095.dir/objects.a(CheckFunctionExists.c.obj):CheckFunctionExists.c:(.text+0xc): undefined reference to `setrlimit'

collect2.exe: error: ld returned 1 exit status

make[2]: *** [CMakeFiles/cmTC_cb095.dir/build.make:88: cmTC_cb095.exe] Error 1
make[2]: Leaving directory '/home/buildbot/slave/monero-static-win32/build/build/release/CMakeFiles/CMakeTmp'
make[1]: *** [Makefile:121: cmTC_cb095/fast] Error 2
make[1]: Leaving directory '/home/buildbot/slave/monero-static-win32/build/build/release/CMakeFiles/CMakeTmp'


Determining if the function setsid exists failed with the following output:
Change Dir: C:/msys32/home/buildbot/slave/monero-static-win32/build/build/release/CMakeFiles/CMakeTmp

Run Build Command:"C:/msys32/usr/bin/make.exe" "cmTC_74d68/fast"
make[1]: Entering directory '/home/buildbot/slave/monero-static-win32/build/build/release/CMakeFiles/CMakeTmp'
/usr/bin/make -f CMakeFiles/cmTC_74d68.dir/build.make CMakeFiles/cmTC_74d68.dir/build
make[2]: Entering directory '/home/buildbot/slave/monero-static-win32/build/build/release/CMakeFiles/CMakeTmp'
Building C object CMakeFiles/cmTC_74d68.dir/CheckFunctionExists.c.obj

/C/msys32/mingw32/bin/i686-w64-mingw32-gcc.exe   -DCHECK_FUNCTION_EXISTS=setsid   -o CMakeFiles/cmTC_74d68.dir/CheckFunctionExists.c.obj   -c /C/msys32/mingw32/share/cmake-3.12/Modules/CheckFunctionExists.c
Linking C executable cmTC_74d68.exe

/C/msys32/mingw32/bin/cmake.exe -E remove -f CMakeFiles/cmTC_74d68.dir/objects.a
ar cr CMakeFiles/cmTC_74d68.dir/objects.a "CMakeFiles/cmTC_74d68.dir/CheckFunctionExists.c.obj" 
/C/msys32/mingw32/bin/i686-w64-mingw32-gcc.exe  -DCHECK_FUNCTION_EXISTS=setsid    -Wl,--whole-archive CMakeFiles/cmTC_74d68.dir/objects.a -Wl,--no-whole-archive  -o cmTC_74d68.exe -Wl,--major-image-version,0,--minor-image-version,0 -liphlpapi -lws2_32 -lkernel32 -luser32 -lgdi32 -lwinspool -lshell32 -lole32 -loleaut32 -luuid -lcomdlg32 -ladvapi32 
CMakeFiles/cmTC_74d68.dir/objects.a(CheckFunctionExists.c.obj):CheckFunctionExists.c:(.text+0xc): undefined reference to `setsid'

collect2.exe: error: ld returned 1 exit status

make[2]: *** [CMakeFiles/cmTC_74d68.dir/build.make:88: cmTC_74d68.exe] Error 1
make[2]: Leaving directory '/home/buildbot/slave/monero-static-win32/build/build/release/CMakeFiles/CMakeTmp'
make[1]: *** [Makefile:121: cmTC_74d68/fast] Error 2
make[1]: Leaving directory '/home/buildbot/slave/monero-static-win32/build/build/release/CMakeFiles/CMakeTmp'


Determining if the function setusercontent exists failed with the following output:
Change Dir: C:/msys32/home/buildbot/slave/monero-static-win32/build/build/release/CMakeFiles/CMakeTmp

Run Build Command:"C:/msys32/usr/bin/make.exe" "cmTC_c720d/fast"
make[1]: Entering directory '/home/buildbot/slave/monero-static-win32/build/build/release/CMakeFiles/CMakeTmp'
/usr/bin/make -f CMakeFiles/cmTC_c720d.dir/build.make CMakeFiles/cmTC_c720d.dir/build
make[2]: Entering directory '/home/buildbot/slave/monero-static-win32/build/build/release/CMakeFiles/CMakeTmp'
Building C object CMakeFiles/cmTC_c720d.dir/CheckFunctionExists.c.obj

/C/msys32/mingw32/bin/i686-w64-mingw32-gcc.exe   -DCHECK_FUNCTION_EXISTS=setusercontent   -o CMakeFiles/cmTC_c720d.dir/CheckFunctionExists.c.obj   -c /C/msys32/mingw32/share/cmake-3.12/Modules/CheckFunctionExists.c
Linking C executable cmTC_c720d.exe

/C/msys32/mingw32/bin/cmake.exe -E remove -f CMakeFiles/cmTC_c720d.dir/objects.a
ar cr CMakeFiles/cmTC_c720d.dir/objects.a "CMakeFiles/cmTC_c720d.dir/CheckFunctionExists.c.obj" 
/C/msys32/mingw32/bin/i686-w64-mingw32-gcc.exe  -DCHECK_FUNCTION_EXISTS=setusercontent    -Wl,--whole-archive CMakeFiles/cmTC_c720d.dir/objects.a -Wl,--no-whole-archive  -o cmTC_c720d.exe -Wl,--major-image-version,0,--minor-image-version,0 -liphlpapi -lws2_32 -lkernel32 -luser32 -lgdi32 -lwinspool -lshell32 -lole32 -loleaut32 -luuid -lcomdlg32 -ladvapi32 
CMakeFiles/cmTC_c720d.dir/objects.a(CheckFunctionExists.c.obj):CheckFunctionExists.c:(.text+0xc): undefined reference to `setusercontent'

collect2.exe: error: ld returned 1 exit status

make[2]: *** [CMakeFiles/cmTC_c720d.dir/build.make:88: cmTC_c720d.exe] Error 1
make[2]: Leaving directory '/home/buildbot/slave/monero-static-win32/build/build/release/CMakeFiles/CMakeTmp'
make[1]: *** [Makefile:121: cmTC_c720d/fast] Error 2
make[1]: Leaving directory '/home/buildbot/slave/monero-static-win32/build/build/release/CMakeFiles/CMakeTmp'


Determining if the function sigprocmask exists failed with the following output:
Change Dir: C:/msys32/home/buildbot/slave/monero-static-win32/build/build/release/CMakeFiles/CMakeTmp

Run Build Command:"C:/msys32/usr/bin/make.exe" "cmTC_8a9b7/fast"
make[1]: Entering directory '/home/buildbot/slave/monero-static-win32/build/build/release/CMakeFiles/CMakeTmp'
/usr/bin/make -f CMakeFiles/cmTC_8a9b7.dir/build.make CMakeFiles/cmTC_8a9b7.dir/build
make[2]: Entering directory '/home/buildbot/slave/monero-static-win32/build/build/release/CMakeFiles/CMakeTmp'
Building C object CMakeFiles/cmTC_8a9b7.dir/CheckFunctionExists.c.obj

/C/msys32/mingw32/bin/i686-w64-mingw32-gcc.exe   -DCHECK_FUNCTION_EXISTS=sigprocmask   -o CMakeFiles/cmTC_8a9b7.dir/CheckFunctionExists.c.obj   -c /C/msys32/mingw32/share/cmake-3.12/Modules/CheckFunctionExists.c
Linking C executable cmTC_8a9b7.exe

/C/msys32/mingw32/bin/cmake.exe -E remove -f CMakeFiles/cmTC_8a9b7.dir/objects.a
ar cr CMakeFiles/cmTC_8a9b7.dir/objects.a "CMakeFiles/cmTC_8a9b7.dir/CheckFunctionExists.c.obj" 
/C/msys32/mingw32/bin/i686-w64-mingw32-gcc.exe  -DCHECK_FUNCTION_EXISTS=sigprocmask    -Wl,--whole-archive CMakeFiles/cmTC_8a9b7.dir/objects.a -Wl,--no-whole-archive  -o cmTC_8a9b7.exe -Wl,--major-image-version,0,--minor-image-version,0 -liphlpapi -lws2_32 -lkernel32 -luser32 -lgdi32 -lwinspool -lshell32 -lole32 -loleaut32 -luuid -lcomdlg32 -ladvapi32 
CMakeFiles/cmTC_8a9b7.dir/objects.a(CheckFunctionExists.c.obj):CheckFunctionExists.c:(.text+0xc): undefined reference to `sigprocmask'

collect2.exe: error: ld returned 1 exit status

make[2]: *** [CMakeFiles/cmTC_8a9b7.dir/build.make:88: cmTC_8a9b7.exe] Error 1
make[2]: Leaving directory '/home/buildbot/slave/monero-static-win32/build/build/release/CMakeFiles/CMakeTmp'
make[1]: *** [Makefile:121: cmTC_8a9b7/fast] Error 2
make[1]: Leaving directory '/home/buildbot/slave/monero-static-win32/build/build/release/CMakeFiles/CMakeTmp'


Determining if the function socketpair exists failed with the following output:
Change Dir: C:/msys32/home/buildbot/slave/monero-static-win32/build/build/release/CMakeFiles/CMakeTmp

Run Build Command:"C:/msys32/usr/bin/make.exe" "cmTC_7be6b/fast"
make[1]: Entering directory '/home/buildbot/slave/monero-static-win32/build/build/release/CMakeFiles/CMakeTmp'
/usr/bin/make -f CMakeFiles/cmTC_7be6b.dir/build.make CMakeFiles/cmTC_7be6b.dir/build
make[2]: Entering directory '/home/buildbot/slave/monero-static-win32/build/build/release/CMakeFiles/CMakeTmp'
Building C object CMakeFiles/cmTC_7be6b.dir/CheckFunctionExists.c.obj

/C/msys32/mingw32/bin/i686-w64-mingw32-gcc.exe   -DCHECK_FUNCTION_EXISTS=socketpair   -o CMakeFiles/cmTC_7be6b.dir/CheckFunctionExists.c.obj   -c /C/msys32/mingw32/share/cmake-3.12/Modules/CheckFunctionExists.c
Linking C executable cmTC_7be6b.exe

/C/msys32/mingw32/bin/cmake.exe -E remove -f CMakeFiles/cmTC_7be6b.dir/objects.a
ar cr CMakeFiles/cmTC_7be6b.dir/objects.a "CMakeFiles/cmTC_7be6b.dir/CheckFunctionExists.c.obj" 
/C/msys32/mingw32/bin/i686-w64-mingw32-gcc.exe  -DCHECK_FUNCTION_EXISTS=socketpair    -Wl,--whole-archive CMakeFiles/cmTC_7be6b.dir/objects.a -Wl,--no-whole-archive  -o cmTC_7be6b.exe -Wl,--major-image-version,0,--minor-image-version,0 -liphlpapi -lws2_32 -lkernel32 -luser32 -lgdi32 -lwinspool -lshell32 -lole32 -loleaut32 -luuid -lcomdlg32 -ladvapi32 
CMakeFiles/cmTC_7be6b.dir/objects.a(CheckFunctionExists.c.obj):CheckFunctionExists.c:(.text+0xc): undefined reference to `socketpair'

collect2.exe: error: ld returned 1 exit status

make[2]: *** [CMakeFiles/cmTC_7be6b.dir/build.make:88: cmTC_7be6b.exe] Error 1
make[2]: Leaving directory '/home/buildbot/slave/monero-static-win32/build/build/release/CMakeFiles/CMakeTmp'
make[1]: *** [Makefile:121: cmTC_7be6b/fast] Error 2
make[1]: Leaving directory '/home/buildbot/slave/monero-static-win32/build/build/release/CMakeFiles/CMakeTmp'


Determining if the function srandom exists failed with the following output:
Change Dir: C:/msys32/home/buildbot/slave/monero-static-win32/build/build/release/CMakeFiles/CMakeTmp

Run Build Command:"C:/msys32/usr/bin/make.exe" "cmTC_23e4d/fast"
make[1]: Entering directory '/home/buildbot/slave/monero-static-win32/build/build/release/CMakeFiles/CMakeTmp'
/usr/bin/make -f CMakeFiles/cmTC_23e4d.dir/build.make CMakeFiles/cmTC_23e4d.dir/build
make[2]: Entering directory '/home/buildbot/slave/monero-static-win32/build/build/release/CMakeFiles/CMakeTmp'
Building C object CMakeFiles/cmTC_23e4d.dir/CheckFunctionExists.c.obj

/C/msys32/mingw32/bin/i686-w64-mingw32-gcc.exe   -DCHECK_FUNCTION_EXISTS=srandom   -o CMakeFiles/cmTC_23e4d.dir/CheckFunctionExists.c.obj   -c /C/msys32/mingw32/share/cmake-3.12/Modules/CheckFunctionExists.c
Linking C executable cmTC_23e4d.exe

/C/msys32/mingw32/bin/cmake.exe -E remove -f CMakeFiles/cmTC_23e4d.dir/objects.a
ar cr CMakeFiles/cmTC_23e4d.dir/objects.a "CMakeFiles/cmTC_23e4d.dir/CheckFunctionExists.c.obj" 
/C/msys32/mingw32/bin/i686-w64-mingw32-gcc.exe  -DCHECK_FUNCTION_EXISTS=srandom    -Wl,--whole-archive CMakeFiles/cmTC_23e4d.dir/objects.a -Wl,--no-whole-archive  -o cmTC_23e4d.exe -Wl,--major-image-version,0,--minor-image-version,0 -liphlpapi -lws2_32 -lkernel32 -luser32 -lgdi32 -lwinspool -lshell32 -lole32 -loleaut32 -luuid -lcomdlg32 -ladvapi32 
CMakeFiles/cmTC_23e4d.dir/objects.a(CheckFunctionExists.c.obj):CheckFunctionExists.c:(.text+0xc): undefined reference to `srandom'

collect2.exe: error: ld returned 1 exit status

make[2]: *** [CMakeFiles/cmTC_23e4d.dir/build.make:88: cmTC_23e4d.exe] Error 1
make[2]: Leaving directory '/home/buildbot/slave/monero-static-win32/build/build/release/CMakeFiles/CMakeTmp'
make[1]: *** [Makefile:121: cmTC_23e4d/fast] Error 2
make[1]: Leaving directory '/home/buildbot/slave/monero-static-win32/build/build/release/CMakeFiles/CMakeTmp'


Determining if the function strsep exists failed with the following output:
Change Dir: C:/msys32/home/buildbot/slave/monero-static-win32/build/build/release/CMakeFiles/CMakeTmp

Run Build Command:"C:/msys32/usr/bin/make.exe" "cmTC_09f88/fast"
make[1]: Entering directory '/home/buildbot/slave/monero-static-win32/build/build/release/CMakeFiles/CMakeTmp'
/usr/bin/make -f CMakeFiles/cmTC_09f88.dir/build.make CMakeFiles/cmTC_09f88.dir/build
make[2]: Entering directory '/home/buildbot/slave/monero-static-win32/build/build/release/CMakeFiles/CMakeTmp'
Building C object CMakeFiles/cmTC_09f88.dir/CheckFunctionExists.c.obj

/C/msys32/mingw32/bin/i686-w64-mingw32-gcc.exe   -DCHECK_FUNCTION_EXISTS=strsep   -o CMakeFiles/cmTC_09f88.dir/CheckFunctionExists.c.obj   -c /C/msys32/mingw32/share/cmake-3.12/Modules/CheckFunctionExists.c
Linking C executable cmTC_09f88.exe

/C/msys32/mingw32/bin/cmake.exe -E remove -f CMakeFiles/cmTC_09f88.dir/objects.a
ar cr CMakeFiles/cmTC_09f88.dir/objects.a "CMakeFiles/cmTC_09f88.dir/CheckFunctionExists.c.obj" 
/C/msys32/mingw32/bin/i686-w64-mingw32-gcc.exe  -DCHECK_FUNCTION_EXISTS=strsep    -Wl,--whole-archive CMakeFiles/cmTC_09f88.dir/objects.a -Wl,--no-whole-archive  -o cmTC_09f88.exe -Wl,--major-image-version,0,--minor-image-version,0 -liphlpapi -lws2_32 -lkernel32 -luser32 -lgdi32 -lwinspool -lshell32 -lole32 -loleaut32 -luuid -lcomdlg32 -ladvapi32 
CMakeFiles/cmTC_09f88.dir/objects.a(CheckFunctionExists.c.obj):CheckFunctionExists.c:(.text+0xc): undefined reference to `strsep'

collect2.exe: error: ld returned 1 exit status

make[2]: *** [CMakeFiles/cmTC_09f88.dir/build.make:88: cmTC_09f88.exe] Error 1
make[2]: Leaving directory '/home/buildbot/slave/monero-static-win32/build/build/release/CMakeFiles/CMakeTmp'
make[1]: *** [Makefile:121: cmTC_09f88/fast] Error 2
make[1]: Leaving directory '/home/buildbot/slave/monero-static-win32/build/build/release/CMakeFiles/CMakeTmp'


Determining if the function strlcat exists failed with the following output:
Change Dir: C:/msys32/home/buildbot/slave/monero-static-win32/build/build/release/CMakeFiles/CMakeTmp

Run Build Command:"C:/msys32/usr/bin/make.exe" "cmTC_ad62f/fast"
make[1]: Entering directory '/home/buildbot/slave/monero-static-win32/build/build/release/CMakeFiles/CMakeTmp'
/usr/bin/make -f CMakeFiles/cmTC_ad62f.dir/build.make CMakeFiles/cmTC_ad62f.dir/build
make[2]: Entering directory '/home/buildbot/slave/monero-static-win32/build/build/release/CMakeFiles/CMakeTmp'
Building C object CMakeFiles/cmTC_ad62f.dir/CheckFunctionExists.c.obj

/C/msys32/mingw32/bin/i686-w64-mingw32-gcc.exe   -DCHECK_FUNCTION_EXISTS=strlcat   -o CMakeFiles/cmTC_ad62f.dir/CheckFunctionExists.c.obj   -c /C/msys32/mingw32/share/cmake-3.12/Modules/CheckFunctionExists.c
Linking C executable cmTC_ad62f.exe

/C/msys32/mingw32/bin/cmake.exe -E remove -f CMakeFiles/cmTC_ad62f.dir/objects.a
ar cr CMakeFiles/cmTC_ad62f.dir/objects.a "CMakeFiles/cmTC_ad62f.dir/CheckFunctionExists.c.obj" 
/C/msys32/mingw32/bin/i686-w64-mingw32-gcc.exe  -DCHECK_FUNCTION_EXISTS=strlcat    -Wl,--whole-archive CMakeFiles/cmTC_ad62f.dir/objects.a -Wl,--no-whole-archive  -o cmTC_ad62f.exe -Wl,--major-image-version,0,--minor-image-version,0 -liphlpapi -lws2_32 -lkernel32 -luser32 -lgdi32 -lwinspool -lshell32 -lole32 -loleaut32 -luuid -lcomdlg32 -ladvapi32 
CMakeFiles/cmTC_ad62f.dir/objects.a(CheckFunctionExists.c.obj):CheckFunctionExists.c:(.text+0xc): undefined reference to `strlcat'

collect2.exe: error: ld returned 1 exit status

make[2]: *** [CMakeFiles/cmTC_ad62f.dir/build.make:88: cmTC_ad62f.exe] Error 1
make[2]: Leaving directory '/home/buildbot/slave/monero-static-win32/build/build/release/CMakeFiles/CMakeTmp'
make[1]: *** [Makefile:121: cmTC_ad62f/fast] Error 2
make[1]: Leaving directory '/home/buildbot/slave/monero-static-win32/build/build/release/CMakeFiles/CMakeTmp'


Determining if the function strlcpy exists failed with the following output:
Change Dir: C:/msys32/home/buildbot/slave/monero-static-win32/build/build/release/CMakeFiles/CMakeTmp

Run Build Command:"C:/msys32/usr/bin/make.exe" "cmTC_82fc3/fast"
make[1]: Entering directory '/home/buildbot/slave/monero-static-win32/build/build/release/CMakeFiles/CMakeTmp'
/usr/bin/make -f CMakeFiles/cmTC_82fc3.dir/build.make CMakeFiles/cmTC_82fc3.dir/build
make[2]: Entering directory '/home/buildbot/slave/monero-static-win32/build/build/release/CMakeFiles/CMakeTmp'
Building C object CMakeFiles/cmTC_82fc3.dir/CheckFunctionExists.c.obj

/C/msys32/mingw32/bin/i686-w64-mingw32-gcc.exe   -DCHECK_FUNCTION_EXISTS=strlcpy   -o CMakeFiles/cmTC_82fc3.dir/CheckFunctionExists.c.obj   -c /C/msys32/mingw32/share/cmake-3.12/Modules/CheckFunctionExists.c
Linking C executable cmTC_82fc3.exe

/C/msys32/mingw32/bin/cmake.exe -E remove -f CMakeFiles/cmTC_82fc3.dir/objects.a
ar cr CMakeFiles/cmTC_82fc3.dir/objects.a "CMakeFiles/cmTC_82fc3.dir/CheckFunctionExists.c.obj" 
/C/msys32/mingw32/bin/i686-w64-mingw32-gcc.exe  -DCHECK_FUNCTION_EXISTS=strlcpy    -Wl,--whole-archive CMakeFiles/cmTC_82fc3.dir/objects.a -Wl,--no-whole-archive  -o cmTC_82fc3.exe -Wl,--major-image-version,0,--minor-image-version,0 -liphlpapi -lws2_32 -lkernel32 -luser32 -lgdi32 -lwinspool -lshell32 -lole32 -loleaut32 -luuid -lcomdlg32 -ladvapi32 
CMakeFiles/cmTC_82fc3.dir/objects.a(CheckFunctionExists.c.obj):CheckFunctionExists.c:(.text+0xc): undefined reference to `strlcpy'

collect2.exe: error: ld returned 1 exit status

make[2]: *** [CMakeFiles/cmTC_82fc3.dir/build.make:88: cmTC_82fc3.exe] Error 1
make[2]: Leaving directory '/home/buildbot/slave/monero-static-win32/build/build/release/CMakeFiles/CMakeTmp'
make[1]: *** [Makefile:121: cmTC_82fc3/fast] Error 2
make[1]: Leaving directory '/home/buildbot/slave/monero-static-win32/build/build/release/CMakeFiles/CMakeTmp'


Determining if the function strptime exists failed with the following output:
Change Dir: C:/msys32/home/buildbot/slave/monero-static-win32/build/build/release/CMakeFiles/CMakeTmp

Run Build Command:"C:/msys32/usr/bin/make.exe" "cmTC_d271b/fast"
make[1]: Entering directory '/home/buildbot/slave/monero-static-win32/build/build/release/CMakeFiles/CMakeTmp'
/usr/bin/make -f CMakeFiles/cmTC_d271b.dir/build.make CMakeFiles/cmTC_d271b.dir/build
make[2]: Entering directory '/home/buildbot/slave/monero-static-win32/build/build/release/CMakeFiles/CMakeTmp'
Building C object CMakeFiles/cmTC_d271b.dir/CheckFunctionExists.c.obj

/C/msys32/mingw32/bin/i686-w64-mingw32-gcc.exe   -DCHECK_FUNCTION_EXISTS=strptime   -o CMakeFiles/cmTC_d271b.dir/CheckFunctionExists.c.obj   -c /C/msys32/mingw32/share/cmake-3.12/Modules/CheckFunctionExists.c
Linking C executable cmTC_d271b.exe

/C/msys32/mingw32/bin/cmake.exe -E remove -f CMakeFiles/cmTC_d271b.dir/objects.a
ar cr CMakeFiles/cmTC_d271b.dir/objects.a "CMakeFiles/cmTC_d271b.dir/CheckFunctionExists.c.obj" 
/C/msys32/mingw32/bin/i686-w64-mingw32-gcc.exe  -DCHECK_FUNCTION_EXISTS=strptime    -Wl,--whole-archive CMakeFiles/cmTC_d271b.dir/objects.a -Wl,--no-whole-archive  -o cmTC_d271b.exe -Wl,--major-image-version,0,--minor-image-version,0 -liphlpapi -lws2_32 -lkernel32 -luser32 -lgdi32 -lwinspool -lshell32 -lole32 -loleaut32 -luuid -lcomdlg32 -ladvapi32 
CMakeFiles/cmTC_d271b.dir/objects.a(CheckFunctionExists.c.obj):CheckFunctionExists.c:(.text+0xc): undefined reference to `strptime'

collect2.exe: error: ld returned 1 exit status

make[2]: *** [CMakeFiles/cmTC_d271b.dir/build.make:88: cmTC_d271b.exe] Error 1
make[2]: Leaving directory '/home/buildbot/slave/monero-static-win32/build/build/release/CMakeFiles/CMakeTmp'
make[1]: *** [Makefile:121: cmTC_d271b/fast] Error 2
make[1]: Leaving directory '/home/buildbot/slave/monero-static-win32/build/build/release/CMakeFiles/CMakeTmp'


Determining if the function writev exists failed with the following output:
Change Dir: C:/msys32/home/buildbot/slave/monero-static-win32/build/build/release/CMakeFiles/CMakeTmp

Run Build Command:"C:/msys32/usr/bin/make.exe" "cmTC_4761e/fast"
make[1]: Entering directory '/home/buildbot/slave/monero-static-win32/build/build/release/CMakeFiles/CMakeTmp'
/usr/bin/make -f CMakeFiles/cmTC_4761e.dir/build.make CMakeFiles/cmTC_4761e.dir/build
make[2]: Entering directory '/home/buildbot/slave/monero-static-win32/build/build/release/CMakeFiles/CMakeTmp'
Building C object CMakeFiles/cmTC_4761e.dir/CheckFunctionExists.c.obj

/C/msys32/mingw32/bin/i686-w64-mingw32-gcc.exe   -DCHECK_FUNCTION_EXISTS=writev   -o CMakeFiles/cmTC_4761e.dir/CheckFunctionExists.c.obj   -c /C/msys32/mingw32/share/cmake-3.12/Modules/CheckFunctionExists.c
Linking C executable cmTC_4761e.exe

/C/msys32/mingw32/bin/cmake.exe -E remove -f CMakeFiles/cmTC_4761e.dir/objects.a
ar cr CMakeFiles/cmTC_4761e.dir/objects.a "CMakeFiles/cmTC_4761e.dir/CheckFunctionExists.c.obj" 
/C/msys32/mingw32/bin/i686-w64-mingw32-gcc.exe  -DCHECK_FUNCTION_EXISTS=writev    -Wl,--whole-archive CMakeFiles/cmTC_4761e.dir/objects.a -Wl,--no-whole-archive  -o cmTC_4761e.exe -Wl,--major-image-version,0,--minor-image-version,0 -liphlpapi -lws2_32 -lkernel32 -luser32 -lgdi32 -lwinspool -lshell32 -lole32 -loleaut32 -luuid -lcomdlg32 -ladvapi32 
CMakeFiles/cmTC_4761e.dir/objects.a(CheckFunctionExists.c.obj):CheckFunctionExists.c:(.text+0xc): undefined reference to `writev'

collect2.exe: error: ld returned 1 exit status

make[2]: *** [CMakeFiles/cmTC_4761e.dir/build.make:88: cmTC_4761e.exe] Error 1
make[2]: Leaving directory '/home/buildbot/slave/monero-static-win32/build/build/release/CMakeFiles/CMakeTmp'
make[1]: *** [Makefile:121: cmTC_4761e/fast] Error 2
make[1]: Leaving directory '/home/buildbot/slave/monero-static-win32/build/build/release/CMakeFiles/CMakeTmp'


Determining size of gid_t failed with the following output:
Change Dir: C:/msys32/home/buildbot/slave/monero-static-win32/build/build/release/CMakeFiles/CMakeTmp

Run Build Command:"C:/msys32/usr/bin/make.exe" "cmTC_8ec8b/fast"
make[1]: Entering directory '/home/buildbot/slave/monero-static-win32/build/build/release/CMakeFiles/CMakeTmp'
/usr/bin/make -f CMakeFiles/cmTC_8ec8b.dir/build.make CMakeFiles/cmTC_8ec8b.dir/build
make[2]: Entering directory '/home/buildbot/slave/monero-static-win32/build/build/release/CMakeFiles/CMakeTmp'
Building C object CMakeFiles/cmTC_8ec8b.dir/gid_t.c.obj

/C/msys32/mingw32/bin/i686-w64-mingw32-gcc.exe    -o CMakeFiles/cmTC_8ec8b.dir/gid_t.c.obj   -c /C/msys32/home/buildbot/slave/monero-static-win32/build/build/release/CMakeFiles/CheckTypeSize/gid_t.c
C:/msys32/home/buildbot/slave/monero-static-win32/build/build/release/CMakeFiles/CheckTypeSize/gid_t.c:24:22: error: 'gid_t' undeclared here (not in a function); did you mean 'pid_t'?

 #define SIZE (sizeof(gid_t))

                      ^

C:/msys32/home/buildbot/slave/monero-static-win32/build/build/release/CMakeFiles/CheckTypeSize/gid_t.c:26:12: note: in expansion of macro 'SIZE'

   ('0' + ((SIZE / 10000)%10)),

            ^~~~

make[2]: *** [CMakeFiles/cmTC_8ec8b.dir/build.make:66: CMakeFiles/cmTC_8ec8b.dir/gid_t.c.obj] Error 1
make[2]: Leaving directory '/home/buildbot/slave/monero-static-win32/build/build/release/CMakeFiles/CMakeTmp'
make[1]: *** [Makefile:121: cmTC_8ec8b/fast] Error 2
make[1]: Leaving directory '/home/buildbot/slave/monero-static-win32/build/build/release/CMakeFiles/CMakeTmp'

C:/msys32/home/buildbot/slave/monero-static-win32/build/build/release/CMakeFiles/CheckTypeSize/gid_t.c:
#include <sys/types.h>
#include <stdint.h>
#include <stddef.h>
#include "sys/types.h"


#undef KEY
#if defined(__i386)
# define KEY '_','_','i','3','8','6'
#elif defined(__x86_64)
# define KEY '_','_','x','8','6','_','6','4'
#elif defined(__ppc__)
# define KEY '_','_','p','p','c','_','_'
#elif defined(__ppc64__)
# define KEY '_','_','p','p','c','6','4','_','_'
#elif defined(__aarch64__)
# define KEY '_','_','a','a','r','c','h','6','4','_','_'
#elif defined(__ARM_ARCH_7A__)
# define KEY '_','_','A','R','M','_','A','R','C','H','_','7','A','_','_'
#elif defined(__ARM_ARCH_7S__)
# define KEY '_','_','A','R','M','_','A','R','C','H','_','7','S','_','_'
#endif

#define SIZE (sizeof(gid_t))
char info_size[] =  {'I', 'N', 'F', 'O', ':', 's','i','z','e','[',
  ('0' + ((SIZE / 10000)%10)),
  ('0' + ((SIZE / 1000)%10)),
  ('0' + ((SIZE / 100)%10)),
  ('0' + ((SIZE / 10)%10)),
  ('0' +  (SIZE    % 10)),
  ']',
#ifdef KEY
  ' ','k','e','y','[', KEY, ']',
#endif
  '\0'};

#ifdef __CLASSIC_C__
int main(argc, argv) int argc; char *argv[];
#else
int main(int argc, char *argv[])
#endif
{
  int require = 0;
  require += info_size[argc];
  (void)argv;
  return require;
}


Determining size of in_addr_t failed with the following output:
Change Dir: C:/msys32/home/buildbot/slave/monero-static-win32/build/build/release/CMakeFiles/CMakeTmp

Run Build Command:"C:/msys32/usr/bin/make.exe" "cmTC_2fc49/fast"
make[1]: Entering directory '/home/buildbot/slave/monero-static-win32/build/build/release/CMakeFiles/CMakeTmp'
/usr/bin/make -f CMakeFiles/cmTC_2fc49.dir/build.make CMakeFiles/cmTC_2fc49.dir/build
make[2]: Entering directory '/home/buildbot/slave/monero-static-win32/build/build/release/CMakeFiles/CMakeTmp'
Building C object CMakeFiles/cmTC_2fc49.dir/in_addr_t.c.obj

/C/msys32/mingw32/bin/i686-w64-mingw32-gcc.exe    -o CMakeFiles/cmTC_2fc49.dir/in_addr_t.c.obj   -c /C/msys32/home/buildbot/slave/monero-static-win32/build/build/release/CMakeFiles/CheckTypeSize/in_addr_t.c
C:/msys32/home/buildbot/slave/monero-static-win32/build/build/release/CMakeFiles/CheckTypeSize/in_addr_t.c:4:10: fatal error: netinet/in.h: No such file or directory

 #include "netinet/in.h"

          ^~~~~~~~~~~~~~

compilation terminated.

make[2]: *** [CMakeFiles/cmTC_2fc49.dir/build.make:66: CMakeFiles/cmTC_2fc49.dir/in_addr_t.c.obj] Error 1
make[2]: Leaving directory '/home/buildbot/slave/monero-static-win32/build/build/release/CMakeFiles/CMakeTmp'
make[1]: *** [Makefile:121: cmTC_2fc49/fast] Error 2
make[1]: Leaving directory '/home/buildbot/slave/monero-static-win32/build/build/release/CMakeFiles/CMakeTmp'

C:/msys32/home/buildbot/slave/monero-static-win32/build/build/release/CMakeFiles/CheckTypeSize/in_addr_t.c:
#include <sys/types.h>
#include <stdint.h>
#include <stddef.h>
#include "netinet/in.h"


#undef KEY
#if defined(__i386)
# define KEY '_','_','i','3','8','6'
#elif defined(__x86_64)
# define KEY '_','_','x','8','6','_','6','4'
#elif defined(__ppc__)
# define KEY '_','_','p','p','c','_','_'
#elif defined(__ppc64__)
# define KEY '_','_','p','p','c','6','4','_','_'
#elif defined(__aarch64__)
# define KEY '_','_','a','a','r','c','h','6','4','_','_'
#elif defined(__ARM_ARCH_7A__)
# define KEY '_','_','A','R','M','_','A','R','C','H','_','7','A','_','_'
#elif defined(__ARM_ARCH_7S__)
# define KEY '_','_','A','R','M','_','A','R','C','H','_','7','S','_','_'
#endif

#define SIZE (sizeof(in_addr_t))
char info_size[] =  {'I', 'N', 'F', 'O', ':', 's','i','z','e','[',
  ('0' + ((SIZE / 10000)%10)),
  ('0' + ((SIZE / 1000)%10)),
  ('0' + ((SIZE / 100)%10)),
  ('0' + ((SIZE / 10)%10)),
  ('0' +  (SIZE    % 10)),
  ']',
#ifdef KEY
  ' ','k','e','y','[', KEY, ']',
#endif
  '\0'};

#ifdef __CLASSIC_C__
int main(argc, argv) int argc; char *argv[];
#else
int main(int argc, char *argv[])
#endif
{
  int require = 0;
  require += info_size[argc];
  (void)argv;
  return require;
}


Determining size of in_port_t failed with the following output:
Change Dir: C:/msys32/home/buildbot/slave/monero-static-win32/build/build/release/CMakeFiles/CMakeTmp

Run Build Command:"C:/msys32/usr/bin/make.exe" "cmTC_b5e12/fast"
make[1]: Entering directory '/home/buildbot/slave/monero-static-win32/build/build/release/CMakeFiles/CMakeTmp'
/usr/bin/make -f CMakeFiles/cmTC_b5e12.dir/build.make CMakeFiles/cmTC_b5e12.dir/build
make[2]: Entering directory '/home/buildbot/slave/monero-static-win32/build/build/release/CMakeFiles/CMakeTmp'
Building C object CMakeFiles/cmTC_b5e12.dir/in_port_t.c.obj

/C/msys32/mingw32/bin/i686-w64-mingw32-gcc.exe    -o CMakeFiles/cmTC_b5e12.dir/in_port_t.c.obj   -c /C/msys32/home/buildbot/slave/monero-static-win32/build/build/release/CMakeFiles/CheckTypeSize/in_port_t.c
C:/msys32/home/buildbot/slave/monero-static-win32/build/build/release/CMakeFiles/CheckTypeSize/in_port_t.c:4:10: fatal error: netinet/in.h: No such file or directory

 #include "netinet/in.h"

          ^~~~~~~~~~~~~~

compilation terminated.

make[2]: *** [CMakeFiles/cmTC_b5e12.dir/build.make:66: CMakeFiles/cmTC_b5e12.dir/in_port_t.c.obj] Error 1
make[2]: Leaving directory '/home/buildbot/slave/monero-static-win32/build/build/release/CMakeFiles/CMakeTmp'
make[1]: *** [Makefile:121: cmTC_b5e12/fast] Error 2
make[1]: Leaving directory '/home/buildbot/slave/monero-static-win32/build/build/release/CMakeFiles/CMakeTmp'

C:/msys32/home/buildbot/slave/monero-static-win32/build/build/release/CMakeFiles/CheckTypeSize/in_port_t.c:
#include <sys/types.h>
#include <stdint.h>
#include <stddef.h>
#include "netinet/in.h"


#undef KEY
#if defined(__i386)
# define KEY '_','_','i','3','8','6'
#elif defined(__x86_64)
# define KEY '_','_','x','8','6','_','6','4'
#elif defined(__ppc__)
# define KEY '_','_','p','p','c','_','_'
#elif defined(__ppc64__)
# define KEY '_','_','p','p','c','6','4','_','_'
#elif defined(__aarch64__)
# define KEY '_','_','a','a','r','c','h','6','4','_','_'
#elif defined(__ARM_ARCH_7A__)
# define KEY '_','_','A','R','M','_','A','R','C','H','_','7','A','_','_'
#elif defined(__ARM_ARCH_7S__)
# define KEY '_','_','A','R','M','_','A','R','C','H','_','7','S','_','_'
#endif

#define SIZE (sizeof(in_port_t))
char info_size[] =  {'I', 'N', 'F', 'O', ':', 's','i','z','e','[',
  ('0' + ((SIZE / 10000)%10)),
  ('0' + ((SIZE / 1000)%10)),
  ('0' + ((SIZE / 100)%10)),
  ('0' + ((SIZE / 10)%10)),
  ('0' +  (SIZE    % 10)),
  ']',
#ifdef KEY
  ' ','k','e','y','[', KEY, ']',
#endif
  '\0'};

#ifdef __CLASSIC_C__
int main(argc, argv) int argc; char *argv[];
#else
int main(int argc, char *argv[])
#endif
{
  int require = 0;
  require += info_size[argc];
  (void)argv;
  return require;
}


Determining size of rlim_t failed with the following output:
Change Dir: C:/msys32/home/buildbot/slave/monero-static-win32/build/build/release/CMakeFiles/CMakeTmp

Run Build Command:"C:/msys32/usr/bin/make.exe" "cmTC_754bb/fast"
make[1]: Entering directory '/home/buildbot/slave/monero-static-win32/build/build/release/CMakeFiles/CMakeTmp'
/usr/bin/make -f CMakeFiles/cmTC_754bb.dir/build.make CMakeFiles/cmTC_754bb.dir/build
make[2]: Entering directory '/home/buildbot/slave/monero-static-win32/build/build/release/CMakeFiles/CMakeTmp'
Building C object CMakeFiles/cmTC_754bb.dir/rlim_t.c.obj

/C/msys32/mingw32/bin/i686-w64-mingw32-gcc.exe    -o CMakeFiles/cmTC_754bb.dir/rlim_t.c.obj   -c /C/msys32/home/buildbot/slave/monero-static-win32/build/build/release/CMakeFiles/CheckTypeSize/rlim_t.c
C:/msys32/home/buildbot/slave/monero-static-win32/build/build/release/CMakeFiles/CheckTypeSize/rlim_t.c:4:10: fatal error: sys/resource.h: No such file or directory

 #include "sys/resource.h"

          ^~~~~~~~~~~~~~~~

compilation terminated.

make[2]: *** [CMakeFiles/cmTC_754bb.dir/build.make:66: CMakeFiles/cmTC_754bb.dir/rlim_t.c.obj] Error 1
make[2]: Leaving directory '/home/buildbot/slave/monero-static-win32/build/build/release/CMakeFiles/CMakeTmp'
make[1]: *** [Makefile:121: cmTC_754bb/fast] Error 2
make[1]: Leaving directory '/home/buildbot/slave/monero-static-win32/build/build/release/CMakeFiles/CMakeTmp'

C:/msys32/home/buildbot/slave/monero-static-win32/build/build/release/CMakeFiles/CheckTypeSize/rlim_t.c:
#include <sys/types.h>
#include <stdint.h>
#include <stddef.h>
#include "sys/resource.h"


#undef KEY
#if defined(__i386)
# define KEY '_','_','i','3','8','6'
#elif defined(__x86_64)
# define KEY '_','_','x','8','6','_','6','4'
#elif defined(__ppc__)
# define KEY '_','_','p','p','c','_','_'
#elif defined(__ppc64__)
# define KEY '_','_','p','p','c','6','4','_','_'
#elif defined(__aarch64__)
# define KEY '_','_','a','a','r','c','h','6','4','_','_'
#elif defined(__ARM_ARCH_7A__)
# define KEY '_','_','A','R','M','_','A','R','C','H','_','7','A','_','_'
#elif defined(__ARM_ARCH_7S__)
# define KEY '_','_','A','R','M','_','A','R','C','H','_','7','S','_','_'
#endif

#define SIZE (sizeof(rlim_t))
char info_size[] =  {'I', 'N', 'F', 'O', ':', 's','i','z','e','[',
  ('0' + ((SIZE / 10000)%10)),
  ('0' + ((SIZE / 1000)%10)),
  ('0' + ((SIZE / 100)%10)),
  ('0' + ((SIZE / 10)%10)),
  ('0' +  (SIZE    % 10)),
  ']',
#ifdef KEY
  ' ','k','e','y','[', KEY, ']',
#endif
  '\0'};

#ifdef __CLASSIC_C__
int main(argc, argv) int argc; char *argv[];
#else
int main(int argc, char *argv[])
#endif
{
  int require = 0;
  require += info_size[argc];
  (void)argv;
  return require;
}


Determining size of uid_t failed with the following output:
Change Dir: C:/msys32/home/buildbot/slave/monero-static-win32/build/build/release/CMakeFiles/CMakeTmp

Run Build Command:"C:/msys32/usr/bin/make.exe" "cmTC_1659a/fast"
make[1]: Entering directory '/home/buildbot/slave/monero-static-win32/build/build/release/CMakeFiles/CMakeTmp'
/usr/bin/make -f CMakeFiles/cmTC_1659a.dir/build.make CMakeFiles/cmTC_1659a.dir/build
make[2]: Entering directory '/home/buildbot/slave/monero-static-win32/build/build/release/CMakeFiles/CMakeTmp'
Building C object CMakeFiles/cmTC_1659a.dir/uid_t.c.obj

/C/msys32/mingw32/bin/i686-w64-mingw32-gcc.exe    -o CMakeFiles/cmTC_1659a.dir/uid_t.c.obj   -c /C/msys32/home/buildbot/slave/monero-static-win32/build/build/release/CMakeFiles/CheckTypeSize/uid_t.c
C:/msys32/home/buildbot/slave/monero-static-win32/build/build/release/CMakeFiles/CheckTypeSize/uid_t.c:24:22: error: 'uid_t' undeclared here (not in a function); did you mean 'pid_t'?

 #define SIZE (sizeof(uid_t))

                      ^

C:/msys32/home/buildbot/slave/monero-static-win32/build/build/release/CMakeFiles/CheckTypeSize/uid_t.c:26:12: note: in expansion of macro 'SIZE'

   ('0' + ((SIZE / 10000)%10)),

            ^~~~

make[2]: *** [CMakeFiles/cmTC_1659a.dir/build.make:66: CMakeFiles/cmTC_1659a.dir/uid_t.c.obj] Error 1
make[2]: Leaving directory '/home/buildbot/slave/monero-static-win32/build/build/release/CMakeFiles/CMakeTmp'
make[1]: *** [Makefile:121: cmTC_1659a/fast] Error 2
make[1]: Leaving directory '/home/buildbot/slave/monero-static-win32/build/build/release/CMakeFiles/CMakeTmp'

C:/msys32/home/buildbot/slave/monero-static-win32/build/build/release/CMakeFiles/CheckTypeSize/uid_t.c:
#include <sys/types.h>
#include <stdint.h>
#include <stddef.h>
#include "sys/types.h"


#undef KEY
#if defined(__i386)
# define KEY '_','_','i','3','8','6'
#elif defined(__x86_64)
# define KEY '_','_','x','8','6','_','6','4'
#elif defined(__ppc__)
# define KEY '_','_','p','p','c','_','_'
#elif defined(__ppc64__)
# define KEY '_','_','p','p','c','6','4','_','_'
#elif defined(__aarch64__)
# define KEY '_','_','a','a','r','c','h','6','4','_','_'
#elif defined(__ARM_ARCH_7A__)
# define KEY '_','_','A','R','M','_','A','R','C','H','_','7','A','_','_'
#elif defined(__ARM_ARCH_7S__)
# define KEY '_','_','A','R','M','_','A','R','C','H','_','7','S','_','_'
#endif

#define SIZE (sizeof(uid_t))
char info_size[] =  {'I', 'N', 'F', 'O', ':', 's','i','z','e','[',
  ('0' + ((SIZE / 10000)%10)),
  ('0' + ((SIZE / 1000)%10)),
  ('0' + ((SIZE / 100)%10)),
  ('0' + ((SIZE / 10)%10)),
  ('0' +  (SIZE    % 10)),
  ']',
#ifdef KEY
  ' ','k','e','y','[', KEY, ']',
#endif
  '\0'};

#ifdef __CLASSIC_C__
int main(argc, argv) int argc; char *argv[];
#else
int main(int argc, char *argv[])
#endif
{
  int require = 0;
  require += info_size[argc];
  (void)argv;
  return require;
}


Determining if the pthread_rwlock_t exist failed with the following output:
Change Dir: C:/msys32/home/buildbot/slave/monero-static-win32/build/build/release/CMakeFiles/CMakeTmp

Run Build Command:"C:/msys32/usr/bin/make.exe" "cmTC_8f625/fast"
make[1]: Entering directory '/home/buildbot/slave/monero-static-win32/build/build/release/CMakeFiles/CMakeTmp'
/usr/bin/make -f CMakeFiles/cmTC_8f625.dir/build.make CMakeFiles/cmTC_8f625.dir/build
make[2]: Entering directory '/home/buildbot/slave/monero-static-win32/build/build/release/CMakeFiles/CMakeTmp'
Building C object CMakeFiles/cmTC_8f625.dir/CheckSymbolExists.c.obj

/C/msys32/mingw32/bin/i686-w64-mingw32-gcc.exe    -o CMakeFiles/cmTC_8f625.dir/CheckSymbolExists.c.obj   -c /C/msys32/home/buildbot/slave/monero-static-win32/build/build/release/CMakeFiles/CMakeTmp/CheckSymbolExists.c
C:/msys32/home/buildbot/slave/monero-static-win32/build/build/release/CMakeFiles/CMakeTmp/CheckSymbolExists.c: In function 'main':

C:/msys32/home/buildbot/slave/monero-static-win32/build/build/release/CMakeFiles/CMakeTmp/CheckSymbolExists.c:8:19: error: expected expression before 'pthread_rwlock_t'

   return ((int*)(&pthread_rwlock_t))[argc];

                   ^~~~~~~~~~~~~~~~

make[2]: *** [CMakeFiles/cmTC_8f625.dir/build.make:66: CMakeFiles/cmTC_8f625.dir/CheckSymbolExists.c.obj] Error 1
make[2]: Leaving directory '/home/buildbot/slave/monero-static-win32/build/build/release/CMakeFiles/CMakeTmp'
make[1]: *** [Makefile:121: cmTC_8f625/fast] Error 2
make[1]: Leaving directory '/home/buildbot/slave/monero-static-win32/build/build/release/CMakeFiles/CMakeTmp'

File C:/msys32/home/buildbot/slave/monero-static-win32/build/build/release/CMakeFiles/CMakeTmp/CheckSymbolExists.c:
/* */
#include <pthread.h>

int main(int argc, char** argv)
{
  (void)argv;
#ifndef pthread_rwlock_t
  return ((int*)(&pthread_rwlock_t))[argc];
#else
  (void)argc;
  return 0;
#endif
}

Determining if the pthread_spinlock_t exist failed with the following output:
Change Dir: C:/msys32/home/buildbot/slave/monero-static-win32/build/build/release/CMakeFiles/CMakeTmp

Run Build Command:"C:/msys32/usr/bin/make.exe" "cmTC_4a171/fast"
make[1]: Entering directory '/home/buildbot/slave/monero-static-win32/build/build/release/CMakeFiles/CMakeTmp'
/usr/bin/make -f CMakeFiles/cmTC_4a171.dir/build.make CMakeFiles/cmTC_4a171.dir/build
make[2]: Entering directory '/home/buildbot/slave/monero-static-win32/build/build/release/CMakeFiles/CMakeTmp'
Building C object CMakeFiles/cmTC_4a171.dir/CheckSymbolExists.c.obj

/C/msys32/mingw32/bin/i686-w64-mingw32-gcc.exe    -o CMakeFiles/cmTC_4a171.dir/CheckSymbolExists.c.obj   -c /C/msys32/home/buildbot/slave/monero-static-win32/build/build/release/CMakeFiles/CMakeTmp/CheckSymbolExists.c
C:/msys32/home/buildbot/slave/monero-static-win32/build/build/release/CMakeFiles/CMakeTmp/CheckSymbolExists.c: In function 'main':

C:/msys32/home/buildbot/slave/monero-static-win32/build/build/release/CMakeFiles/CMakeTmp/CheckSymbolExists.c:8:19: error: expected expression before 'pthread_spinlock_t'

   return ((int*)(&pthread_spinlock_t))[argc];

                   ^~~~~~~~~~~~~~~~~~

make[2]: *** [CMakeFiles/cmTC_4a171.dir/build.make:66: CMakeFiles/cmTC_4a171.dir/CheckSymbolExists.c.obj] Error 1
make[2]: Leaving directory '/home/buildbot/slave/monero-static-win32/build/build/release/CMakeFiles/CMakeTmp'
make[1]: *** [Makefile:121: cmTC_4a171/fast] Error 2
make[1]: Leaving directory '/home/buildbot/slave/monero-static-win32/build/build/release/CMakeFiles/CMakeTmp'

File C:/msys32/home/buildbot/slave/monero-static-win32/build/build/release/CMakeFiles/CMakeTmp/CheckSymbolExists.c:
/* */
#include <pthread.h>

int main(int argc, char** argv)
{
  (void)argv;
#ifndef pthread_spinlock_t
  return ((int*)(&pthread_spinlock_t))[argc];
#else
  (void)argc;
  return 0;
#endif
}

Determining if the LIBRESSL_VERSION_TEXT exist failed with the following output:
Change Dir: C:/msys32/home/buildbot/slave/monero-static-win32/build/build/release/CMakeFiles/CMakeTmp

Run Build Command:"C:/msys32/usr/bin/make.exe" "cmTC_59265/fast"
make[1]: Entering directory '/home/buildbot/slave/monero-static-win32/build/build/release/CMakeFiles/CMakeTmp'
/usr/bin/make -f CMakeFiles/cmTC_59265.dir/build.make CMakeFiles/cmTC_59265.dir/build
make[2]: Entering directory '/home/buildbot/slave/monero-static-win32/build/build/release/CMakeFiles/CMakeTmp'
Building C object CMakeFiles/cmTC_59265.dir/CheckSymbolExists.c.obj

/C/msys32/mingw32/bin/i686-w64-mingw32-gcc.exe    -o CMakeFiles/cmTC_59265.dir/CheckSymbolExists.c.obj   -c /C/msys32/home/buildbot/slave/monero-static-win32/build/build/release/CMakeFiles/CMakeTmp/CheckSymbolExists.c
C:/msys32/home/buildbot/slave/monero-static-win32/build/build/release/CMakeFiles/CMakeTmp/CheckSymbolExists.c: In function 'main':

C:/msys32/home/buildbot/slave/monero-static-win32/build/build/release/CMakeFiles/CMakeTmp/CheckSymbolExists.c:8:19: error: 'LIBRESSL_VERSION_TEXT' undeclared (first use in this function); did you mean 'OPENSSL_VERSION_TEXT'?

   return ((int*)(&LIBRESSL_VERSION_TEXT))[argc];

                   ^~~~~~~~~~~~~~~~~~~~~

                   OPENSSL_VERSION_TEXT

C:/msys32/home/buildbot/slave/monero-static-win32/build/build/release/CMakeFiles/CMakeTmp/CheckSymbolExists.c:8:19: note: each undeclared identifier is reported only once for each function it appears in

make[2]: *** [CMakeFiles/cmTC_59265.dir/build.make:66: CMakeFiles/cmTC_59265.dir/CheckSymbolExists.c.obj] Error 1
make[2]: Leaving directory '/home/buildbot/slave/monero-static-win32/build/build/release/CMakeFiles/CMakeTmp'
make[1]: *** [Makefile:121: cmTC_59265/fast] Error 2
make[1]: Leaving directory '/home/buildbot/slave/monero-static-win32/build/build/release/CMakeFiles/CMakeTmp'

File C:/msys32/home/buildbot/slave/monero-static-win32/build/build/release/CMakeFiles/CMakeTmp/CheckSymbolExists.c:
/* */
#include <openssl/opensslv.h>

int main(int argc, char** argv)
{
  (void)argv;
#ifndef LIBRESSL_VERSION_TEXT
  return ((int*)(&LIBRESSL_VERSION_TEXT))[argc];
#else
  (void)argc;
  return 0;
#endif
}

Determining if the -Wl,-z,relro linker flag is supported failed with the following output:
Change Dir: C:/msys32/home/buildbot/slave/monero-static-win32/build/build/release/CMakeFiles/CMakeTmp

Run Build Command:"C:/msys32/usr/bin/make.exe" "cmTC_078b6/fast"
make[1]: Entering directory '/home/buildbot/slave/monero-static-win32/build/build/release/CMakeFiles/CMakeTmp'
/usr/bin/make -f CMakeFiles/cmTC_078b6.dir/build.make CMakeFiles/cmTC_078b6.dir/build
make[2]: Entering directory '/home/buildbot/slave/monero-static-win32/build/build/release/CMakeFiles/CMakeTmp'
Building C object CMakeFiles/cmTC_078b6.dir/CheckLinkerFlag.c.obj

/C/msys32/mingw32/bin/i686-w64-mingw32-gcc.exe   -Wl,-z,relro    -Wl,-z,relro -o CMakeFiles/cmTC_078b6.dir/CheckLinkerFlag.c.obj   -c /C/msys32/home/buildbot/slave/monero-static-win32/build/cmake/CheckLinkerFlag.c
Linking C executable cmTC_078b6.exe

/C/msys32/mingw32/bin/cmake.exe -E remove -f CMakeFiles/cmTC_078b6.dir/objects.a
ar cr CMakeFiles/cmTC_078b6.dir/objects.a "CMakeFiles/cmTC_078b6.dir/CheckLinkerFlag.c.obj" 
/C/msys32/mingw32/bin/i686-w64-mingw32-gcc.exe -Wl,-z,relro     -Wl,--whole-archive CMakeFiles/cmTC_078b6.dir/objects.a -Wl,--no-whole-archive  -o cmTC_078b6.exe -Wl,--major-image-version,0,--minor-image-version,0 -lkernel32 -luser32 -lgdi32 -lwinspool -lshell32 -lole32 -loleaut32 -luuid -lcomdlg32 -ladvapi32 
C:/msys32/mingw32/bin/../lib/gcc/i686-w64-mingw32/7.4.0/../../../../i686-w64-mingw32/bin/ld.exe: unrecognized option '-z'

C:/msys32/mingw32/bin/../lib/gcc/i686-w64-mingw32/7.4.0/../../../../i686-w64-mingw32/bin/ld.exe: use the --help option for usage information

collect2.exe: error: ld returned 1 exit status

make[2]: *** [CMakeFiles/cmTC_078b6.dir/build.make:88: cmTC_078b6.exe] Error 1
make[2]: Leaving directory '/home/buildbot/slave/monero-static-win32/build/build/release/CMakeFiles/CMakeTmp'
make[1]: *** [Makefile:121: cmTC_078b6/fast] Error 2
make[1]: Leaving directory '/home/buildbot/slave/monero-static-win32/build/build/release/CMakeFiles/CMakeTmp'


Determining if the -Wl,-z,now linker flag is supported failed with the following output:
Change Dir: C:/msys32/home/buildbot/slave/monero-static-win32/build/build/release/CMakeFiles/CMakeTmp

Run Build Command:"C:/msys32/usr/bin/make.exe" "cmTC_3b21c/fast"
make[1]: Entering directory '/home/buildbot/slave/monero-static-win32/build/build/release/CMakeFiles/CMakeTmp'
/usr/bin/make -f CMakeFiles/cmTC_3b21c.dir/build.make CMakeFiles/cmTC_3b21c.dir/build
make[2]: Entering directory '/home/buildbot/slave/monero-static-win32/build/build/release/CMakeFiles/CMakeTmp'
Building C object CMakeFiles/cmTC_3b21c.dir/CheckLinkerFlag.c.obj

/C/msys32/mingw32/bin/i686-w64-mingw32-gcc.exe   -Wl,-z,now    -Wl,-z,now -o CMakeFiles/cmTC_3b21c.dir/CheckLinkerFlag.c.obj   -c /C/msys32/home/buildbot/slave/monero-static-win32/build/cmake/CheckLinkerFlag.c
Linking C executable cmTC_3b21c.exe

/C/msys32/mingw32/bin/cmake.exe -E remove -f CMakeFiles/cmTC_3b21c.dir/objects.a
ar cr CMakeFiles/cmTC_3b21c.dir/objects.a "CMakeFiles/cmTC_3b21c.dir/CheckLinkerFlag.c.obj" 
/C/msys32/mingw32/bin/i686-w64-mingw32-gcc.exe -Wl,-z,now     -Wl,--whole-archive CMakeFiles/cmTC_3b21c.dir/objects.a -Wl,--no-whole-archive  -o cmTC_3b21c.exe -Wl,--major-image-version,0,--minor-image-version,0 -lkernel32 -luser32 -lgdi32 -lwinspool -lshell32 -lole32 -loleaut32 -luuid -lcomdlg32 -ladvapi32 
C:/msys32/mingw32/bin/../lib/gcc/i686-w64-mingw32/7.4.0/../../../../i686-w64-mingw32/bin/ld.exe: unrecognized option '-z'

C:/msys32/mingw32/bin/../lib/gcc/i686-w64-mingw32/7.4.0/../../../../i686-w64-mingw32/bin/ld.exe: use the --help option for usage information

collect2.exe: error: ld returned 1 exit status

make[2]: *** [CMakeFiles/cmTC_3b21c.dir/build.make:88: cmTC_3b21c.exe] Error 1
make[2]: Leaving directory '/home/buildbot/slave/monero-static-win32/build/build/release/CMakeFiles/CMakeTmp'
make[1]: *** [Makefile:121: cmTC_3b21c/fast] Error 2
make[1]: Leaving directory '/home/buildbot/slave/monero-static-win32/build/build/release/CMakeFiles/CMakeTmp'


Determining if the -Wl,-z,noexecstack linker flag is supported failed with the following output:
Change Dir: C:/msys32/home/buildbot/slave/monero-static-win32/build/build/release/CMakeFiles/CMakeTmp

Run Build Command:"C:/msys32/usr/bin/make.exe" "cmTC_dde33/fast"
make[1]: Entering directory '/home/buildbot/slave/monero-static-win32/build/build/release/CMakeFiles/CMakeTmp'
/usr/bin/make -f CMakeFiles/cmTC_dde33.dir/build.make CMakeFiles/cmTC_dde33.dir/build
make[2]: Entering directory '/home/buildbot/slave/monero-static-win32/build/build/release/CMakeFiles/CMakeTmp'
Building C object CMakeFiles/cmTC_dde33.dir/CheckLinkerFlag.c.obj

/C/msys32/mingw32/bin/i686-w64-mingw32-gcc.exe   -Wl,-z,noexecstack    -Wl,-z,noexecstack -o CMakeFiles/cmTC_dde33.dir/CheckLinkerFlag.c.obj   -c /C/msys32/home/buildbot/slave/monero-static-win32/build/cmake/CheckLinkerFlag.c
Linking C executable cmTC_dde33.exe

/C/msys32/mingw32/bin/cmake.exe -E remove -f CMakeFiles/cmTC_dde33.dir/objects.a
ar cr CMakeFiles/cmTC_dde33.dir/objects.a "CMakeFiles/cmTC_dde33.dir/CheckLinkerFlag.c.obj" 
/C/msys32/mingw32/bin/i686-w64-mingw32-gcc.exe -Wl,-z,noexecstack     -Wl,--whole-archive CMakeFiles/cmTC_dde33.dir/objects.a -Wl,--no-whole-archive  -o cmTC_dde33.exe -Wl,--major-image-version,0,--minor-image-version,0 -lkernel32 -luser32 -lgdi32 -lwinspool -lshell32 -lole32 -loleaut32 -luuid -lcomdlg32 -ladvapi32 
C:/msys32/mingw32/bin/../lib/gcc/i686-w64-mingw32/7.4.0/../../../../i686-w64-mingw32/bin/ld.exe: unrecognized option '-z'

C:/msys32/mingw32/bin/../lib/gcc/i686-w64-mingw32/7.4.0/../../../../i686-w64-mingw32/bin/ld.exe: use the --help option for usage information

collect2.exe: error: ld returned 1 exit status

make[2]: *** [CMakeFiles/cmTC_dde33.dir/build.make:88: cmTC_dde33.exe] Error 1
make[2]: Leaving directory '/home/buildbot/slave/monero-static-win32/build/build/release/CMakeFiles/CMakeTmp'
make[1]: *** [Makefile:121: cmTC_dde33/fast] Error 2
make[1]: Leaving directory '/home/buildbot/slave/monero-static-win32/build/build/release/CMakeFiles/CMakeTmp'


Determining if the -Wl,-z,noexecheap linker flag is supported failed with the following output:
Change Dir: C:/msys32/home/buildbot/slave/monero-static-win32/build/build/release/CMakeFiles/CMakeTmp

Run Build Command:"C:/msys32/usr/bin/make.exe" "cmTC_b76b2/fast"
make[1]: Entering directory '/home/buildbot/slave/monero-static-win32/build/build/release/CMakeFiles/CMakeTmp'
/usr/bin/make -f CMakeFiles/cmTC_b76b2.dir/build.make CMakeFiles/cmTC_b76b2.dir/build
make[2]: Entering directory '/home/buildbot/slave/monero-static-win32/build/build/release/CMakeFiles/CMakeTmp'
Building C object CMakeFiles/cmTC_b76b2.dir/CheckLinkerFlag.c.obj

/C/msys32/mingw32/bin/i686-w64-mingw32-gcc.exe   -Wl,-z,noexecheap    -Wl,-z,noexecheap -o CMakeFiles/cmTC_b76b2.dir/CheckLinkerFlag.c.obj   -c /C/msys32/home/buildbot/slave/monero-static-win32/build/cmake/CheckLinkerFlag.c
Linking C executable cmTC_b76b2.exe

/C/msys32/mingw32/bin/cmake.exe -E remove -f CMakeFiles/cmTC_b76b2.dir/objects.a
ar cr CMakeFiles/cmTC_b76b2.dir/objects.a "CMakeFiles/cmTC_b76b2.dir/CheckLinkerFlag.c.obj" 
/C/msys32/mingw32/bin/i686-w64-mingw32-gcc.exe -Wl,-z,noexecheap     -Wl,--whole-archive CMakeFiles/cmTC_b76b2.dir/objects.a -Wl,--no-whole-archive  -o cmTC_b76b2.exe -Wl,--major-image-version,0,--minor-image-version,0 -lkernel32 -luser32 -lgdi32 -lwinspool -lshell32 -lole32 -loleaut32 -luuid -lcomdlg32 -ladvapi32 
C:/msys32/mingw32/bin/../lib/gcc/i686-w64-mingw32/7.4.0/../../../../i686-w64-mingw32/bin/ld.exe: unrecognized option '-z'

C:/msys32/mingw32/bin/../lib/gcc/i686-w64-mingw32/7.4.0/../../../../i686-w64-mingw32/bin/ld.exe: use the --help option for usage information

collect2.exe: error: ld returned 1 exit status

make[2]: *** [CMakeFiles/cmTC_b76b2.dir/build.make:88: cmTC_b76b2.exe] Error 1
make[2]: Leaving directory '/home/buildbot/slave/monero-static-win32/build/build/release/CMakeFiles/CMakeTmp'
make[1]: *** [Makefile:121: cmTC_b76b2/fast] Error 2
make[1]: Leaving directory '/home/buildbot/slave/monero-static-win32/build/build/release/CMakeFiles/CMakeTmp'


Determining if the function rl_copy_text exists failed with the following output:
Change Dir: C:/msys32/home/buildbot/slave/monero-static-win32/build/build/release/CMakeFiles/CMakeTmp

Run Build Command:"C:/msys32/usr/bin/make.exe" "cmTC_744e5/fast"
make[1]: Entering directory '/home/buildbot/slave/monero-static-win32/build/build/release/CMakeFiles/CMakeTmp'
/usr/bin/make -f CMakeFiles/cmTC_744e5.dir/build.make CMakeFiles/cmTC_744e5.dir/build
make[2]: Entering directory '/home/buildbot/slave/monero-static-win32/build/build/release/CMakeFiles/CMakeTmp'
Building C object CMakeFiles/cmTC_744e5.dir/CheckFunctionExists.c.obj

/C/msys32/mingw32/bin/i686-w64-mingw32-gcc.exe   -maes -march=i686 -fno-strict-aliasing -std=c11 -D_GNU_SOURCE -m32 -DWIN32_LEAN_AND_MEAN  -Wall -Wextra -Wpointer-arith -Wundef -Wvla -Wwrite-strings -Wno-error=extra -Wno-error=deprecated-declarations -Wno-unused-parameter -Wno-unused-variable -Wno-error=unused-variable -Wno-error=undef -Wno-error=uninitialized -Wlogical-op -Wno-error=maybe-uninitialized -Wno-error=cpp -Wno-error=unused-value -Wno-error=unused-but-set-variable -Waggregate-return -Wnested-externs -Wold-style-definition -Wstrict-prototypes  -fPIC  -U_FORTIFY_SOURCE -D_FORTIFY_SOURCE=1 -Wformat -Wformat-security -mmitigate-rop -fno-strict-aliasing -DCHECK_FUNCTION_EXISTS=rl_copy_text   -o CMakeFiles/cmTC_744e5.dir/CheckFunctionExists.c.obj   -c /C/msys32/mingw32/share/cmake-3.12/Modules/CheckFunctionExists.c
Linking C executable cmTC_744e5.exe

/C/msys32/mingw32/bin/cmake.exe -E remove -f CMakeFiles/cmTC_744e5.dir/objects.a
ar cr CMakeFiles/cmTC_744e5.dir/objects.a "CMakeFiles/cmTC_744e5.dir/CheckFunctionExists.c.obj" 
/C/msys32/mingw32/bin/i686-w64-mingw32-gcc.exe  -maes -march=i686 -fno-strict-aliasing -std=c11 -D_GNU_SOURCE -m32 -DWIN32_LEAN_AND_MEAN  -Wall -Wextra -Wpointer-arith -Wundef -Wvla -Wwrite-strings -Wno-error=extra -Wno-error=deprecated-declarations -Wno-unused-parameter -Wno-unused-variable -Wno-error=unused-variable -Wno-error=undef -Wno-error=uninitialized -Wlogical-op -Wno-error=maybe-uninitialized -Wno-error=cpp -Wno-error=unused-value -Wno-error=unused-but-set-variable -Waggregate-return -Wnested-externs -Wold-style-definition -Wstrict-prototypes  -fPIC  -U_FORTIFY_SOURCE -D_FORTIFY_SOURCE=1 -Wformat -Wformat-security -mmitigate-rop -fno-strict-aliasing -DCHECK_FUNCTION_EXISTS=rl_copy_text    -Wl,--whole-archive CMakeFiles/cmTC_744e5.dir/objects.a -Wl,--no-whole-archive  -o cmTC_744e5.exe -Wl,--major-image-version,0,--minor-image-version,0 /C/msys32/mingw32/lib/libreadline.a -lkernel32 -luser32 -lgdi32 -lwinspool -lshell32 -lole32 -loleaut32 -luuid -lcomdlg32 -ladvapi32 
C:/msys32/mingw32/lib/libreadline.a(terminal.o):(.text+0x1a6): undefined reference to `tgetnum'

C:/msys32/mingw32/lib/libreadline.a(terminal.o):(.text+0x2df): undefined reference to `tgetnum'

C:/msys32/mingw32/lib/libreadline.a(terminal.o):(.text+0x757): undefined reference to `tgetent'

C:/msys32/mingw32/lib/libreadline.a(terminal.o):(.text+0x793): undefined reference to `tgetstr'

C:/msys32/mingw32/lib/libreadline.a(terminal.o):(.text+0x7e6): undefined reference to `tgetflag'

C:/msys32/mingw32/lib/libreadline.a(terminal.o):(.text+0x833): undefined reference to `tgetflag'

C:/msys32/mingw32/lib/libreadline.a(terminal.o):(.text+0x948): undefined reference to `tgetflag'

C:/msys32/mingw32/lib/libreadline.a(terminal.o):(.text+0xb2c): undefined reference to `tputs'

C:/msys32/mingw32/lib/libreadline.a(terminal.o):(.text+0xc17): undefined reference to `tputs'

C:/msys32/mingw32/lib/libreadline.a(terminal.o):(.text+0xc59): undefined reference to `tputs'

C:/msys32/mingw32/lib/libreadline.a(terminal.o):(.text+0xcb7): undefined reference to `tputs'

C:/msys32/mingw32/lib/libreadline.a(terminal.o):(.text+0xcf8): undefined reference to `tputs'

C:/msys32/mingw32/lib/libreadline.a(terminal.o):(.text+0xd4a): more undefined references to `tputs' follow

collect2.exe: error: ld returned 1 exit status

make[2]: *** [CMakeFiles/cmTC_744e5.dir/build.make:89: cmTC_744e5.exe] Error 1
make[2]: Leaving directory '/home/buildbot/slave/monero-static-win32/build/build/release/CMakeFiles/CMakeTmp'
make[1]: *** [Makefile:121: cmTC_744e5/fast] Error 2
make[1]: Leaving directory '/home/buildbot/slave/monero-static-win32/build/build/release/CMakeFiles/CMakeTmp'


Determining if the function rl_filename_completion_function exists failed with the following output:
Change Dir: C:/msys32/home/buildbot/slave/monero-static-win32/build/build/release/CMakeFiles/CMakeTmp

Run Build Command:"C:/msys32/usr/bin/make.exe" "cmTC_4781c/fast"
make[1]: Entering directory '/home/buildbot/slave/monero-static-win32/build/build/release/CMakeFiles/CMakeTmp'
/usr/bin/make -f CMakeFiles/cmTC_4781c.dir/build.make CMakeFiles/cmTC_4781c.dir/build
make[2]: Entering directory '/home/buildbot/slave/monero-static-win32/build/build/release/CMakeFiles/CMakeTmp'
Building C object CMakeFiles/cmTC_4781c.dir/CheckFunctionExists.c.obj

/C/msys32/mingw32/bin/i686-w64-mingw32-gcc.exe   -maes -march=i686 -fno-strict-aliasing -std=c11 -D_GNU_SOURCE -m32 -DWIN32_LEAN_AND_MEAN  -Wall -Wextra -Wpointer-arith -Wundef -Wvla -Wwrite-strings -Wno-error=extra -Wno-error=deprecated-declarations -Wno-unused-parameter -Wno-unused-variable -Wno-error=unused-variable -Wno-error=undef -Wno-error=uninitialized -Wlogical-op -Wno-error=maybe-uninitialized -Wno-error=cpp -Wno-error=unused-value -Wno-error=unused-but-set-variable -Waggregate-return -Wnested-externs -Wold-style-definition -Wstrict-prototypes  -fPIC  -U_FORTIFY_SOURCE -D_FORTIFY_SOURCE=1 -Wformat -Wformat-security -mmitigate-rop -fno-strict-aliasing -DCHECK_FUNCTION_EXISTS=rl_filename_completion_function   -o CMakeFiles/cmTC_4781c.dir/CheckFunctionExists.c.obj   -c /C/msys32/mingw32/share/cmake-3.12/Modules/CheckFunctionExists.c
Linking C executable cmTC_4781c.exe

/C/msys32/mingw32/bin/cmake.exe -E remove -f CMakeFiles/cmTC_4781c.dir/objects.a
ar cr CMakeFiles/cmTC_4781c.dir/objects.a "CMakeFiles/cmTC_4781c.dir/CheckFunctionExists.c.obj" 
/C/msys32/mingw32/bin/i686-w64-mingw32-gcc.exe  -maes -march=i686 -fno-strict-aliasing -std=c11 -D_GNU_SOURCE -m32 -DWIN32_LEAN_AND_MEAN  -Wall -Wextra -Wpointer-arith -Wundef -Wvla -Wwrite-strings -Wno-error=extra -Wno-error=deprecated-declarations -Wno-unused-parameter -Wno-unused-variable -Wno-error=unused-variable -Wno-error=undef -Wno-error=uninitialized -Wlogical-op -Wno-error=maybe-uninitialized -Wno-error=cpp -Wno-error=unused-value -Wno-error=unused-but-set-variable -Waggregate-return -Wnested-externs -Wold-style-definition -Wstrict-prototypes  -fPIC  -U_FORTIFY_SOURCE -D_FORTIFY_SOURCE=1 -Wformat -Wformat-security -mmitigate-rop -fno-strict-aliasing -DCHECK_FUNCTION_EXISTS=rl_filename_completion_function    -Wl,--whole-archive CMakeFiles/cmTC_4781c.dir/objects.a -Wl,--no-whole-archive  -o cmTC_4781c.exe -Wl,--major-image-version,0,--minor-image-version,0 /C/msys32/mingw32/lib/libreadline.a -lkernel32 -luser32 -lgdi32 -lwinspool -lshell32 -lole32 -loleaut32 -luuid -lcomdlg32 -ladvapi32 
C:/msys32/mingw32/lib/libreadline.a(display.o):(.text+0x99f): undefined reference to `tputs'

C:/msys32/mingw32/lib/libreadline.a(display.o):(.text+0xa9a): undefined reference to `tputs'

C:/msys32/mingw32/lib/libreadline.a(display.o):(.text+0xaec): undefined reference to `tputs'

C:/msys32/mingw32/lib/libreadline.a(display.o):(.text+0x12e4): undefined reference to `tputs'

C:/msys32/mingw32/lib/libreadline.a(display.o):(.text+0x18b3): undefined reference to `tputs'

C:/msys32/mingw32/lib/libreadline.a(display.o):(.text+0x29ad): more undefined references to `tputs' follow

C:/msys32/mingw32/lib/libreadline.a(terminal.o):(.text+0x1a6): undefined reference to `tgetnum'

C:/msys32/mingw32/lib/libreadline.a(terminal.o):(.text+0x2df): undefined reference to `tgetnum'

C:/msys32/mingw32/lib/libreadline.a(terminal.o):(.text+0x757): undefined reference to `tgetent'

C:/msys32/mingw32/lib/libreadline.a(terminal.o):(.text+0x793): undefined reference to `tgetstr'

C:/msys32/mingw32/lib/libreadline.a(terminal.o):(.text+0x7e6): undefined reference to `tgetflag'

C:/msys32/mingw32/lib/libreadline.a(terminal.o):(.text+0x833): undefined reference to `tgetflag'

C:/msys32/mingw32/lib/libreadline.a(terminal.o):(.text+0x948): undefined reference to `tgetflag'

C:/msys32/mingw32/lib/libreadline.a(terminal.o):(.text+0xb2c): undefined reference to `tputs'

C:/msys32/mingw32/lib/libreadline.a(terminal.o):(.text+0xc17): undefined reference to `tputs'

C:/msys32/mingw32/lib/libreadline.a(terminal.o):(.text+0xc59): undefined reference to `tputs'

C:/msys32/mingw32/lib/libreadline.a(terminal.o):(.text+0xcb7): undefined reference to `tputs'

C:/msys32/mingw32/lib/libreadline.a(terminal.o):(.text+0xcf8): undefined reference to `tputs'

C:/msys32/mingw32/lib/libreadline.a(terminal.o):(.text+0xd4a): more undefined references to `tputs' follow

collect2.exe: error: ld returned 1 exit status

make[2]: *** [CMakeFiles/cmTC_4781c.dir/build.make:89: cmTC_4781c.exe] Error 1
make[2]: Leaving directory '/home/buildbot/slave/monero-static-win32/build/build/release/CMakeFiles/CMakeTmp'
make[1]: *** [Makefile:121: cmTC_4781c/fast] Error 2
make[1]: Leaving directory '/home/buildbot/slave/monero-static-win32/build/build/release/CMakeFiles/CMakeTmp'