(view as text)
Determining if the function memset_s exists in the c failed with the following output:
Change Dir: C:/msys32/home/buildbot/slave/monero-static-win32/build/build/release/CMakeFiles/CMakeTmp

Run Build Command:"C:/msys32/usr/bin/make.exe" "cmTC_6129b/fast"
make[1]: Entering directory '/home/buildbot/slave/monero-static-win32/build/build/release/CMakeFiles/CMakeTmp'
/usr/bin/make -f CMakeFiles/cmTC_6129b.dir/build.make CMakeFiles/cmTC_6129b.dir/build
make[2]: Entering directory '/home/buildbot/slave/monero-static-win32/build/build/release/CMakeFiles/CMakeTmp'
Building C object CMakeFiles/cmTC_6129b.dir/CheckFunctionExists.c.obj

/C/msys32/mingw32/bin/i686-w64-mingw32-gcc.exe   -DCHECK_FUNCTION_EXISTS=memset_s   -o CMakeFiles/cmTC_6129b.dir/CheckFunctionExists.c.obj   -c /C/msys32/mingw32/share/cmake-3.12/Modules/CheckFunctionExists.c
Linking C executable cmTC_6129b.exe

/C/msys32/mingw32/bin/cmake.exe -E remove -f CMakeFiles/cmTC_6129b.dir/objects.a
ar cr CMakeFiles/cmTC_6129b.dir/objects.a "CMakeFiles/cmTC_6129b.dir/CheckFunctionExists.c.obj" 
/C/msys32/mingw32/bin/i686-w64-mingw32-gcc.exe  -DCHECK_FUNCTION_EXISTS=memset_s    -Wl,--whole-archive CMakeFiles/cmTC_6129b.dir/objects.a -Wl,--no-whole-archive  -o cmTC_6129b.exe -Wl,--major-image-version,0,--minor-image-version,0  -L/C/msys32/home/buildbot/slave/monero-static-win32/build/build/release/CMakeFiles/CMakeTmp/string.h -lc -lkernel32 -luser32 -lgdi32 -lwinspool -lshell32 -lole32 -loleaut32 -luuid -lcomdlg32 -ladvapi32 
C:/msys32/mingw32/bin/../lib/gcc/i686-w64-mingw32/7.4.0/../../../../i686-w64-mingw32/bin/ld.exe: cannot find -lc

collect2.exe: error: ld returned 1 exit status

make[2]: *** [CMakeFiles/cmTC_6129b.dir/build.make:88: cmTC_6129b.exe] Error 1
make[2]: Leaving directory '/home/buildbot/slave/monero-static-win32/build/build/release/CMakeFiles/CMakeTmp'
make[1]: *** [Makefile:121: cmTC_6129b/fast] Error 2
make[1]: Leaving directory '/home/buildbot/slave/monero-static-win32/build/build/release/CMakeFiles/CMakeTmp'


Determining if the function explicit_bzero exists in the c failed with the following output:
Change Dir: C:/msys32/home/buildbot/slave/monero-static-win32/build/build/release/CMakeFiles/CMakeTmp

Run Build Command:"C:/msys32/usr/bin/make.exe" "cmTC_59eaa/fast"
make[1]: Entering directory '/home/buildbot/slave/monero-static-win32/build/build/release/CMakeFiles/CMakeTmp'
/usr/bin/make -f CMakeFiles/cmTC_59eaa.dir/build.make CMakeFiles/cmTC_59eaa.dir/build
make[2]: Entering directory '/home/buildbot/slave/monero-static-win32/build/build/release/CMakeFiles/CMakeTmp'
Building C object CMakeFiles/cmTC_59eaa.dir/CheckFunctionExists.c.obj

/C/msys32/mingw32/bin/i686-w64-mingw32-gcc.exe   -DCHECK_FUNCTION_EXISTS=explicit_bzero   -o CMakeFiles/cmTC_59eaa.dir/CheckFunctionExists.c.obj   -c /C/msys32/mingw32/share/cmake-3.12/Modules/CheckFunctionExists.c
Linking C executable cmTC_59eaa.exe

/C/msys32/mingw32/bin/cmake.exe -E remove -f CMakeFiles/cmTC_59eaa.dir/objects.a
ar cr CMakeFiles/cmTC_59eaa.dir/objects.a "CMakeFiles/cmTC_59eaa.dir/CheckFunctionExists.c.obj" 
/C/msys32/mingw32/bin/i686-w64-mingw32-gcc.exe  -DCHECK_FUNCTION_EXISTS=explicit_bzero    -Wl,--whole-archive CMakeFiles/cmTC_59eaa.dir/objects.a -Wl,--no-whole-archive  -o cmTC_59eaa.exe -Wl,--major-image-version,0,--minor-image-version,0  -L/C/msys32/home/buildbot/slave/monero-static-win32/build/build/release/CMakeFiles/CMakeTmp/strings.h -lc -lkernel32 -luser32 -lgdi32 -lwinspool -lshell32 -lole32 -loleaut32 -luuid -lcomdlg32 -ladvapi32 
C:/msys32/mingw32/bin/../lib/gcc/i686-w64-mingw32/7.4.0/../../../../i686-w64-mingw32/bin/ld.exe: cannot find -lc

collect2.exe: error: ld returned 1 exit status

make[2]: *** [CMakeFiles/cmTC_59eaa.dir/build.make:88: cmTC_59eaa.exe] Error 1
make[2]: Leaving directory '/home/buildbot/slave/monero-static-win32/build/build/release/CMakeFiles/CMakeTmp'
make[1]: *** [Makefile:121: cmTC_59eaa/fast] Error 2
make[1]: Leaving directory '/home/buildbot/slave/monero-static-win32/build/build/release/CMakeFiles/CMakeTmp'


Determining if the function strptime exists failed with the following output:
Change Dir: C:/msys32/home/buildbot/slave/monero-static-win32/build/build/release/CMakeFiles/CMakeTmp

Run Build Command:"C:/msys32/usr/bin/make.exe" "cmTC_4acae/fast"
make[1]: Entering directory '/home/buildbot/slave/monero-static-win32/build/build/release/CMakeFiles/CMakeTmp'
/usr/bin/make -f CMakeFiles/cmTC_4acae.dir/build.make CMakeFiles/cmTC_4acae.dir/build
make[2]: Entering directory '/home/buildbot/slave/monero-static-win32/build/build/release/CMakeFiles/CMakeTmp'
Building C object CMakeFiles/cmTC_4acae.dir/CheckFunctionExists.c.obj

/C/msys32/mingw32/bin/i686-w64-mingw32-gcc.exe   -DCHECK_FUNCTION_EXISTS=strptime   -o CMakeFiles/cmTC_4acae.dir/CheckFunctionExists.c.obj   -c /C/msys32/mingw32/share/cmake-3.12/Modules/CheckFunctionExists.c
Linking C executable cmTC_4acae.exe

/C/msys32/mingw32/bin/cmake.exe -E remove -f CMakeFiles/cmTC_4acae.dir/objects.a
ar cr CMakeFiles/cmTC_4acae.dir/objects.a "CMakeFiles/cmTC_4acae.dir/CheckFunctionExists.c.obj" 
/C/msys32/mingw32/bin/i686-w64-mingw32-gcc.exe  -DCHECK_FUNCTION_EXISTS=strptime    -Wl,--whole-archive CMakeFiles/cmTC_4acae.dir/objects.a -Wl,--no-whole-archive  -o cmTC_4acae.exe -Wl,--major-image-version,0,--minor-image-version,0 -lkernel32 -luser32 -lgdi32 -lwinspool -lshell32 -lole32 -loleaut32 -luuid -lcomdlg32 -ladvapi32 
CMakeFiles/cmTC_4acae.dir/objects.a(CheckFunctionExists.c.obj):CheckFunctionExists.c:(.text+0xc): undefined reference to `strptime'

collect2.exe: error: ld returned 1 exit status

make[2]: *** [CMakeFiles/cmTC_4acae.dir/build.make:88: cmTC_4acae.exe] Error 1
make[2]: Leaving directory '/home/buildbot/slave/monero-static-win32/build/build/release/CMakeFiles/CMakeTmp'
make[1]: *** [Makefile:121: cmTC_4acae/fast] Error 2
make[1]: Leaving directory '/home/buildbot/slave/monero-static-win32/build/build/release/CMakeFiles/CMakeTmp'


Determining if the include file arpa/inet.h exists failed with the following output:
Change Dir: C:/msys32/home/buildbot/slave/monero-static-win32/build/build/release/CMakeFiles/CMakeTmp

Run Build Command:"C:/msys32/usr/bin/make.exe" "cmTC_e5e25/fast"
make[1]: Entering directory '/home/buildbot/slave/monero-static-win32/build/build/release/CMakeFiles/CMakeTmp'
/usr/bin/make -f CMakeFiles/cmTC_e5e25.dir/build.make CMakeFiles/cmTC_e5e25.dir/build
make[2]: Entering directory '/home/buildbot/slave/monero-static-win32/build/build/release/CMakeFiles/CMakeTmp'
Building C object CMakeFiles/cmTC_e5e25.dir/CheckIncludeFile.c.obj

/C/msys32/mingw32/bin/i686-w64-mingw32-gcc.exe    -o CMakeFiles/cmTC_e5e25.dir/CheckIncludeFile.c.obj   -c /C/msys32/home/buildbot/slave/monero-static-win32/build/build/release/CMakeFiles/CMakeTmp/CheckIncludeFile.c
C:/msys32/home/buildbot/slave/monero-static-win32/build/build/release/CMakeFiles/CMakeTmp/CheckIncludeFile.c:1:10: fatal error: arpa/inet.h: No such file or directory

 #include <arpa/inet.h>

          ^~~~~~~~~~~~~

compilation terminated.

make[2]: *** [CMakeFiles/cmTC_e5e25.dir/build.make:66: CMakeFiles/cmTC_e5e25.dir/CheckIncludeFile.c.obj] Error 1
make[2]: Leaving directory '/home/buildbot/slave/monero-static-win32/build/build/release/CMakeFiles/CMakeTmp'
make[1]: *** [Makefile:121: cmTC_e5e25/fast] Error 2
make[1]: Leaving directory '/home/buildbot/slave/monero-static-win32/build/build/release/CMakeFiles/CMakeTmp'


Determining if the include file endian.h exists failed with the following output:
Change Dir: C:/msys32/home/buildbot/slave/monero-static-win32/build/build/release/CMakeFiles/CMakeTmp

Run Build Command:"C:/msys32/usr/bin/make.exe" "cmTC_377ab/fast"
make[1]: Entering directory '/home/buildbot/slave/monero-static-win32/build/build/release/CMakeFiles/CMakeTmp'
/usr/bin/make -f CMakeFiles/cmTC_377ab.dir/build.make CMakeFiles/cmTC_377ab.dir/build
make[2]: Entering directory '/home/buildbot/slave/monero-static-win32/build/build/release/CMakeFiles/CMakeTmp'
Building C object CMakeFiles/cmTC_377ab.dir/CheckIncludeFile.c.obj

/C/msys32/mingw32/bin/i686-w64-mingw32-gcc.exe    -o CMakeFiles/cmTC_377ab.dir/CheckIncludeFile.c.obj   -c /C/msys32/home/buildbot/slave/monero-static-win32/build/build/release/CMakeFiles/CMakeTmp/CheckIncludeFile.c
C:/msys32/home/buildbot/slave/monero-static-win32/build/build/release/CMakeFiles/CMakeTmp/CheckIncludeFile.c:1:10: fatal error: endian.h: No such file or directory

 #include <endian.h>

          ^~~~~~~~~~

compilation terminated.

make[2]: *** [CMakeFiles/cmTC_377ab.dir/build.make:66: CMakeFiles/cmTC_377ab.dir/CheckIncludeFile.c.obj] Error 1
make[2]: Leaving directory '/home/buildbot/slave/monero-static-win32/build/build/release/CMakeFiles/CMakeTmp'
make[1]: *** [Makefile:121: cmTC_377ab/fast] Error 2
make[1]: Leaving directory '/home/buildbot/slave/monero-static-win32/build/build/release/CMakeFiles/CMakeTmp'


Determining if the include file dlfcn.h exists failed with the following output:
Change Dir: C:/msys32/home/buildbot/slave/monero-static-win32/build/build/release/CMakeFiles/CMakeTmp

Run Build Command:"C:/msys32/usr/bin/make.exe" "cmTC_6fef5/fast"
make[1]: Entering directory '/home/buildbot/slave/monero-static-win32/build/build/release/CMakeFiles/CMakeTmp'
/usr/bin/make -f CMakeFiles/cmTC_6fef5.dir/build.make CMakeFiles/cmTC_6fef5.dir/build
make[2]: Entering directory '/home/buildbot/slave/monero-static-win32/build/build/release/CMakeFiles/CMakeTmp'
Building C object CMakeFiles/cmTC_6fef5.dir/CheckIncludeFile.c.obj

/C/msys32/mingw32/bin/i686-w64-mingw32-gcc.exe    -o CMakeFiles/cmTC_6fef5.dir/CheckIncludeFile.c.obj   -c /C/msys32/home/buildbot/slave/monero-static-win32/build/build/release/CMakeFiles/CMakeTmp/CheckIncludeFile.c
C:/msys32/home/buildbot/slave/monero-static-win32/build/build/release/CMakeFiles/CMakeTmp/CheckIncludeFile.c:1:10: fatal error: dlfcn.h: No such file or directory

 #include <dlfcn.h>

          ^~~~~~~~~

compilation terminated.

make[2]: *** [CMakeFiles/cmTC_6fef5.dir/build.make:66: CMakeFiles/cmTC_6fef5.dir/CheckIncludeFile.c.obj] Error 1
make[2]: Leaving directory '/home/buildbot/slave/monero-static-win32/build/build/release/CMakeFiles/CMakeTmp'
make[1]: *** [Makefile:121: cmTC_6fef5/fast] Error 2
make[1]: Leaving directory '/home/buildbot/slave/monero-static-win32/build/build/release/CMakeFiles/CMakeTmp'


Determining if the include file event.h exists failed with the following output:
Change Dir: C:/msys32/home/buildbot/slave/monero-static-win32/build/build/release/CMakeFiles/CMakeTmp

Run Build Command:"C:/msys32/usr/bin/make.exe" "cmTC_ed180/fast"
make[1]: Entering directory '/home/buildbot/slave/monero-static-win32/build/build/release/CMakeFiles/CMakeTmp'
/usr/bin/make -f CMakeFiles/cmTC_ed180.dir/build.make CMakeFiles/cmTC_ed180.dir/build
make[2]: Entering directory '/home/buildbot/slave/monero-static-win32/build/build/release/CMakeFiles/CMakeTmp'
Building C object CMakeFiles/cmTC_ed180.dir/CheckIncludeFile.c.obj

/C/msys32/mingw32/bin/i686-w64-mingw32-gcc.exe    -o CMakeFiles/cmTC_ed180.dir/CheckIncludeFile.c.obj   -c /C/msys32/home/buildbot/slave/monero-static-win32/build/build/release/CMakeFiles/CMakeTmp/CheckIncludeFile.c
C:/msys32/home/buildbot/slave/monero-static-win32/build/build/release/CMakeFiles/CMakeTmp/CheckIncludeFile.c:1:10: fatal error: event.h: No such file or directory

 #include <event.h>

          ^~~~~~~~~

compilation terminated.

make[2]: *** [CMakeFiles/cmTC_ed180.dir/build.make:66: CMakeFiles/cmTC_ed180.dir/CheckIncludeFile.c.obj] Error 1
make[2]: Leaving directory '/home/buildbot/slave/monero-static-win32/build/build/release/CMakeFiles/CMakeTmp'
make[1]: *** [Makefile:121: cmTC_ed180/fast] Error 2
make[1]: Leaving directory '/home/buildbot/slave/monero-static-win32/build/build/release/CMakeFiles/CMakeTmp'


Determining if the include file glob.h exists failed with the following output:
Change Dir: C:/msys32/home/buildbot/slave/monero-static-win32/build/build/release/CMakeFiles/CMakeTmp

Run Build Command:"C:/msys32/usr/bin/make.exe" "cmTC_00c8e/fast"
make[1]: Entering directory '/home/buildbot/slave/monero-static-win32/build/build/release/CMakeFiles/CMakeTmp'
/usr/bin/make -f CMakeFiles/cmTC_00c8e.dir/build.make CMakeFiles/cmTC_00c8e.dir/build
make[2]: Entering directory '/home/buildbot/slave/monero-static-win32/build/build/release/CMakeFiles/CMakeTmp'
Building C object CMakeFiles/cmTC_00c8e.dir/CheckIncludeFile.c.obj

/C/msys32/mingw32/bin/i686-w64-mingw32-gcc.exe    -o CMakeFiles/cmTC_00c8e.dir/CheckIncludeFile.c.obj   -c /C/msys32/home/buildbot/slave/monero-static-win32/build/build/release/CMakeFiles/CMakeTmp/CheckIncludeFile.c
C:/msys32/home/buildbot/slave/monero-static-win32/build/build/release/CMakeFiles/CMakeTmp/CheckIncludeFile.c:1:10: fatal error: glob.h: No such file or directory

 #include <glob.h>

          ^~~~~~~~

compilation terminated.

make[2]: *** [CMakeFiles/cmTC_00c8e.dir/build.make:66: CMakeFiles/cmTC_00c8e.dir/CheckIncludeFile.c.obj] Error 1
make[2]: Leaving directory '/home/buildbot/slave/monero-static-win32/build/build/release/CMakeFiles/CMakeTmp'
make[1]: *** [Makefile:121: cmTC_00c8e/fast] Error 2
make[1]: Leaving directory '/home/buildbot/slave/monero-static-win32/build/build/release/CMakeFiles/CMakeTmp'


Determining if the include file grp.h exists failed with the following output:
Change Dir: C:/msys32/home/buildbot/slave/monero-static-win32/build/build/release/CMakeFiles/CMakeTmp

Run Build Command:"C:/msys32/usr/bin/make.exe" "cmTC_b26af/fast"
make[1]: Entering directory '/home/buildbot/slave/monero-static-win32/build/build/release/CMakeFiles/CMakeTmp'
/usr/bin/make -f CMakeFiles/cmTC_b26af.dir/build.make CMakeFiles/cmTC_b26af.dir/build
make[2]: Entering directory '/home/buildbot/slave/monero-static-win32/build/build/release/CMakeFiles/CMakeTmp'
Building C object CMakeFiles/cmTC_b26af.dir/CheckIncludeFile.c.obj

/C/msys32/mingw32/bin/i686-w64-mingw32-gcc.exe    -o CMakeFiles/cmTC_b26af.dir/CheckIncludeFile.c.obj   -c /C/msys32/home/buildbot/slave/monero-static-win32/build/build/release/CMakeFiles/CMakeTmp/CheckIncludeFile.c
C:/msys32/home/buildbot/slave/monero-static-win32/build/build/release/CMakeFiles/CMakeTmp/CheckIncludeFile.c:1:10: fatal error: grp.h: No such file or directory

 #include <grp.h>

          ^~~~~~~

compilation terminated.

make[2]: *** [CMakeFiles/cmTC_b26af.dir/build.make:66: CMakeFiles/cmTC_b26af.dir/CheckIncludeFile.c.obj] Error 1
make[2]: Leaving directory '/home/buildbot/slave/monero-static-win32/build/build/release/CMakeFiles/CMakeTmp'
make[1]: *** [Makefile:121: cmTC_b26af/fast] Error 2
make[1]: Leaving directory '/home/buildbot/slave/monero-static-win32/build/build/release/CMakeFiles/CMakeTmp'


Determining if the include file login_cap.h exists failed with the following output:
Change Dir: C:/msys32/home/buildbot/slave/monero-static-win32/build/build/release/CMakeFiles/CMakeTmp

Run Build Command:"C:/msys32/usr/bin/make.exe" "cmTC_a58b9/fast"
make[1]: Entering directory '/home/buildbot/slave/monero-static-win32/build/build/release/CMakeFiles/CMakeTmp'
/usr/bin/make -f CMakeFiles/cmTC_a58b9.dir/build.make CMakeFiles/cmTC_a58b9.dir/build
make[2]: Entering directory '/home/buildbot/slave/monero-static-win32/build/build/release/CMakeFiles/CMakeTmp'
Building C object CMakeFiles/cmTC_a58b9.dir/CheckIncludeFile.c.obj

/C/msys32/mingw32/bin/i686-w64-mingw32-gcc.exe    -o CMakeFiles/cmTC_a58b9.dir/CheckIncludeFile.c.obj   -c /C/msys32/home/buildbot/slave/monero-static-win32/build/build/release/CMakeFiles/CMakeTmp/CheckIncludeFile.c
C:/msys32/home/buildbot/slave/monero-static-win32/build/build/release/CMakeFiles/CMakeTmp/CheckIncludeFile.c:1:10: fatal error: login_cap.h: No such file or directory

 #include <login_cap.h>

          ^~~~~~~~~~~~~

compilation terminated.

make[2]: *** [CMakeFiles/cmTC_a58b9.dir/build.make:66: CMakeFiles/cmTC_a58b9.dir/CheckIncludeFile.c.obj] Error 1
make[2]: Leaving directory '/home/buildbot/slave/monero-static-win32/build/build/release/CMakeFiles/CMakeTmp'
make[1]: *** [Makefile:121: cmTC_a58b9/fast] Error 2
make[1]: Leaving directory '/home/buildbot/slave/monero-static-win32/build/build/release/CMakeFiles/CMakeTmp'


Determining if the include file netdb.h exists failed with the following output:
Change Dir: C:/msys32/home/buildbot/slave/monero-static-win32/build/build/release/CMakeFiles/CMakeTmp

Run Build Command:"C:/msys32/usr/bin/make.exe" "cmTC_5ab55/fast"
make[1]: Entering directory '/home/buildbot/slave/monero-static-win32/build/build/release/CMakeFiles/CMakeTmp'
/usr/bin/make -f CMakeFiles/cmTC_5ab55.dir/build.make CMakeFiles/cmTC_5ab55.dir/build
make[2]: Entering directory '/home/buildbot/slave/monero-static-win32/build/build/release/CMakeFiles/CMakeTmp'
Building C object CMakeFiles/cmTC_5ab55.dir/CheckIncludeFile.c.obj

/C/msys32/mingw32/bin/i686-w64-mingw32-gcc.exe    -o CMakeFiles/cmTC_5ab55.dir/CheckIncludeFile.c.obj   -c /C/msys32/home/buildbot/slave/monero-static-win32/build/build/release/CMakeFiles/CMakeTmp/CheckIncludeFile.c
C:/msys32/home/buildbot/slave/monero-static-win32/build/build/release/CMakeFiles/CMakeTmp/CheckIncludeFile.c:1:10: fatal error: netdb.h: No such file or directory

 #include <netdb.h>

          ^~~~~~~~~

compilation terminated.

make[2]: *** [CMakeFiles/cmTC_5ab55.dir/build.make:66: CMakeFiles/cmTC_5ab55.dir/CheckIncludeFile.c.obj] Error 1
make[2]: Leaving directory '/home/buildbot/slave/monero-static-win32/build/build/release/CMakeFiles/CMakeTmp'
make[1]: *** [Makefile:121: cmTC_5ab55/fast] Error 2
make[1]: Leaving directory '/home/buildbot/slave/monero-static-win32/build/build/release/CMakeFiles/CMakeTmp'


Determining if the include file netinet/in.h exists failed with the following output:
Change Dir: C:/msys32/home/buildbot/slave/monero-static-win32/build/build/release/CMakeFiles/CMakeTmp

Run Build Command:"C:/msys32/usr/bin/make.exe" "cmTC_75fa7/fast"
make[1]: Entering directory '/home/buildbot/slave/monero-static-win32/build/build/release/CMakeFiles/CMakeTmp'
/usr/bin/make -f CMakeFiles/cmTC_75fa7.dir/build.make CMakeFiles/cmTC_75fa7.dir/build
make[2]: Entering directory '/home/buildbot/slave/monero-static-win32/build/build/release/CMakeFiles/CMakeTmp'
Building C object CMakeFiles/cmTC_75fa7.dir/CheckIncludeFile.c.obj

/C/msys32/mingw32/bin/i686-w64-mingw32-gcc.exe    -o CMakeFiles/cmTC_75fa7.dir/CheckIncludeFile.c.obj   -c /C/msys32/home/buildbot/slave/monero-static-win32/build/build/release/CMakeFiles/CMakeTmp/CheckIncludeFile.c
C:/msys32/home/buildbot/slave/monero-static-win32/build/build/release/CMakeFiles/CMakeTmp/CheckIncludeFile.c:1:10: fatal error: netinet/in.h: No such file or directory

 #include <netinet/in.h>

          ^~~~~~~~~~~~~~

compilation terminated.

make[2]: *** [CMakeFiles/cmTC_75fa7.dir/build.make:66: CMakeFiles/cmTC_75fa7.dir/CheckIncludeFile.c.obj] Error 1
make[2]: Leaving directory '/home/buildbot/slave/monero-static-win32/build/build/release/CMakeFiles/CMakeTmp'
make[1]: *** [Makefile:121: cmTC_75fa7/fast] Error 2
make[1]: Leaving directory '/home/buildbot/slave/monero-static-win32/build/build/release/CMakeFiles/CMakeTmp'


Determining if the include file pwd.h exists failed with the following output:
Change Dir: C:/msys32/home/buildbot/slave/monero-static-win32/build/build/release/CMakeFiles/CMakeTmp

Run Build Command:"C:/msys32/usr/bin/make.exe" "cmTC_aa70d/fast"
make[1]: Entering directory '/home/buildbot/slave/monero-static-win32/build/build/release/CMakeFiles/CMakeTmp'
/usr/bin/make -f CMakeFiles/cmTC_aa70d.dir/build.make CMakeFiles/cmTC_aa70d.dir/build
make[2]: Entering directory '/home/buildbot/slave/monero-static-win32/build/build/release/CMakeFiles/CMakeTmp'
Building C object CMakeFiles/cmTC_aa70d.dir/CheckIncludeFile.c.obj

/C/msys32/mingw32/bin/i686-w64-mingw32-gcc.exe    -o CMakeFiles/cmTC_aa70d.dir/CheckIncludeFile.c.obj   -c /C/msys32/home/buildbot/slave/monero-static-win32/build/build/release/CMakeFiles/CMakeTmp/CheckIncludeFile.c
C:/msys32/home/buildbot/slave/monero-static-win32/build/build/release/CMakeFiles/CMakeTmp/CheckIncludeFile.c:1:10: fatal error: pwd.h: No such file or directory

 #include <pwd.h>

          ^~~~~~~

compilation terminated.

make[2]: *** [CMakeFiles/cmTC_aa70d.dir/build.make:66: CMakeFiles/cmTC_aa70d.dir/CheckIncludeFile.c.obj] Error 1
make[2]: Leaving directory '/home/buildbot/slave/monero-static-win32/build/build/release/CMakeFiles/CMakeTmp'
make[1]: *** [Makefile:121: cmTC_aa70d/fast] Error 2
make[1]: Leaving directory '/home/buildbot/slave/monero-static-win32/build/build/release/CMakeFiles/CMakeTmp'


Determining if the include file sys/resource.h exists failed with the following output:
Change Dir: C:/msys32/home/buildbot/slave/monero-static-win32/build/build/release/CMakeFiles/CMakeTmp

Run Build Command:"C:/msys32/usr/bin/make.exe" "cmTC_621e7/fast"
make[1]: Entering directory '/home/buildbot/slave/monero-static-win32/build/build/release/CMakeFiles/CMakeTmp'
/usr/bin/make -f CMakeFiles/cmTC_621e7.dir/build.make CMakeFiles/cmTC_621e7.dir/build
make[2]: Entering directory '/home/buildbot/slave/monero-static-win32/build/build/release/CMakeFiles/CMakeTmp'
Building C object CMakeFiles/cmTC_621e7.dir/CheckIncludeFile.c.obj

/C/msys32/mingw32/bin/i686-w64-mingw32-gcc.exe    -o CMakeFiles/cmTC_621e7.dir/CheckIncludeFile.c.obj   -c /C/msys32/home/buildbot/slave/monero-static-win32/build/build/release/CMakeFiles/CMakeTmp/CheckIncludeFile.c
C:/msys32/home/buildbot/slave/monero-static-win32/build/build/release/CMakeFiles/CMakeTmp/CheckIncludeFile.c:1:10: fatal error: sys/resource.h: No such file or directory

 #include <sys/resource.h>

          ^~~~~~~~~~~~~~~~

compilation terminated.

make[2]: *** [CMakeFiles/cmTC_621e7.dir/build.make:66: CMakeFiles/cmTC_621e7.dir/CheckIncludeFile.c.obj] Error 1
make[2]: Leaving directory '/home/buildbot/slave/monero-static-win32/build/build/release/CMakeFiles/CMakeTmp'
make[1]: *** [Makefile:121: cmTC_621e7/fast] Error 2
make[1]: Leaving directory '/home/buildbot/slave/monero-static-win32/build/build/release/CMakeFiles/CMakeTmp'


Determining if the include file sys/sha2.h exists failed with the following output:
Change Dir: C:/msys32/home/buildbot/slave/monero-static-win32/build/build/release/CMakeFiles/CMakeTmp

Run Build Command:"C:/msys32/usr/bin/make.exe" "cmTC_87c15/fast"
make[1]: Entering directory '/home/buildbot/slave/monero-static-win32/build/build/release/CMakeFiles/CMakeTmp'
/usr/bin/make -f CMakeFiles/cmTC_87c15.dir/build.make CMakeFiles/cmTC_87c15.dir/build
make[2]: Entering directory '/home/buildbot/slave/monero-static-win32/build/build/release/CMakeFiles/CMakeTmp'
Building C object CMakeFiles/cmTC_87c15.dir/CheckIncludeFile.c.obj

/C/msys32/mingw32/bin/i686-w64-mingw32-gcc.exe    -o CMakeFiles/cmTC_87c15.dir/CheckIncludeFile.c.obj   -c /C/msys32/home/buildbot/slave/monero-static-win32/build/build/release/CMakeFiles/CMakeTmp/CheckIncludeFile.c
C:/msys32/home/buildbot/slave/monero-static-win32/build/build/release/CMakeFiles/CMakeTmp/CheckIncludeFile.c:1:10: fatal error: sys/sha2.h: No such file or directory

 #include <sys/sha2.h>

          ^~~~~~~~~~~~

compilation terminated.

make[2]: *** [CMakeFiles/cmTC_87c15.dir/build.make:66: CMakeFiles/cmTC_87c15.dir/CheckIncludeFile.c.obj] Error 1
make[2]: Leaving directory '/home/buildbot/slave/monero-static-win32/build/build/release/CMakeFiles/CMakeTmp'
make[1]: *** [Makefile:121: cmTC_87c15/fast] Error 2
make[1]: Leaving directory '/home/buildbot/slave/monero-static-win32/build/build/release/CMakeFiles/CMakeTmp'


Determining if the include file sys/socket.h exists failed with the following output:
Change Dir: C:/msys32/home/buildbot/slave/monero-static-win32/build/build/release/CMakeFiles/CMakeTmp

Run Build Command:"C:/msys32/usr/bin/make.exe" "cmTC_3380b/fast"
make[1]: Entering directory '/home/buildbot/slave/monero-static-win32/build/build/release/CMakeFiles/CMakeTmp'
/usr/bin/make -f CMakeFiles/cmTC_3380b.dir/build.make CMakeFiles/cmTC_3380b.dir/build
make[2]: Entering directory '/home/buildbot/slave/monero-static-win32/build/build/release/CMakeFiles/CMakeTmp'
Building C object CMakeFiles/cmTC_3380b.dir/CheckIncludeFile.c.obj

/C/msys32/mingw32/bin/i686-w64-mingw32-gcc.exe    -o CMakeFiles/cmTC_3380b.dir/CheckIncludeFile.c.obj   -c /C/msys32/home/buildbot/slave/monero-static-win32/build/build/release/CMakeFiles/CMakeTmp/CheckIncludeFile.c
C:/msys32/home/buildbot/slave/monero-static-win32/build/build/release/CMakeFiles/CMakeTmp/CheckIncludeFile.c:1:10: fatal error: sys/socket.h: No such file or directory

 #include <sys/socket.h>

          ^~~~~~~~~~~~~~

compilation terminated.

make[2]: *** [CMakeFiles/cmTC_3380b.dir/build.make:66: CMakeFiles/cmTC_3380b.dir/CheckIncludeFile.c.obj] Error 1
make[2]: Leaving directory '/home/buildbot/slave/monero-static-win32/build/build/release/CMakeFiles/CMakeTmp'
make[1]: *** [Makefile:121: cmTC_3380b/fast] Error 2
make[1]: Leaving directory '/home/buildbot/slave/monero-static-win32/build/build/release/CMakeFiles/CMakeTmp'


Determining if the include file sys/sysctl.h exists failed with the following output:
Change Dir: C:/msys32/home/buildbot/slave/monero-static-win32/build/build/release/CMakeFiles/CMakeTmp

Run Build Command:"C:/msys32/usr/bin/make.exe" "cmTC_0d35a/fast"
make[1]: Entering directory '/home/buildbot/slave/monero-static-win32/build/build/release/CMakeFiles/CMakeTmp'
/usr/bin/make -f CMakeFiles/cmTC_0d35a.dir/build.make CMakeFiles/cmTC_0d35a.dir/build
make[2]: Entering directory '/home/buildbot/slave/monero-static-win32/build/build/release/CMakeFiles/CMakeTmp'
Building C object CMakeFiles/cmTC_0d35a.dir/CheckIncludeFile.c.obj

/C/msys32/mingw32/bin/i686-w64-mingw32-gcc.exe    -o CMakeFiles/cmTC_0d35a.dir/CheckIncludeFile.c.obj   -c /C/msys32/home/buildbot/slave/monero-static-win32/build/build/release/CMakeFiles/CMakeTmp/CheckIncludeFile.c
C:/msys32/home/buildbot/slave/monero-static-win32/build/build/release/CMakeFiles/CMakeTmp/CheckIncludeFile.c:1:10: fatal error: sys/sysctl.h: No such file or directory

 #include <sys/sysctl.h>

          ^~~~~~~~~~~~~~

compilation terminated.

make[2]: *** [CMakeFiles/cmTC_0d35a.dir/build.make:66: CMakeFiles/cmTC_0d35a.dir/CheckIncludeFile.c.obj] Error 1
make[2]: Leaving directory '/home/buildbot/slave/monero-static-win32/build/build/release/CMakeFiles/CMakeTmp'
make[1]: *** [Makefile:121: cmTC_0d35a/fast] Error 2
make[1]: Leaving directory '/home/buildbot/slave/monero-static-win32/build/build/release/CMakeFiles/CMakeTmp'


Determining if the include file sys/uio.h exists failed with the following output:
Change Dir: C:/msys32/home/buildbot/slave/monero-static-win32/build/build/release/CMakeFiles/CMakeTmp

Run Build Command:"C:/msys32/usr/bin/make.exe" "cmTC_52a16/fast"
make[1]: Entering directory '/home/buildbot/slave/monero-static-win32/build/build/release/CMakeFiles/CMakeTmp'
/usr/bin/make -f CMakeFiles/cmTC_52a16.dir/build.make CMakeFiles/cmTC_52a16.dir/build
make[2]: Entering directory '/home/buildbot/slave/monero-static-win32/build/build/release/CMakeFiles/CMakeTmp'
Building C object CMakeFiles/cmTC_52a16.dir/CheckIncludeFile.c.obj

/C/msys32/mingw32/bin/i686-w64-mingw32-gcc.exe    -o CMakeFiles/cmTC_52a16.dir/CheckIncludeFile.c.obj   -c /C/msys32/home/buildbot/slave/monero-static-win32/build/build/release/CMakeFiles/CMakeTmp/CheckIncludeFile.c
C:/msys32/home/buildbot/slave/monero-static-win32/build/build/release/CMakeFiles/CMakeTmp/CheckIncludeFile.c:1:10: fatal error: sys/uio.h: No such file or directory

 #include <sys/uio.h>

          ^~~~~~~~~~~

compilation terminated.

make[2]: *** [CMakeFiles/cmTC_52a16.dir/build.make:66: CMakeFiles/cmTC_52a16.dir/CheckIncludeFile.c.obj] Error 1
make[2]: Leaving directory '/home/buildbot/slave/monero-static-win32/build/build/release/CMakeFiles/CMakeTmp'
make[1]: *** [Makefile:121: cmTC_52a16/fast] Error 2
make[1]: Leaving directory '/home/buildbot/slave/monero-static-win32/build/build/release/CMakeFiles/CMakeTmp'


Determining if the include file sys/un.h exists failed with the following output:
Change Dir: C:/msys32/home/buildbot/slave/monero-static-win32/build/build/release/CMakeFiles/CMakeTmp

Run Build Command:"C:/msys32/usr/bin/make.exe" "cmTC_2fecb/fast"
make[1]: Entering directory '/home/buildbot/slave/monero-static-win32/build/build/release/CMakeFiles/CMakeTmp'
/usr/bin/make -f CMakeFiles/cmTC_2fecb.dir/build.make CMakeFiles/cmTC_2fecb.dir/build
make[2]: Entering directory '/home/buildbot/slave/monero-static-win32/build/build/release/CMakeFiles/CMakeTmp'
Building C object CMakeFiles/cmTC_2fecb.dir/CheckIncludeFile.c.obj

/C/msys32/mingw32/bin/i686-w64-mingw32-gcc.exe    -o CMakeFiles/cmTC_2fecb.dir/CheckIncludeFile.c.obj   -c /C/msys32/home/buildbot/slave/monero-static-win32/build/build/release/CMakeFiles/CMakeTmp/CheckIncludeFile.c
C:/msys32/home/buildbot/slave/monero-static-win32/build/build/release/CMakeFiles/CMakeTmp/CheckIncludeFile.c:1:10: fatal error: sys/un.h: No such file or directory

 #include <sys/un.h>

          ^~~~~~~~~~

compilation terminated.

make[2]: *** [CMakeFiles/cmTC_2fecb.dir/build.make:66: CMakeFiles/cmTC_2fecb.dir/CheckIncludeFile.c.obj] Error 1
make[2]: Leaving directory '/home/buildbot/slave/monero-static-win32/build/build/release/CMakeFiles/CMakeTmp'
make[1]: *** [Makefile:121: cmTC_2fecb/fast] Error 2
make[1]: Leaving directory '/home/buildbot/slave/monero-static-win32/build/build/release/CMakeFiles/CMakeTmp'


Determining if the include file sys/wait.h exists failed with the following output:
Change Dir: C:/msys32/home/buildbot/slave/monero-static-win32/build/build/release/CMakeFiles/CMakeTmp

Run Build Command:"C:/msys32/usr/bin/make.exe" "cmTC_231c6/fast"
make[1]: Entering directory '/home/buildbot/slave/monero-static-win32/build/build/release/CMakeFiles/CMakeTmp'
/usr/bin/make -f CMakeFiles/cmTC_231c6.dir/build.make CMakeFiles/cmTC_231c6.dir/build
make[2]: Entering directory '/home/buildbot/slave/monero-static-win32/build/build/release/CMakeFiles/CMakeTmp'
Building C object CMakeFiles/cmTC_231c6.dir/CheckIncludeFile.c.obj

/C/msys32/mingw32/bin/i686-w64-mingw32-gcc.exe    -o CMakeFiles/cmTC_231c6.dir/CheckIncludeFile.c.obj   -c /C/msys32/home/buildbot/slave/monero-static-win32/build/build/release/CMakeFiles/CMakeTmp/CheckIncludeFile.c
C:/msys32/home/buildbot/slave/monero-static-win32/build/build/release/CMakeFiles/CMakeTmp/CheckIncludeFile.c:1:10: fatal error: sys/wait.h: No such file or directory

 #include <sys/wait.h>

          ^~~~~~~~~~~~

compilation terminated.

make[2]: *** [CMakeFiles/cmTC_231c6.dir/build.make:66: CMakeFiles/cmTC_231c6.dir/CheckIncludeFile.c.obj] Error 1
make[2]: Leaving directory '/home/buildbot/slave/monero-static-win32/build/build/release/CMakeFiles/CMakeTmp'
make[1]: *** [Makefile:121: cmTC_231c6/fast] Error 2
make[1]: Leaving directory '/home/buildbot/slave/monero-static-win32/build/build/release/CMakeFiles/CMakeTmp'


Determining if the include file syslog.h exists failed with the following output:
Change Dir: C:/msys32/home/buildbot/slave/monero-static-win32/build/build/release/CMakeFiles/CMakeTmp

Run Build Command:"C:/msys32/usr/bin/make.exe" "cmTC_bcefd/fast"
make[1]: Entering directory '/home/buildbot/slave/monero-static-win32/build/build/release/CMakeFiles/CMakeTmp'
/usr/bin/make -f CMakeFiles/cmTC_bcefd.dir/build.make CMakeFiles/cmTC_bcefd.dir/build
make[2]: Entering directory '/home/buildbot/slave/monero-static-win32/build/build/release/CMakeFiles/CMakeTmp'
Building C object CMakeFiles/cmTC_bcefd.dir/CheckIncludeFile.c.obj

/C/msys32/mingw32/bin/i686-w64-mingw32-gcc.exe    -o CMakeFiles/cmTC_bcefd.dir/CheckIncludeFile.c.obj   -c /C/msys32/home/buildbot/slave/monero-static-win32/build/build/release/CMakeFiles/CMakeTmp/CheckIncludeFile.c
C:/msys32/home/buildbot/slave/monero-static-win32/build/build/release/CMakeFiles/CMakeTmp/CheckIncludeFile.c:1:10: fatal error: syslog.h: No such file or directory

 #include <syslog.h>

          ^~~~~~~~~~

compilation terminated.

make[2]: *** [CMakeFiles/cmTC_bcefd.dir/build.make:66: CMakeFiles/cmTC_bcefd.dir/CheckIncludeFile.c.obj] Error 1
make[2]: Leaving directory '/home/buildbot/slave/monero-static-win32/build/build/release/CMakeFiles/CMakeTmp'
make[1]: *** [Makefile:121: cmTC_bcefd/fast] Error 2
make[1]: Leaving directory '/home/buildbot/slave/monero-static-win32/build/build/release/CMakeFiles/CMakeTmp'


Determining if the include file vfork.h exists failed with the following output:
Change Dir: C:/msys32/home/buildbot/slave/monero-static-win32/build/build/release/CMakeFiles/CMakeTmp

Run Build Command:"C:/msys32/usr/bin/make.exe" "cmTC_88c90/fast"
make[1]: Entering directory '/home/buildbot/slave/monero-static-win32/build/build/release/CMakeFiles/CMakeTmp'
/usr/bin/make -f CMakeFiles/cmTC_88c90.dir/build.make CMakeFiles/cmTC_88c90.dir/build
make[2]: Entering directory '/home/buildbot/slave/monero-static-win32/build/build/release/CMakeFiles/CMakeTmp'
Building C object CMakeFiles/cmTC_88c90.dir/CheckIncludeFile.c.obj

/C/msys32/mingw32/bin/i686-w64-mingw32-gcc.exe    -o CMakeFiles/cmTC_88c90.dir/CheckIncludeFile.c.obj   -c /C/msys32/home/buildbot/slave/monero-static-win32/build/build/release/CMakeFiles/CMakeTmp/CheckIncludeFile.c
C:/msys32/home/buildbot/slave/monero-static-win32/build/build/release/CMakeFiles/CMakeTmp/CheckIncludeFile.c:1:10: fatal error: vfork.h: No such file or directory

 #include <vfork.h>

          ^~~~~~~~~

compilation terminated.

make[2]: *** [CMakeFiles/cmTC_88c90.dir/build.make:66: CMakeFiles/cmTC_88c90.dir/CheckIncludeFile.c.obj] Error 1
make[2]: Leaving directory '/home/buildbot/slave/monero-static-win32/build/build/release/CMakeFiles/CMakeTmp'
make[1]: *** [Makefile:121: cmTC_88c90/fast] Error 2
make[1]: Leaving directory '/home/buildbot/slave/monero-static-win32/build/build/release/CMakeFiles/CMakeTmp'


Determining if the function arc4random exists failed with the following output:
Change Dir: C:/msys32/home/buildbot/slave/monero-static-win32/build/build/release/CMakeFiles/CMakeTmp

Run Build Command:"C:/msys32/usr/bin/make.exe" "cmTC_f6850/fast"
make[1]: Entering directory '/home/buildbot/slave/monero-static-win32/build/build/release/CMakeFiles/CMakeTmp'
/usr/bin/make -f CMakeFiles/cmTC_f6850.dir/build.make CMakeFiles/cmTC_f6850.dir/build
make[2]: Entering directory '/home/buildbot/slave/monero-static-win32/build/build/release/CMakeFiles/CMakeTmp'
Building C object CMakeFiles/cmTC_f6850.dir/CheckFunctionExists.c.obj

/C/msys32/mingw32/bin/i686-w64-mingw32-gcc.exe   -DCHECK_FUNCTION_EXISTS=arc4random   -o CMakeFiles/cmTC_f6850.dir/CheckFunctionExists.c.obj   -c /C/msys32/mingw32/share/cmake-3.12/Modules/CheckFunctionExists.c
Linking C executable cmTC_f6850.exe

/C/msys32/mingw32/bin/cmake.exe -E remove -f CMakeFiles/cmTC_f6850.dir/objects.a
ar cr CMakeFiles/cmTC_f6850.dir/objects.a "CMakeFiles/cmTC_f6850.dir/CheckFunctionExists.c.obj" 
/C/msys32/mingw32/bin/i686-w64-mingw32-gcc.exe  -DCHECK_FUNCTION_EXISTS=arc4random    -Wl,--whole-archive CMakeFiles/cmTC_f6850.dir/objects.a -Wl,--no-whole-archive  -o cmTC_f6850.exe -Wl,--major-image-version,0,--minor-image-version,0 -liphlpapi -lws2_32 -lkernel32 -luser32 -lgdi32 -lwinspool -lshell32 -lole32 -loleaut32 -luuid -lcomdlg32 -ladvapi32 
CMakeFiles/cmTC_f6850.dir/objects.a(CheckFunctionExists.c.obj):CheckFunctionExists.c:(.text+0xc): undefined reference to `arc4random'

collect2.exe: error: ld returned 1 exit status

make[2]: *** [CMakeFiles/cmTC_f6850.dir/build.make:88: cmTC_f6850.exe] Error 1
make[2]: Leaving directory '/home/buildbot/slave/monero-static-win32/build/build/release/CMakeFiles/CMakeTmp'
make[1]: *** [Makefile:121: cmTC_f6850/fast] Error 2
make[1]: Leaving directory '/home/buildbot/slave/monero-static-win32/build/build/release/CMakeFiles/CMakeTmp'


Determining if the function arc4random_uniform exists failed with the following output:
Change Dir: C:/msys32/home/buildbot/slave/monero-static-win32/build/build/release/CMakeFiles/CMakeTmp

Run Build Command:"C:/msys32/usr/bin/make.exe" "cmTC_98a59/fast"
make[1]: Entering directory '/home/buildbot/slave/monero-static-win32/build/build/release/CMakeFiles/CMakeTmp'
/usr/bin/make -f CMakeFiles/cmTC_98a59.dir/build.make CMakeFiles/cmTC_98a59.dir/build
make[2]: Entering directory '/home/buildbot/slave/monero-static-win32/build/build/release/CMakeFiles/CMakeTmp'
Building C object CMakeFiles/cmTC_98a59.dir/CheckFunctionExists.c.obj

/C/msys32/mingw32/bin/i686-w64-mingw32-gcc.exe   -DCHECK_FUNCTION_EXISTS=arc4random_uniform   -o CMakeFiles/cmTC_98a59.dir/CheckFunctionExists.c.obj   -c /C/msys32/mingw32/share/cmake-3.12/Modules/CheckFunctionExists.c
Linking C executable cmTC_98a59.exe

/C/msys32/mingw32/bin/cmake.exe -E remove -f CMakeFiles/cmTC_98a59.dir/objects.a
ar cr CMakeFiles/cmTC_98a59.dir/objects.a "CMakeFiles/cmTC_98a59.dir/CheckFunctionExists.c.obj" 
/C/msys32/mingw32/bin/i686-w64-mingw32-gcc.exe  -DCHECK_FUNCTION_EXISTS=arc4random_uniform    -Wl,--whole-archive CMakeFiles/cmTC_98a59.dir/objects.a -Wl,--no-whole-archive  -o cmTC_98a59.exe -Wl,--major-image-version,0,--minor-image-version,0 -liphlpapi -lws2_32 -lkernel32 -luser32 -lgdi32 -lwinspool -lshell32 -lole32 -loleaut32 -luuid -lcomdlg32 -ladvapi32 
CMakeFiles/cmTC_98a59.dir/objects.a(CheckFunctionExists.c.obj):CheckFunctionExists.c:(.text+0xc): undefined reference to `arc4random_uniform'

collect2.exe: error: ld returned 1 exit status

make[2]: *** [CMakeFiles/cmTC_98a59.dir/build.make:88: cmTC_98a59.exe] Error 1
make[2]: Leaving directory '/home/buildbot/slave/monero-static-win32/build/build/release/CMakeFiles/CMakeTmp'
make[1]: *** [Makefile:121: cmTC_98a59/fast] Error 2
make[1]: Leaving directory '/home/buildbot/slave/monero-static-win32/build/build/release/CMakeFiles/CMakeTmp'


Determining if the function chown exists failed with the following output:
Change Dir: C:/msys32/home/buildbot/slave/monero-static-win32/build/build/release/CMakeFiles/CMakeTmp

Run Build Command:"C:/msys32/usr/bin/make.exe" "cmTC_073e0/fast"
make[1]: Entering directory '/home/buildbot/slave/monero-static-win32/build/build/release/CMakeFiles/CMakeTmp'
/usr/bin/make -f CMakeFiles/cmTC_073e0.dir/build.make CMakeFiles/cmTC_073e0.dir/build
make[2]: Entering directory '/home/buildbot/slave/monero-static-win32/build/build/release/CMakeFiles/CMakeTmp'
Building C object CMakeFiles/cmTC_073e0.dir/CheckFunctionExists.c.obj

/C/msys32/mingw32/bin/i686-w64-mingw32-gcc.exe   -DCHECK_FUNCTION_EXISTS=chown   -o CMakeFiles/cmTC_073e0.dir/CheckFunctionExists.c.obj   -c /C/msys32/mingw32/share/cmake-3.12/Modules/CheckFunctionExists.c
Linking C executable cmTC_073e0.exe

/C/msys32/mingw32/bin/cmake.exe -E remove -f CMakeFiles/cmTC_073e0.dir/objects.a
ar cr CMakeFiles/cmTC_073e0.dir/objects.a "CMakeFiles/cmTC_073e0.dir/CheckFunctionExists.c.obj" 
/C/msys32/mingw32/bin/i686-w64-mingw32-gcc.exe  -DCHECK_FUNCTION_EXISTS=chown    -Wl,--whole-archive CMakeFiles/cmTC_073e0.dir/objects.a -Wl,--no-whole-archive  -o cmTC_073e0.exe -Wl,--major-image-version,0,--minor-image-version,0 -liphlpapi -lws2_32 -lkernel32 -luser32 -lgdi32 -lwinspool -lshell32 -lole32 -loleaut32 -luuid -lcomdlg32 -ladvapi32 
CMakeFiles/cmTC_073e0.dir/objects.a(CheckFunctionExists.c.obj):CheckFunctionExists.c:(.text+0xc): undefined reference to `chown'

collect2.exe: error: ld returned 1 exit status

make[2]: *** [CMakeFiles/cmTC_073e0.dir/build.make:88: cmTC_073e0.exe] Error 1
make[2]: Leaving directory '/home/buildbot/slave/monero-static-win32/build/build/release/CMakeFiles/CMakeTmp'
make[1]: *** [Makefile:121: cmTC_073e0/fast] Error 2
make[1]: Leaving directory '/home/buildbot/slave/monero-static-win32/build/build/release/CMakeFiles/CMakeTmp'


Determining if the function chroot exists failed with the following output:
Change Dir: C:/msys32/home/buildbot/slave/monero-static-win32/build/build/release/CMakeFiles/CMakeTmp

Run Build Command:"C:/msys32/usr/bin/make.exe" "cmTC_81a2c/fast"
make[1]: Entering directory '/home/buildbot/slave/monero-static-win32/build/build/release/CMakeFiles/CMakeTmp'
/usr/bin/make -f CMakeFiles/cmTC_81a2c.dir/build.make CMakeFiles/cmTC_81a2c.dir/build
make[2]: Entering directory '/home/buildbot/slave/monero-static-win32/build/build/release/CMakeFiles/CMakeTmp'
Building C object CMakeFiles/cmTC_81a2c.dir/CheckFunctionExists.c.obj

/C/msys32/mingw32/bin/i686-w64-mingw32-gcc.exe   -DCHECK_FUNCTION_EXISTS=chroot   -o CMakeFiles/cmTC_81a2c.dir/CheckFunctionExists.c.obj   -c /C/msys32/mingw32/share/cmake-3.12/Modules/CheckFunctionExists.c
Linking C executable cmTC_81a2c.exe

/C/msys32/mingw32/bin/cmake.exe -E remove -f CMakeFiles/cmTC_81a2c.dir/objects.a
ar cr CMakeFiles/cmTC_81a2c.dir/objects.a "CMakeFiles/cmTC_81a2c.dir/CheckFunctionExists.c.obj" 
/C/msys32/mingw32/bin/i686-w64-mingw32-gcc.exe  -DCHECK_FUNCTION_EXISTS=chroot    -Wl,--whole-archive CMakeFiles/cmTC_81a2c.dir/objects.a -Wl,--no-whole-archive  -o cmTC_81a2c.exe -Wl,--major-image-version,0,--minor-image-version,0 -liphlpapi -lws2_32 -lkernel32 -luser32 -lgdi32 -lwinspool -lshell32 -lole32 -loleaut32 -luuid -lcomdlg32 -ladvapi32 
CMakeFiles/cmTC_81a2c.dir/objects.a(CheckFunctionExists.c.obj):CheckFunctionExists.c:(.text+0xc): undefined reference to `chroot'

collect2.exe: error: ld returned 1 exit status

make[2]: *** [CMakeFiles/cmTC_81a2c.dir/build.make:88: cmTC_81a2c.exe] Error 1
make[2]: Leaving directory '/home/buildbot/slave/monero-static-win32/build/build/release/CMakeFiles/CMakeTmp'
make[1]: *** [Makefile:121: cmTC_81a2c/fast] Error 2
make[1]: Leaving directory '/home/buildbot/slave/monero-static-win32/build/build/release/CMakeFiles/CMakeTmp'


Determining if the function ctime_r exists failed with the following output:
Change Dir: C:/msys32/home/buildbot/slave/monero-static-win32/build/build/release/CMakeFiles/CMakeTmp

Run Build Command:"C:/msys32/usr/bin/make.exe" "cmTC_a2124/fast"
make[1]: Entering directory '/home/buildbot/slave/monero-static-win32/build/build/release/CMakeFiles/CMakeTmp'
/usr/bin/make -f CMakeFiles/cmTC_a2124.dir/build.make CMakeFiles/cmTC_a2124.dir/build
make[2]: Entering directory '/home/buildbot/slave/monero-static-win32/build/build/release/CMakeFiles/CMakeTmp'
Building C object CMakeFiles/cmTC_a2124.dir/CheckFunctionExists.c.obj

/C/msys32/mingw32/bin/i686-w64-mingw32-gcc.exe   -DCHECK_FUNCTION_EXISTS=ctime_r   -o CMakeFiles/cmTC_a2124.dir/CheckFunctionExists.c.obj   -c /C/msys32/mingw32/share/cmake-3.12/Modules/CheckFunctionExists.c
Linking C executable cmTC_a2124.exe

/C/msys32/mingw32/bin/cmake.exe -E remove -f CMakeFiles/cmTC_a2124.dir/objects.a
ar cr CMakeFiles/cmTC_a2124.dir/objects.a "CMakeFiles/cmTC_a2124.dir/CheckFunctionExists.c.obj" 
/C/msys32/mingw32/bin/i686-w64-mingw32-gcc.exe  -DCHECK_FUNCTION_EXISTS=ctime_r    -Wl,--whole-archive CMakeFiles/cmTC_a2124.dir/objects.a -Wl,--no-whole-archive  -o cmTC_a2124.exe -Wl,--major-image-version,0,--minor-image-version,0 -liphlpapi -lws2_32 -lkernel32 -luser32 -lgdi32 -lwinspool -lshell32 -lole32 -loleaut32 -luuid -lcomdlg32 -ladvapi32 
CMakeFiles/cmTC_a2124.dir/objects.a(CheckFunctionExists.c.obj):CheckFunctionExists.c:(.text+0xc): undefined reference to `ctime_r'

collect2.exe: error: ld returned 1 exit status

make[2]: *** [CMakeFiles/cmTC_a2124.dir/build.make:88: cmTC_a2124.exe] Error 1
make[2]: Leaving directory '/home/buildbot/slave/monero-static-win32/build/build/release/CMakeFiles/CMakeTmp'
make[1]: *** [Makefile:121: cmTC_a2124/fast] Error 2
make[1]: Leaving directory '/home/buildbot/slave/monero-static-win32/build/build/release/CMakeFiles/CMakeTmp'


Determining if the function daemon exists failed with the following output:
Change Dir: C:/msys32/home/buildbot/slave/monero-static-win32/build/build/release/CMakeFiles/CMakeTmp

Run Build Command:"C:/msys32/usr/bin/make.exe" "cmTC_14c5e/fast"
make[1]: Entering directory '/home/buildbot/slave/monero-static-win32/build/build/release/CMakeFiles/CMakeTmp'
/usr/bin/make -f CMakeFiles/cmTC_14c5e.dir/build.make CMakeFiles/cmTC_14c5e.dir/build
make[2]: Entering directory '/home/buildbot/slave/monero-static-win32/build/build/release/CMakeFiles/CMakeTmp'
Building C object CMakeFiles/cmTC_14c5e.dir/CheckFunctionExists.c.obj

/C/msys32/mingw32/bin/i686-w64-mingw32-gcc.exe   -DCHECK_FUNCTION_EXISTS=daemon   -o CMakeFiles/cmTC_14c5e.dir/CheckFunctionExists.c.obj   -c /C/msys32/mingw32/share/cmake-3.12/Modules/CheckFunctionExists.c
Linking C executable cmTC_14c5e.exe

/C/msys32/mingw32/bin/cmake.exe -E remove -f CMakeFiles/cmTC_14c5e.dir/objects.a
ar cr CMakeFiles/cmTC_14c5e.dir/objects.a "CMakeFiles/cmTC_14c5e.dir/CheckFunctionExists.c.obj" 
/C/msys32/mingw32/bin/i686-w64-mingw32-gcc.exe  -DCHECK_FUNCTION_EXISTS=daemon    -Wl,--whole-archive CMakeFiles/cmTC_14c5e.dir/objects.a -Wl,--no-whole-archive  -o cmTC_14c5e.exe -Wl,--major-image-version,0,--minor-image-version,0 -liphlpapi -lws2_32 -lkernel32 -luser32 -lgdi32 -lwinspool -lshell32 -lole32 -loleaut32 -luuid -lcomdlg32 -ladvapi32 
CMakeFiles/cmTC_14c5e.dir/objects.a(CheckFunctionExists.c.obj):CheckFunctionExists.c:(.text+0xc): undefined reference to `daemon'

collect2.exe: error: ld returned 1 exit status

make[2]: *** [CMakeFiles/cmTC_14c5e.dir/build.make:88: cmTC_14c5e.exe] Error 1
make[2]: Leaving directory '/home/buildbot/slave/monero-static-win32/build/build/release/CMakeFiles/CMakeTmp'
make[1]: *** [Makefile:121: cmTC_14c5e/fast] Error 2
make[1]: Leaving directory '/home/buildbot/slave/monero-static-win32/build/build/release/CMakeFiles/CMakeTmp'


Determining if the function endprotoent exists failed with the following output:
Change Dir: C:/msys32/home/buildbot/slave/monero-static-win32/build/build/release/CMakeFiles/CMakeTmp

Run Build Command:"C:/msys32/usr/bin/make.exe" "cmTC_da76c/fast"
make[1]: Entering directory '/home/buildbot/slave/monero-static-win32/build/build/release/CMakeFiles/CMakeTmp'
/usr/bin/make -f CMakeFiles/cmTC_da76c.dir/build.make CMakeFiles/cmTC_da76c.dir/build
make[2]: Entering directory '/home/buildbot/slave/monero-static-win32/build/build/release/CMakeFiles/CMakeTmp'
Building C object CMakeFiles/cmTC_da76c.dir/CheckFunctionExists.c.obj

/C/msys32/mingw32/bin/i686-w64-mingw32-gcc.exe   -DCHECK_FUNCTION_EXISTS=endprotoent   -o CMakeFiles/cmTC_da76c.dir/CheckFunctionExists.c.obj   -c /C/msys32/mingw32/share/cmake-3.12/Modules/CheckFunctionExists.c
Linking C executable cmTC_da76c.exe

/C/msys32/mingw32/bin/cmake.exe -E remove -f CMakeFiles/cmTC_da76c.dir/objects.a
ar cr CMakeFiles/cmTC_da76c.dir/objects.a "CMakeFiles/cmTC_da76c.dir/CheckFunctionExists.c.obj" 
/C/msys32/mingw32/bin/i686-w64-mingw32-gcc.exe  -DCHECK_FUNCTION_EXISTS=endprotoent    -Wl,--whole-archive CMakeFiles/cmTC_da76c.dir/objects.a -Wl,--no-whole-archive  -o cmTC_da76c.exe -Wl,--major-image-version,0,--minor-image-version,0 -liphlpapi -lws2_32 -lkernel32 -luser32 -lgdi32 -lwinspool -lshell32 -lole32 -loleaut32 -luuid -lcomdlg32 -ladvapi32 
CMakeFiles/cmTC_da76c.dir/objects.a(CheckFunctionExists.c.obj):CheckFunctionExists.c:(.text+0xc): undefined reference to `endprotoent'

collect2.exe: error: ld returned 1 exit status

make[2]: *** [CMakeFiles/cmTC_da76c.dir/build.make:88: cmTC_da76c.exe] Error 1
make[2]: Leaving directory '/home/buildbot/slave/monero-static-win32/build/build/release/CMakeFiles/CMakeTmp'
make[1]: *** [Makefile:121: cmTC_da76c/fast] Error 2
make[1]: Leaving directory '/home/buildbot/slave/monero-static-win32/build/build/release/CMakeFiles/CMakeTmp'


Determining if the function endservent exists failed with the following output:
Change Dir: C:/msys32/home/buildbot/slave/monero-static-win32/build/build/release/CMakeFiles/CMakeTmp

Run Build Command:"C:/msys32/usr/bin/make.exe" "cmTC_1df2a/fast"
make[1]: Entering directory '/home/buildbot/slave/monero-static-win32/build/build/release/CMakeFiles/CMakeTmp'
/usr/bin/make -f CMakeFiles/cmTC_1df2a.dir/build.make CMakeFiles/cmTC_1df2a.dir/build
make[2]: Entering directory '/home/buildbot/slave/monero-static-win32/build/build/release/CMakeFiles/CMakeTmp'
Building C object CMakeFiles/cmTC_1df2a.dir/CheckFunctionExists.c.obj

/C/msys32/mingw32/bin/i686-w64-mingw32-gcc.exe   -DCHECK_FUNCTION_EXISTS=endservent   -o CMakeFiles/cmTC_1df2a.dir/CheckFunctionExists.c.obj   -c /C/msys32/mingw32/share/cmake-3.12/Modules/CheckFunctionExists.c
Linking C executable cmTC_1df2a.exe

/C/msys32/mingw32/bin/cmake.exe -E remove -f CMakeFiles/cmTC_1df2a.dir/objects.a
ar cr CMakeFiles/cmTC_1df2a.dir/objects.a "CMakeFiles/cmTC_1df2a.dir/CheckFunctionExists.c.obj" 
/C/msys32/mingw32/bin/i686-w64-mingw32-gcc.exe  -DCHECK_FUNCTION_EXISTS=endservent    -Wl,--whole-archive CMakeFiles/cmTC_1df2a.dir/objects.a -Wl,--no-whole-archive  -o cmTC_1df2a.exe -Wl,--major-image-version,0,--minor-image-version,0 -liphlpapi -lws2_32 -lkernel32 -luser32 -lgdi32 -lwinspool -lshell32 -lole32 -loleaut32 -luuid -lcomdlg32 -ladvapi32 
CMakeFiles/cmTC_1df2a.dir/objects.a(CheckFunctionExists.c.obj):CheckFunctionExists.c:(.text+0xc): undefined reference to `endservent'

collect2.exe: error: ld returned 1 exit status

make[2]: *** [CMakeFiles/cmTC_1df2a.dir/build.make:88: cmTC_1df2a.exe] Error 1
make[2]: Leaving directory '/home/buildbot/slave/monero-static-win32/build/build/release/CMakeFiles/CMakeTmp'
make[1]: *** [Makefile:121: cmTC_1df2a/fast] Error 2
make[1]: Leaving directory '/home/buildbot/slave/monero-static-win32/build/build/release/CMakeFiles/CMakeTmp'


Determining if the function fork exists failed with the following output:
Change Dir: C:/msys32/home/buildbot/slave/monero-static-win32/build/build/release/CMakeFiles/CMakeTmp

Run Build Command:"C:/msys32/usr/bin/make.exe" "cmTC_88f2b/fast"
make[1]: Entering directory '/home/buildbot/slave/monero-static-win32/build/build/release/CMakeFiles/CMakeTmp'
/usr/bin/make -f CMakeFiles/cmTC_88f2b.dir/build.make CMakeFiles/cmTC_88f2b.dir/build
make[2]: Entering directory '/home/buildbot/slave/monero-static-win32/build/build/release/CMakeFiles/CMakeTmp'
Building C object CMakeFiles/cmTC_88f2b.dir/CheckFunctionExists.c.obj

/C/msys32/mingw32/bin/i686-w64-mingw32-gcc.exe   -DCHECK_FUNCTION_EXISTS=fork   -o CMakeFiles/cmTC_88f2b.dir/CheckFunctionExists.c.obj   -c /C/msys32/mingw32/share/cmake-3.12/Modules/CheckFunctionExists.c
<command-line>:0:23: warning: conflicting types for built-in function 'fork' [-Wbuiltin-declaration-mismatch]

C:/msys32/mingw32/share/cmake-3.12/Modules/CheckFunctionExists.c:7:3: note: in expansion of macro 'CHECK_FUNCTION_EXISTS'

   CHECK_FUNCTION_EXISTS(void);

   ^~~~~~~~~~~~~~~~~~~~~

Linking C executable cmTC_88f2b.exe

/C/msys32/mingw32/bin/cmake.exe -E remove -f CMakeFiles/cmTC_88f2b.dir/objects.a
ar cr CMakeFiles/cmTC_88f2b.dir/objects.a "CMakeFiles/cmTC_88f2b.dir/CheckFunctionExists.c.obj" 
/C/msys32/mingw32/bin/i686-w64-mingw32-gcc.exe  -DCHECK_FUNCTION_EXISTS=fork    -Wl,--whole-archive CMakeFiles/cmTC_88f2b.dir/objects.a -Wl,--no-whole-archive  -o cmTC_88f2b.exe -Wl,--major-image-version,0,--minor-image-version,0 -liphlpapi -lws2_32 -lkernel32 -luser32 -lgdi32 -lwinspool -lshell32 -lole32 -loleaut32 -luuid -lcomdlg32 -ladvapi32 
CMakeFiles/cmTC_88f2b.dir/objects.a(CheckFunctionExists.c.obj):CheckFunctionExists.c:(.text+0xc): undefined reference to `fork'

collect2.exe: error: ld returned 1 exit status

make[2]: *** [CMakeFiles/cmTC_88f2b.dir/build.make:88: cmTC_88f2b.exe] Error 1
make[2]: Leaving directory '/home/buildbot/slave/monero-static-win32/build/build/release/CMakeFiles/CMakeTmp'
make[1]: *** [Makefile:121: cmTC_88f2b/fast] Error 2
make[1]: Leaving directory '/home/buildbot/slave/monero-static-win32/build/build/release/CMakeFiles/CMakeTmp'


Determining if the function fsync exists failed with the following output:
Change Dir: C:/msys32/home/buildbot/slave/monero-static-win32/build/build/release/CMakeFiles/CMakeTmp

Run Build Command:"C:/msys32/usr/bin/make.exe" "cmTC_57c2c/fast"
make[1]: Entering directory '/home/buildbot/slave/monero-static-win32/build/build/release/CMakeFiles/CMakeTmp'
/usr/bin/make -f CMakeFiles/cmTC_57c2c.dir/build.make CMakeFiles/cmTC_57c2c.dir/build
make[2]: Entering directory '/home/buildbot/slave/monero-static-win32/build/build/release/CMakeFiles/CMakeTmp'
Building C object CMakeFiles/cmTC_57c2c.dir/CheckFunctionExists.c.obj

/C/msys32/mingw32/bin/i686-w64-mingw32-gcc.exe   -DCHECK_FUNCTION_EXISTS=fsync   -o CMakeFiles/cmTC_57c2c.dir/CheckFunctionExists.c.obj   -c /C/msys32/mingw32/share/cmake-3.12/Modules/CheckFunctionExists.c
Linking C executable cmTC_57c2c.exe

/C/msys32/mingw32/bin/cmake.exe -E remove -f CMakeFiles/cmTC_57c2c.dir/objects.a
ar cr CMakeFiles/cmTC_57c2c.dir/objects.a "CMakeFiles/cmTC_57c2c.dir/CheckFunctionExists.c.obj" 
/C/msys32/mingw32/bin/i686-w64-mingw32-gcc.exe  -DCHECK_FUNCTION_EXISTS=fsync    -Wl,--whole-archive CMakeFiles/cmTC_57c2c.dir/objects.a -Wl,--no-whole-archive  -o cmTC_57c2c.exe -Wl,--major-image-version,0,--minor-image-version,0 -liphlpapi -lws2_32 -lkernel32 -luser32 -lgdi32 -lwinspool -lshell32 -lole32 -loleaut32 -luuid -lcomdlg32 -ladvapi32 
CMakeFiles/cmTC_57c2c.dir/objects.a(CheckFunctionExists.c.obj):CheckFunctionExists.c:(.text+0xc): undefined reference to `fsync'

collect2.exe: error: ld returned 1 exit status

make[2]: *** [CMakeFiles/cmTC_57c2c.dir/build.make:88: cmTC_57c2c.exe] Error 1
make[2]: Leaving directory '/home/buildbot/slave/monero-static-win32/build/build/release/CMakeFiles/CMakeTmp'
make[1]: *** [Makefile:121: cmTC_57c2c/fast] Error 2
make[1]: Leaving directory '/home/buildbot/slave/monero-static-win32/build/build/release/CMakeFiles/CMakeTmp'


Determining if the function getauxval exists failed with the following output:
Change Dir: C:/msys32/home/buildbot/slave/monero-static-win32/build/build/release/CMakeFiles/CMakeTmp

Run Build Command:"C:/msys32/usr/bin/make.exe" "cmTC_13359/fast"
make[1]: Entering directory '/home/buildbot/slave/monero-static-win32/build/build/release/CMakeFiles/CMakeTmp'
/usr/bin/make -f CMakeFiles/cmTC_13359.dir/build.make CMakeFiles/cmTC_13359.dir/build
make[2]: Entering directory '/home/buildbot/slave/monero-static-win32/build/build/release/CMakeFiles/CMakeTmp'
Building C object CMakeFiles/cmTC_13359.dir/CheckFunctionExists.c.obj

/C/msys32/mingw32/bin/i686-w64-mingw32-gcc.exe   -DCHECK_FUNCTION_EXISTS=getauxval   -o CMakeFiles/cmTC_13359.dir/CheckFunctionExists.c.obj   -c /C/msys32/mingw32/share/cmake-3.12/Modules/CheckFunctionExists.c
Linking C executable cmTC_13359.exe

/C/msys32/mingw32/bin/cmake.exe -E remove -f CMakeFiles/cmTC_13359.dir/objects.a
ar cr CMakeFiles/cmTC_13359.dir/objects.a "CMakeFiles/cmTC_13359.dir/CheckFunctionExists.c.obj" 
/C/msys32/mingw32/bin/i686-w64-mingw32-gcc.exe  -DCHECK_FUNCTION_EXISTS=getauxval    -Wl,--whole-archive CMakeFiles/cmTC_13359.dir/objects.a -Wl,--no-whole-archive  -o cmTC_13359.exe -Wl,--major-image-version,0,--minor-image-version,0 -liphlpapi -lws2_32 -lkernel32 -luser32 -lgdi32 -lwinspool -lshell32 -lole32 -loleaut32 -luuid -lcomdlg32 -ladvapi32 
CMakeFiles/cmTC_13359.dir/objects.a(CheckFunctionExists.c.obj):CheckFunctionExists.c:(.text+0xc): undefined reference to `getauxval'

collect2.exe: error: ld returned 1 exit status

make[2]: *** [CMakeFiles/cmTC_13359.dir/build.make:88: cmTC_13359.exe] Error 1
make[2]: Leaving directory '/home/buildbot/slave/monero-static-win32/build/build/release/CMakeFiles/CMakeTmp'
make[1]: *** [Makefile:121: cmTC_13359/fast] Error 2
make[1]: Leaving directory '/home/buildbot/slave/monero-static-win32/build/build/release/CMakeFiles/CMakeTmp'


Determining if the function getentropy exists failed with the following output:
Change Dir: C:/msys32/home/buildbot/slave/monero-static-win32/build/build/release/CMakeFiles/CMakeTmp

Run Build Command:"C:/msys32/usr/bin/make.exe" "cmTC_8c92d/fast"
make[1]: Entering directory '/home/buildbot/slave/monero-static-win32/build/build/release/CMakeFiles/CMakeTmp'
/usr/bin/make -f CMakeFiles/cmTC_8c92d.dir/build.make CMakeFiles/cmTC_8c92d.dir/build
make[2]: Entering directory '/home/buildbot/slave/monero-static-win32/build/build/release/CMakeFiles/CMakeTmp'
Building C object CMakeFiles/cmTC_8c92d.dir/CheckFunctionExists.c.obj

/C/msys32/mingw32/bin/i686-w64-mingw32-gcc.exe   -DCHECK_FUNCTION_EXISTS=getentropy   -o CMakeFiles/cmTC_8c92d.dir/CheckFunctionExists.c.obj   -c /C/msys32/mingw32/share/cmake-3.12/Modules/CheckFunctionExists.c
Linking C executable cmTC_8c92d.exe

/C/msys32/mingw32/bin/cmake.exe -E remove -f CMakeFiles/cmTC_8c92d.dir/objects.a
ar cr CMakeFiles/cmTC_8c92d.dir/objects.a "CMakeFiles/cmTC_8c92d.dir/CheckFunctionExists.c.obj" 
/C/msys32/mingw32/bin/i686-w64-mingw32-gcc.exe  -DCHECK_FUNCTION_EXISTS=getentropy    -Wl,--whole-archive CMakeFiles/cmTC_8c92d.dir/objects.a -Wl,--no-whole-archive  -o cmTC_8c92d.exe -Wl,--major-image-version,0,--minor-image-version,0 -liphlpapi -lws2_32 -lkernel32 -luser32 -lgdi32 -lwinspool -lshell32 -lole32 -loleaut32 -luuid -lcomdlg32 -ladvapi32 
CMakeFiles/cmTC_8c92d.dir/objects.a(CheckFunctionExists.c.obj):CheckFunctionExists.c:(.text+0xc): undefined reference to `getentropy'

collect2.exe: error: ld returned 1 exit status

make[2]: *** [CMakeFiles/cmTC_8c92d.dir/build.make:88: cmTC_8c92d.exe] Error 1
make[2]: Leaving directory '/home/buildbot/slave/monero-static-win32/build/build/release/CMakeFiles/CMakeTmp'
make[1]: *** [Makefile:121: cmTC_8c92d/fast] Error 2
make[1]: Leaving directory '/home/buildbot/slave/monero-static-win32/build/build/release/CMakeFiles/CMakeTmp'


Determining if the function getpwnam exists failed with the following output:
Change Dir: C:/msys32/home/buildbot/slave/monero-static-win32/build/build/release/CMakeFiles/CMakeTmp

Run Build Command:"C:/msys32/usr/bin/make.exe" "cmTC_1f474/fast"
make[1]: Entering directory '/home/buildbot/slave/monero-static-win32/build/build/release/CMakeFiles/CMakeTmp'
/usr/bin/make -f CMakeFiles/cmTC_1f474.dir/build.make CMakeFiles/cmTC_1f474.dir/build
make[2]: Entering directory '/home/buildbot/slave/monero-static-win32/build/build/release/CMakeFiles/CMakeTmp'
Building C object CMakeFiles/cmTC_1f474.dir/CheckFunctionExists.c.obj

/C/msys32/mingw32/bin/i686-w64-mingw32-gcc.exe   -DCHECK_FUNCTION_EXISTS=getpwnam   -o CMakeFiles/cmTC_1f474.dir/CheckFunctionExists.c.obj   -c /C/msys32/mingw32/share/cmake-3.12/Modules/CheckFunctionExists.c
Linking C executable cmTC_1f474.exe

/C/msys32/mingw32/bin/cmake.exe -E remove -f CMakeFiles/cmTC_1f474.dir/objects.a
ar cr CMakeFiles/cmTC_1f474.dir/objects.a "CMakeFiles/cmTC_1f474.dir/CheckFunctionExists.c.obj" 
/C/msys32/mingw32/bin/i686-w64-mingw32-gcc.exe  -DCHECK_FUNCTION_EXISTS=getpwnam    -Wl,--whole-archive CMakeFiles/cmTC_1f474.dir/objects.a -Wl,--no-whole-archive  -o cmTC_1f474.exe -Wl,--major-image-version,0,--minor-image-version,0 -liphlpapi -lws2_32 -lkernel32 -luser32 -lgdi32 -lwinspool -lshell32 -lole32 -loleaut32 -luuid -lcomdlg32 -ladvapi32 
CMakeFiles/cmTC_1f474.dir/objects.a(CheckFunctionExists.c.obj):CheckFunctionExists.c:(.text+0xc): undefined reference to `getpwnam'

collect2.exe: error: ld returned 1 exit status

make[2]: *** [CMakeFiles/cmTC_1f474.dir/build.make:88: cmTC_1f474.exe] Error 1
make[2]: Leaving directory '/home/buildbot/slave/monero-static-win32/build/build/release/CMakeFiles/CMakeTmp'
make[1]: *** [Makefile:121: cmTC_1f474/fast] Error 2
make[1]: Leaving directory '/home/buildbot/slave/monero-static-win32/build/build/release/CMakeFiles/CMakeTmp'


Determining if the function getrlimit exists failed with the following output:
Change Dir: C:/msys32/home/buildbot/slave/monero-static-win32/build/build/release/CMakeFiles/CMakeTmp

Run Build Command:"C:/msys32/usr/bin/make.exe" "cmTC_75f55/fast"
make[1]: Entering directory '/home/buildbot/slave/monero-static-win32/build/build/release/CMakeFiles/CMakeTmp'
/usr/bin/make -f CMakeFiles/cmTC_75f55.dir/build.make CMakeFiles/cmTC_75f55.dir/build
make[2]: Entering directory '/home/buildbot/slave/monero-static-win32/build/build/release/CMakeFiles/CMakeTmp'
Building C object CMakeFiles/cmTC_75f55.dir/CheckFunctionExists.c.obj

/C/msys32/mingw32/bin/i686-w64-mingw32-gcc.exe   -DCHECK_FUNCTION_EXISTS=getrlimit   -o CMakeFiles/cmTC_75f55.dir/CheckFunctionExists.c.obj   -c /C/msys32/mingw32/share/cmake-3.12/Modules/CheckFunctionExists.c
Linking C executable cmTC_75f55.exe

/C/msys32/mingw32/bin/cmake.exe -E remove -f CMakeFiles/cmTC_75f55.dir/objects.a
ar cr CMakeFiles/cmTC_75f55.dir/objects.a "CMakeFiles/cmTC_75f55.dir/CheckFunctionExists.c.obj" 
/C/msys32/mingw32/bin/i686-w64-mingw32-gcc.exe  -DCHECK_FUNCTION_EXISTS=getrlimit    -Wl,--whole-archive CMakeFiles/cmTC_75f55.dir/objects.a -Wl,--no-whole-archive  -o cmTC_75f55.exe -Wl,--major-image-version,0,--minor-image-version,0 -liphlpapi -lws2_32 -lkernel32 -luser32 -lgdi32 -lwinspool -lshell32 -lole32 -loleaut32 -luuid -lcomdlg32 -ladvapi32 
CMakeFiles/cmTC_75f55.dir/objects.a(CheckFunctionExists.c.obj):CheckFunctionExists.c:(.text+0xc): undefined reference to `getrlimit'

collect2.exe: error: ld returned 1 exit status

make[2]: *** [CMakeFiles/cmTC_75f55.dir/build.make:88: cmTC_75f55.exe] Error 1
make[2]: Leaving directory '/home/buildbot/slave/monero-static-win32/build/build/release/CMakeFiles/CMakeTmp'
make[1]: *** [Makefile:121: cmTC_75f55/fast] Error 2
make[1]: Leaving directory '/home/buildbot/slave/monero-static-win32/build/build/release/CMakeFiles/CMakeTmp'


Determining if the function glob exists failed with the following output:
Change Dir: C:/msys32/home/buildbot/slave/monero-static-win32/build/build/release/CMakeFiles/CMakeTmp

Run Build Command:"C:/msys32/usr/bin/make.exe" "cmTC_b4708/fast"
make[1]: Entering directory '/home/buildbot/slave/monero-static-win32/build/build/release/CMakeFiles/CMakeTmp'
/usr/bin/make -f CMakeFiles/cmTC_b4708.dir/build.make CMakeFiles/cmTC_b4708.dir/build
make[2]: Entering directory '/home/buildbot/slave/monero-static-win32/build/build/release/CMakeFiles/CMakeTmp'
Building C object CMakeFiles/cmTC_b4708.dir/CheckFunctionExists.c.obj

/C/msys32/mingw32/bin/i686-w64-mingw32-gcc.exe   -DCHECK_FUNCTION_EXISTS=glob   -o CMakeFiles/cmTC_b4708.dir/CheckFunctionExists.c.obj   -c /C/msys32/mingw32/share/cmake-3.12/Modules/CheckFunctionExists.c
Linking C executable cmTC_b4708.exe

/C/msys32/mingw32/bin/cmake.exe -E remove -f CMakeFiles/cmTC_b4708.dir/objects.a
ar cr CMakeFiles/cmTC_b4708.dir/objects.a "CMakeFiles/cmTC_b4708.dir/CheckFunctionExists.c.obj" 
/C/msys32/mingw32/bin/i686-w64-mingw32-gcc.exe  -DCHECK_FUNCTION_EXISTS=glob    -Wl,--whole-archive CMakeFiles/cmTC_b4708.dir/objects.a -Wl,--no-whole-archive  -o cmTC_b4708.exe -Wl,--major-image-version,0,--minor-image-version,0 -liphlpapi -lws2_32 -lkernel32 -luser32 -lgdi32 -lwinspool -lshell32 -lole32 -loleaut32 -luuid -lcomdlg32 -ladvapi32 
CMakeFiles/cmTC_b4708.dir/objects.a(CheckFunctionExists.c.obj):CheckFunctionExists.c:(.text+0xc): undefined reference to `glob'

collect2.exe: error: ld returned 1 exit status

make[2]: *** [CMakeFiles/cmTC_b4708.dir/build.make:88: cmTC_b4708.exe] Error 1
make[2]: Leaving directory '/home/buildbot/slave/monero-static-win32/build/build/release/CMakeFiles/CMakeTmp'
make[1]: *** [Makefile:121: cmTC_b4708/fast] Error 2
make[1]: Leaving directory '/home/buildbot/slave/monero-static-win32/build/build/release/CMakeFiles/CMakeTmp'


Determining if the function gmtime_r exists failed with the following output:
Change Dir: C:/msys32/home/buildbot/slave/monero-static-win32/build/build/release/CMakeFiles/CMakeTmp

Run Build Command:"C:/msys32/usr/bin/make.exe" "cmTC_7bbdb/fast"
make[1]: Entering directory '/home/buildbot/slave/monero-static-win32/build/build/release/CMakeFiles/CMakeTmp'
/usr/bin/make -f CMakeFiles/cmTC_7bbdb.dir/build.make CMakeFiles/cmTC_7bbdb.dir/build
make[2]: Entering directory '/home/buildbot/slave/monero-static-win32/build/build/release/CMakeFiles/CMakeTmp'
Building C object CMakeFiles/cmTC_7bbdb.dir/CheckFunctionExists.c.obj

/C/msys32/mingw32/bin/i686-w64-mingw32-gcc.exe   -DCHECK_FUNCTION_EXISTS=gmtime_r   -o CMakeFiles/cmTC_7bbdb.dir/CheckFunctionExists.c.obj   -c /C/msys32/mingw32/share/cmake-3.12/Modules/CheckFunctionExists.c
Linking C executable cmTC_7bbdb.exe

/C/msys32/mingw32/bin/cmake.exe -E remove -f CMakeFiles/cmTC_7bbdb.dir/objects.a
ar cr CMakeFiles/cmTC_7bbdb.dir/objects.a "CMakeFiles/cmTC_7bbdb.dir/CheckFunctionExists.c.obj" 
/C/msys32/mingw32/bin/i686-w64-mingw32-gcc.exe  -DCHECK_FUNCTION_EXISTS=gmtime_r    -Wl,--whole-archive CMakeFiles/cmTC_7bbdb.dir/objects.a -Wl,--no-whole-archive  -o cmTC_7bbdb.exe -Wl,--major-image-version,0,--minor-image-version,0 -liphlpapi -lws2_32 -lkernel32 -luser32 -lgdi32 -lwinspool -lshell32 -lole32 -loleaut32 -luuid -lcomdlg32 -ladvapi32 
CMakeFiles/cmTC_7bbdb.dir/objects.a(CheckFunctionExists.c.obj):CheckFunctionExists.c:(.text+0xc): undefined reference to `gmtime_r'

collect2.exe: error: ld returned 1 exit status

make[2]: *** [CMakeFiles/cmTC_7bbdb.dir/build.make:88: cmTC_7bbdb.exe] Error 1
make[2]: Leaving directory '/home/buildbot/slave/monero-static-win32/build/build/release/CMakeFiles/CMakeTmp'
make[1]: *** [Makefile:121: cmTC_7bbdb/fast] Error 2
make[1]: Leaving directory '/home/buildbot/slave/monero-static-win32/build/build/release/CMakeFiles/CMakeTmp'


Determining if the function fcntl exists failed with the following output:
Change Dir: C:/msys32/home/buildbot/slave/monero-static-win32/build/build/release/CMakeFiles/CMakeTmp

Run Build Command:"C:/msys32/usr/bin/make.exe" "cmTC_93ba6/fast"
make[1]: Entering directory '/home/buildbot/slave/monero-static-win32/build/build/release/CMakeFiles/CMakeTmp'
/usr/bin/make -f CMakeFiles/cmTC_93ba6.dir/build.make CMakeFiles/cmTC_93ba6.dir/build
make[2]: Entering directory '/home/buildbot/slave/monero-static-win32/build/build/release/CMakeFiles/CMakeTmp'
Building C object CMakeFiles/cmTC_93ba6.dir/CheckFunctionExists.c.obj

/C/msys32/mingw32/bin/i686-w64-mingw32-gcc.exe   -DCHECK_FUNCTION_EXISTS=fcntl   -o CMakeFiles/cmTC_93ba6.dir/CheckFunctionExists.c.obj   -c /C/msys32/mingw32/share/cmake-3.12/Modules/CheckFunctionExists.c
Linking C executable cmTC_93ba6.exe

/C/msys32/mingw32/bin/cmake.exe -E remove -f CMakeFiles/cmTC_93ba6.dir/objects.a
ar cr CMakeFiles/cmTC_93ba6.dir/objects.a "CMakeFiles/cmTC_93ba6.dir/CheckFunctionExists.c.obj" 
/C/msys32/mingw32/bin/i686-w64-mingw32-gcc.exe  -DCHECK_FUNCTION_EXISTS=fcntl    -Wl,--whole-archive CMakeFiles/cmTC_93ba6.dir/objects.a -Wl,--no-whole-archive  -o cmTC_93ba6.exe -Wl,--major-image-version,0,--minor-image-version,0 -liphlpapi -lws2_32 -lkernel32 -luser32 -lgdi32 -lwinspool -lshell32 -lole32 -loleaut32 -luuid -lcomdlg32 -ladvapi32 
CMakeFiles/cmTC_93ba6.dir/objects.a(CheckFunctionExists.c.obj):CheckFunctionExists.c:(.text+0xc): undefined reference to `fcntl'

collect2.exe: error: ld returned 1 exit status

make[2]: *** [CMakeFiles/cmTC_93ba6.dir/build.make:88: cmTC_93ba6.exe] Error 1
make[2]: Leaving directory '/home/buildbot/slave/monero-static-win32/build/build/release/CMakeFiles/CMakeTmp'
make[1]: *** [Makefile:121: cmTC_93ba6/fast] Error 2
make[1]: Leaving directory '/home/buildbot/slave/monero-static-win32/build/build/release/CMakeFiles/CMakeTmp'


Determining if the function inet_aton exists failed with the following output:
Change Dir: C:/msys32/home/buildbot/slave/monero-static-win32/build/build/release/CMakeFiles/CMakeTmp

Run Build Command:"C:/msys32/usr/bin/make.exe" "cmTC_1b531/fast"
make[1]: Entering directory '/home/buildbot/slave/monero-static-win32/build/build/release/CMakeFiles/CMakeTmp'
/usr/bin/make -f CMakeFiles/cmTC_1b531.dir/build.make CMakeFiles/cmTC_1b531.dir/build
make[2]: Entering directory '/home/buildbot/slave/monero-static-win32/build/build/release/CMakeFiles/CMakeTmp'
Building C object CMakeFiles/cmTC_1b531.dir/CheckFunctionExists.c.obj

/C/msys32/mingw32/bin/i686-w64-mingw32-gcc.exe   -DCHECK_FUNCTION_EXISTS=inet_aton   -o CMakeFiles/cmTC_1b531.dir/CheckFunctionExists.c.obj   -c /C/msys32/mingw32/share/cmake-3.12/Modules/CheckFunctionExists.c
Linking C executable cmTC_1b531.exe

/C/msys32/mingw32/bin/cmake.exe -E remove -f CMakeFiles/cmTC_1b531.dir/objects.a
ar cr CMakeFiles/cmTC_1b531.dir/objects.a "CMakeFiles/cmTC_1b531.dir/CheckFunctionExists.c.obj" 
/C/msys32/mingw32/bin/i686-w64-mingw32-gcc.exe  -DCHECK_FUNCTION_EXISTS=inet_aton    -Wl,--whole-archive CMakeFiles/cmTC_1b531.dir/objects.a -Wl,--no-whole-archive  -o cmTC_1b531.exe -Wl,--major-image-version,0,--minor-image-version,0 -liphlpapi -lws2_32 -lkernel32 -luser32 -lgdi32 -lwinspool -lshell32 -lole32 -loleaut32 -luuid -lcomdlg32 -ladvapi32 
CMakeFiles/cmTC_1b531.dir/objects.a(CheckFunctionExists.c.obj):CheckFunctionExists.c:(.text+0xc): undefined reference to `inet_aton'

collect2.exe: error: ld returned 1 exit status

make[2]: *** [CMakeFiles/cmTC_1b531.dir/build.make:88: cmTC_1b531.exe] Error 1
make[2]: Leaving directory '/home/buildbot/slave/monero-static-win32/build/build/release/CMakeFiles/CMakeTmp'
make[1]: *** [Makefile:121: cmTC_1b531/fast] Error 2
make[1]: Leaving directory '/home/buildbot/slave/monero-static-win32/build/build/release/CMakeFiles/CMakeTmp'


Determining if the function inet_ntop exists failed with the following output:
Change Dir: C:/msys32/home/buildbot/slave/monero-static-win32/build/build/release/CMakeFiles/CMakeTmp

Run Build Command:"C:/msys32/usr/bin/make.exe" "cmTC_3a56a/fast"
make[1]: Entering directory '/home/buildbot/slave/monero-static-win32/build/build/release/CMakeFiles/CMakeTmp'
/usr/bin/make -f CMakeFiles/cmTC_3a56a.dir/build.make CMakeFiles/cmTC_3a56a.dir/build
make[2]: Entering directory '/home/buildbot/slave/monero-static-win32/build/build/release/CMakeFiles/CMakeTmp'
Building C object CMakeFiles/cmTC_3a56a.dir/CheckFunctionExists.c.obj

/C/msys32/mingw32/bin/i686-w64-mingw32-gcc.exe   -DCHECK_FUNCTION_EXISTS=inet_ntop   -o CMakeFiles/cmTC_3a56a.dir/CheckFunctionExists.c.obj   -c /C/msys32/mingw32/share/cmake-3.12/Modules/CheckFunctionExists.c
Linking C executable cmTC_3a56a.exe

/C/msys32/mingw32/bin/cmake.exe -E remove -f CMakeFiles/cmTC_3a56a.dir/objects.a
ar cr CMakeFiles/cmTC_3a56a.dir/objects.a "CMakeFiles/cmTC_3a56a.dir/CheckFunctionExists.c.obj" 
/C/msys32/mingw32/bin/i686-w64-mingw32-gcc.exe  -DCHECK_FUNCTION_EXISTS=inet_ntop    -Wl,--whole-archive CMakeFiles/cmTC_3a56a.dir/objects.a -Wl,--no-whole-archive  -o cmTC_3a56a.exe -Wl,--major-image-version,0,--minor-image-version,0 -liphlpapi -lws2_32 -lkernel32 -luser32 -lgdi32 -lwinspool -lshell32 -lole32 -loleaut32 -luuid -lcomdlg32 -ladvapi32 
CMakeFiles/cmTC_3a56a.dir/objects.a(CheckFunctionExists.c.obj):CheckFunctionExists.c:(.text+0xc): undefined reference to `inet_ntop'

collect2.exe: error: ld returned 1 exit status

make[2]: *** [CMakeFiles/cmTC_3a56a.dir/build.make:88: cmTC_3a56a.exe] Error 1
make[2]: Leaving directory '/home/buildbot/slave/monero-static-win32/build/build/release/CMakeFiles/CMakeTmp'
make[1]: *** [Makefile:121: cmTC_3a56a/fast] Error 2
make[1]: Leaving directory '/home/buildbot/slave/monero-static-win32/build/build/release/CMakeFiles/CMakeTmp'


Determining if the function inet_pton exists failed with the following output:
Change Dir: C:/msys32/home/buildbot/slave/monero-static-win32/build/build/release/CMakeFiles/CMakeTmp

Run Build Command:"C:/msys32/usr/bin/make.exe" "cmTC_05646/fast"
make[1]: Entering directory '/home/buildbot/slave/monero-static-win32/build/build/release/CMakeFiles/CMakeTmp'
/usr/bin/make -f CMakeFiles/cmTC_05646.dir/build.make CMakeFiles/cmTC_05646.dir/build
make[2]: Entering directory '/home/buildbot/slave/monero-static-win32/build/build/release/CMakeFiles/CMakeTmp'
Building C object CMakeFiles/cmTC_05646.dir/CheckFunctionExists.c.obj

/C/msys32/mingw32/bin/i686-w64-mingw32-gcc.exe   -DCHECK_FUNCTION_EXISTS=inet_pton   -o CMakeFiles/cmTC_05646.dir/CheckFunctionExists.c.obj   -c /C/msys32/mingw32/share/cmake-3.12/Modules/CheckFunctionExists.c
Linking C executable cmTC_05646.exe

/C/msys32/mingw32/bin/cmake.exe -E remove -f CMakeFiles/cmTC_05646.dir/objects.a
ar cr CMakeFiles/cmTC_05646.dir/objects.a "CMakeFiles/cmTC_05646.dir/CheckFunctionExists.c.obj" 
/C/msys32/mingw32/bin/i686-w64-mingw32-gcc.exe  -DCHECK_FUNCTION_EXISTS=inet_pton    -Wl,--whole-archive CMakeFiles/cmTC_05646.dir/objects.a -Wl,--no-whole-archive  -o cmTC_05646.exe -Wl,--major-image-version,0,--minor-image-version,0 -liphlpapi -lws2_32 -lkernel32 -luser32 -lgdi32 -lwinspool -lshell32 -lole32 -loleaut32 -luuid -lcomdlg32 -ladvapi32 
CMakeFiles/cmTC_05646.dir/objects.a(CheckFunctionExists.c.obj):CheckFunctionExists.c:(.text+0xc): undefined reference to `inet_pton'

collect2.exe: error: ld returned 1 exit status

make[2]: *** [CMakeFiles/cmTC_05646.dir/build.make:88: cmTC_05646.exe] Error 1
make[2]: Leaving directory '/home/buildbot/slave/monero-static-win32/build/build/release/CMakeFiles/CMakeTmp'
make[1]: *** [Makefile:121: cmTC_05646/fast] Error 2
make[1]: Leaving directory '/home/buildbot/slave/monero-static-win32/build/build/release/CMakeFiles/CMakeTmp'


Determining if the function initgroups exists failed with the following output:
Change Dir: C:/msys32/home/buildbot/slave/monero-static-win32/build/build/release/CMakeFiles/CMakeTmp

Run Build Command:"C:/msys32/usr/bin/make.exe" "cmTC_a5153/fast"
make[1]: Entering directory '/home/buildbot/slave/monero-static-win32/build/build/release/CMakeFiles/CMakeTmp'
/usr/bin/make -f CMakeFiles/cmTC_a5153.dir/build.make CMakeFiles/cmTC_a5153.dir/build
make[2]: Entering directory '/home/buildbot/slave/monero-static-win32/build/build/release/CMakeFiles/CMakeTmp'
Building C object CMakeFiles/cmTC_a5153.dir/CheckFunctionExists.c.obj

/C/msys32/mingw32/bin/i686-w64-mingw32-gcc.exe   -DCHECK_FUNCTION_EXISTS=initgroups   -o CMakeFiles/cmTC_a5153.dir/CheckFunctionExists.c.obj   -c /C/msys32/mingw32/share/cmake-3.12/Modules/CheckFunctionExists.c
Linking C executable cmTC_a5153.exe

/C/msys32/mingw32/bin/cmake.exe -E remove -f CMakeFiles/cmTC_a5153.dir/objects.a
ar cr CMakeFiles/cmTC_a5153.dir/objects.a "CMakeFiles/cmTC_a5153.dir/CheckFunctionExists.c.obj" 
/C/msys32/mingw32/bin/i686-w64-mingw32-gcc.exe  -DCHECK_FUNCTION_EXISTS=initgroups    -Wl,--whole-archive CMakeFiles/cmTC_a5153.dir/objects.a -Wl,--no-whole-archive  -o cmTC_a5153.exe -Wl,--major-image-version,0,--minor-image-version,0 -liphlpapi -lws2_32 -lkernel32 -luser32 -lgdi32 -lwinspool -lshell32 -lole32 -loleaut32 -luuid -lcomdlg32 -ladvapi32 
CMakeFiles/cmTC_a5153.dir/objects.a(CheckFunctionExists.c.obj):CheckFunctionExists.c:(.text+0xc): undefined reference to `initgroups'

collect2.exe: error: ld returned 1 exit status

make[2]: *** [CMakeFiles/cmTC_a5153.dir/build.make:88: cmTC_a5153.exe] Error 1
make[2]: Leaving directory '/home/buildbot/slave/monero-static-win32/build/build/release/CMakeFiles/CMakeTmp'
make[1]: *** [Makefile:121: cmTC_a5153/fast] Error 2
make[1]: Leaving directory '/home/buildbot/slave/monero-static-win32/build/build/release/CMakeFiles/CMakeTmp'


Determining if the function ioctlsocket exists failed with the following output:
Change Dir: C:/msys32/home/buildbot/slave/monero-static-win32/build/build/release/CMakeFiles/CMakeTmp

Run Build Command:"C:/msys32/usr/bin/make.exe" "cmTC_16fd3/fast"
make[1]: Entering directory '/home/buildbot/slave/monero-static-win32/build/build/release/CMakeFiles/CMakeTmp'
/usr/bin/make -f CMakeFiles/cmTC_16fd3.dir/build.make CMakeFiles/cmTC_16fd3.dir/build
make[2]: Entering directory '/home/buildbot/slave/monero-static-win32/build/build/release/CMakeFiles/CMakeTmp'
Building C object CMakeFiles/cmTC_16fd3.dir/CheckFunctionExists.c.obj

/C/msys32/mingw32/bin/i686-w64-mingw32-gcc.exe   -DCHECK_FUNCTION_EXISTS=ioctlsocket   -o CMakeFiles/cmTC_16fd3.dir/CheckFunctionExists.c.obj   -c /C/msys32/mingw32/share/cmake-3.12/Modules/CheckFunctionExists.c
Linking C executable cmTC_16fd3.exe

/C/msys32/mingw32/bin/cmake.exe -E remove -f CMakeFiles/cmTC_16fd3.dir/objects.a
ar cr CMakeFiles/cmTC_16fd3.dir/objects.a "CMakeFiles/cmTC_16fd3.dir/CheckFunctionExists.c.obj" 
/C/msys32/mingw32/bin/i686-w64-mingw32-gcc.exe  -DCHECK_FUNCTION_EXISTS=ioctlsocket    -Wl,--whole-archive CMakeFiles/cmTC_16fd3.dir/objects.a -Wl,--no-whole-archive  -o cmTC_16fd3.exe -Wl,--major-image-version,0,--minor-image-version,0 -liphlpapi -lws2_32 -lkernel32 -luser32 -lgdi32 -lwinspool -lshell32 -lole32 -loleaut32 -luuid -lcomdlg32 -ladvapi32 
CMakeFiles/cmTC_16fd3.dir/objects.a(CheckFunctionExists.c.obj):CheckFunctionExists.c:(.text+0xc): undefined reference to `ioctlsocket'

collect2.exe: error: ld returned 1 exit status

make[2]: *** [CMakeFiles/cmTC_16fd3.dir/build.make:88: cmTC_16fd3.exe] Error 1
make[2]: Leaving directory '/home/buildbot/slave/monero-static-win32/build/build/release/CMakeFiles/CMakeTmp'
make[1]: *** [Makefile:121: cmTC_16fd3/fast] Error 2
make[1]: Leaving directory '/home/buildbot/slave/monero-static-win32/build/build/release/CMakeFiles/CMakeTmp'


Determining if the function kill exists failed with the following output:
Change Dir: C:/msys32/home/buildbot/slave/monero-static-win32/build/build/release/CMakeFiles/CMakeTmp

Run Build Command:"C:/msys32/usr/bin/make.exe" "cmTC_5ea07/fast"
make[1]: Entering directory '/home/buildbot/slave/monero-static-win32/build/build/release/CMakeFiles/CMakeTmp'
/usr/bin/make -f CMakeFiles/cmTC_5ea07.dir/build.make CMakeFiles/cmTC_5ea07.dir/build
make[2]: Entering directory '/home/buildbot/slave/monero-static-win32/build/build/release/CMakeFiles/CMakeTmp'
Building C object CMakeFiles/cmTC_5ea07.dir/CheckFunctionExists.c.obj

/C/msys32/mingw32/bin/i686-w64-mingw32-gcc.exe   -DCHECK_FUNCTION_EXISTS=kill   -o CMakeFiles/cmTC_5ea07.dir/CheckFunctionExists.c.obj   -c /C/msys32/mingw32/share/cmake-3.12/Modules/CheckFunctionExists.c
Linking C executable cmTC_5ea07.exe

/C/msys32/mingw32/bin/cmake.exe -E remove -f CMakeFiles/cmTC_5ea07.dir/objects.a
ar cr CMakeFiles/cmTC_5ea07.dir/objects.a "CMakeFiles/cmTC_5ea07.dir/CheckFunctionExists.c.obj" 
/C/msys32/mingw32/bin/i686-w64-mingw32-gcc.exe  -DCHECK_FUNCTION_EXISTS=kill    -Wl,--whole-archive CMakeFiles/cmTC_5ea07.dir/objects.a -Wl,--no-whole-archive  -o cmTC_5ea07.exe -Wl,--major-image-version,0,--minor-image-version,0 -liphlpapi -lws2_32 -lkernel32 -luser32 -lgdi32 -lwinspool -lshell32 -lole32 -loleaut32 -luuid -lcomdlg32 -ladvapi32 
CMakeFiles/cmTC_5ea07.dir/objects.a(CheckFunctionExists.c.obj):CheckFunctionExists.c:(.text+0xc): undefined reference to `kill'

collect2.exe: error: ld returned 1 exit status

make[2]: *** [CMakeFiles/cmTC_5ea07.dir/build.make:88: cmTC_5ea07.exe] Error 1
make[2]: Leaving directory '/home/buildbot/slave/monero-static-win32/build/build/release/CMakeFiles/CMakeTmp'
make[1]: *** [Makefile:121: cmTC_5ea07/fast] Error 2
make[1]: Leaving directory '/home/buildbot/slave/monero-static-win32/build/build/release/CMakeFiles/CMakeTmp'


Determining if the function localtime_r exists failed with the following output:
Change Dir: C:/msys32/home/buildbot/slave/monero-static-win32/build/build/release/CMakeFiles/CMakeTmp

Run Build Command:"C:/msys32/usr/bin/make.exe" "cmTC_f99ab/fast"
make[1]: Entering directory '/home/buildbot/slave/monero-static-win32/build/build/release/CMakeFiles/CMakeTmp'
/usr/bin/make -f CMakeFiles/cmTC_f99ab.dir/build.make CMakeFiles/cmTC_f99ab.dir/build
make[2]: Entering directory '/home/buildbot/slave/monero-static-win32/build/build/release/CMakeFiles/CMakeTmp'
Building C object CMakeFiles/cmTC_f99ab.dir/CheckFunctionExists.c.obj

/C/msys32/mingw32/bin/i686-w64-mingw32-gcc.exe   -DCHECK_FUNCTION_EXISTS=localtime_r   -o CMakeFiles/cmTC_f99ab.dir/CheckFunctionExists.c.obj   -c /C/msys32/mingw32/share/cmake-3.12/Modules/CheckFunctionExists.c
Linking C executable cmTC_f99ab.exe

/C/msys32/mingw32/bin/cmake.exe -E remove -f CMakeFiles/cmTC_f99ab.dir/objects.a
ar cr CMakeFiles/cmTC_f99ab.dir/objects.a "CMakeFiles/cmTC_f99ab.dir/CheckFunctionExists.c.obj" 
/C/msys32/mingw32/bin/i686-w64-mingw32-gcc.exe  -DCHECK_FUNCTION_EXISTS=localtime_r    -Wl,--whole-archive CMakeFiles/cmTC_f99ab.dir/objects.a -Wl,--no-whole-archive  -o cmTC_f99ab.exe -Wl,--major-image-version,0,--minor-image-version,0 -liphlpapi -lws2_32 -lkernel32 -luser32 -lgdi32 -lwinspool -lshell32 -lole32 -loleaut32 -luuid -lcomdlg32 -ladvapi32 
CMakeFiles/cmTC_f99ab.dir/objects.a(CheckFunctionExists.c.obj):CheckFunctionExists.c:(.text+0xc): undefined reference to `localtime_r'

collect2.exe: error: ld returned 1 exit status

make[2]: *** [CMakeFiles/cmTC_f99ab.dir/build.make:88: cmTC_f99ab.exe] Error 1
make[2]: Leaving directory '/home/buildbot/slave/monero-static-win32/build/build/release/CMakeFiles/CMakeTmp'
make[1]: *** [Makefile:121: cmTC_f99ab/fast] Error 2
make[1]: Leaving directory '/home/buildbot/slave/monero-static-win32/build/build/release/CMakeFiles/CMakeTmp'


Determining if the function random exists failed with the following output:
Change Dir: C:/msys32/home/buildbot/slave/monero-static-win32/build/build/release/CMakeFiles/CMakeTmp

Run Build Command:"C:/msys32/usr/bin/make.exe" "cmTC_89acf/fast"
make[1]: Entering directory '/home/buildbot/slave/monero-static-win32/build/build/release/CMakeFiles/CMakeTmp'
/usr/bin/make -f CMakeFiles/cmTC_89acf.dir/build.make CMakeFiles/cmTC_89acf.dir/build
make[2]: Entering directory '/home/buildbot/slave/monero-static-win32/build/build/release/CMakeFiles/CMakeTmp'
Building C object CMakeFiles/cmTC_89acf.dir/CheckFunctionExists.c.obj

/C/msys32/mingw32/bin/i686-w64-mingw32-gcc.exe   -DCHECK_FUNCTION_EXISTS=random   -o CMakeFiles/cmTC_89acf.dir/CheckFunctionExists.c.obj   -c /C/msys32/mingw32/share/cmake-3.12/Modules/CheckFunctionExists.c
Linking C executable cmTC_89acf.exe

/C/msys32/mingw32/bin/cmake.exe -E remove -f CMakeFiles/cmTC_89acf.dir/objects.a
ar cr CMakeFiles/cmTC_89acf.dir/objects.a "CMakeFiles/cmTC_89acf.dir/CheckFunctionExists.c.obj" 
/C/msys32/mingw32/bin/i686-w64-mingw32-gcc.exe  -DCHECK_FUNCTION_EXISTS=random    -Wl,--whole-archive CMakeFiles/cmTC_89acf.dir/objects.a -Wl,--no-whole-archive  -o cmTC_89acf.exe -Wl,--major-image-version,0,--minor-image-version,0 -liphlpapi -lws2_32 -lkernel32 -luser32 -lgdi32 -lwinspool -lshell32 -lole32 -loleaut32 -luuid -lcomdlg32 -ladvapi32 
CMakeFiles/cmTC_89acf.dir/objects.a(CheckFunctionExists.c.obj):CheckFunctionExists.c:(.text+0xc): undefined reference to `random'

collect2.exe: error: ld returned 1 exit status

make[2]: *** [CMakeFiles/cmTC_89acf.dir/build.make:88: cmTC_89acf.exe] Error 1
make[2]: Leaving directory '/home/buildbot/slave/monero-static-win32/build/build/release/CMakeFiles/CMakeTmp'
make[1]: *** [Makefile:121: cmTC_89acf/fast] Error 2
make[1]: Leaving directory '/home/buildbot/slave/monero-static-win32/build/build/release/CMakeFiles/CMakeTmp'


Determining if the function reallocarray exists failed with the following output:
Change Dir: C:/msys32/home/buildbot/slave/monero-static-win32/build/build/release/CMakeFiles/CMakeTmp

Run Build Command:"C:/msys32/usr/bin/make.exe" "cmTC_dd3c0/fast"
make[1]: Entering directory '/home/buildbot/slave/monero-static-win32/build/build/release/CMakeFiles/CMakeTmp'
/usr/bin/make -f CMakeFiles/cmTC_dd3c0.dir/build.make CMakeFiles/cmTC_dd3c0.dir/build
make[2]: Entering directory '/home/buildbot/slave/monero-static-win32/build/build/release/CMakeFiles/CMakeTmp'
Building C object CMakeFiles/cmTC_dd3c0.dir/CheckFunctionExists.c.obj

/C/msys32/mingw32/bin/i686-w64-mingw32-gcc.exe   -DCHECK_FUNCTION_EXISTS=reallocarray   -o CMakeFiles/cmTC_dd3c0.dir/CheckFunctionExists.c.obj   -c /C/msys32/mingw32/share/cmake-3.12/Modules/CheckFunctionExists.c
Linking C executable cmTC_dd3c0.exe

/C/msys32/mingw32/bin/cmake.exe -E remove -f CMakeFiles/cmTC_dd3c0.dir/objects.a
ar cr CMakeFiles/cmTC_dd3c0.dir/objects.a "CMakeFiles/cmTC_dd3c0.dir/CheckFunctionExists.c.obj" 
/C/msys32/mingw32/bin/i686-w64-mingw32-gcc.exe  -DCHECK_FUNCTION_EXISTS=reallocarray    -Wl,--whole-archive CMakeFiles/cmTC_dd3c0.dir/objects.a -Wl,--no-whole-archive  -o cmTC_dd3c0.exe -Wl,--major-image-version,0,--minor-image-version,0 -liphlpapi -lws2_32 -lkernel32 -luser32 -lgdi32 -lwinspool -lshell32 -lole32 -loleaut32 -luuid -lcomdlg32 -ladvapi32 
CMakeFiles/cmTC_dd3c0.dir/objects.a(CheckFunctionExists.c.obj):CheckFunctionExists.c:(.text+0xc): undefined reference to `reallocarray'

collect2.exe: error: ld returned 1 exit status

make[2]: *** [CMakeFiles/cmTC_dd3c0.dir/build.make:88: cmTC_dd3c0.exe] Error 1
make[2]: Leaving directory '/home/buildbot/slave/monero-static-win32/build/build/release/CMakeFiles/CMakeTmp'
make[1]: *** [Makefile:121: cmTC_dd3c0/fast] Error 2
make[1]: Leaving directory '/home/buildbot/slave/monero-static-win32/build/build/release/CMakeFiles/CMakeTmp'


Determining if the function recvmsg exists failed with the following output:
Change Dir: C:/msys32/home/buildbot/slave/monero-static-win32/build/build/release/CMakeFiles/CMakeTmp

Run Build Command:"C:/msys32/usr/bin/make.exe" "cmTC_aabcd/fast"
make[1]: Entering directory '/home/buildbot/slave/monero-static-win32/build/build/release/CMakeFiles/CMakeTmp'
/usr/bin/make -f CMakeFiles/cmTC_aabcd.dir/build.make CMakeFiles/cmTC_aabcd.dir/build
make[2]: Entering directory '/home/buildbot/slave/monero-static-win32/build/build/release/CMakeFiles/CMakeTmp'
Building C object CMakeFiles/cmTC_aabcd.dir/CheckFunctionExists.c.obj

/C/msys32/mingw32/bin/i686-w64-mingw32-gcc.exe   -DCHECK_FUNCTION_EXISTS=recvmsg   -o CMakeFiles/cmTC_aabcd.dir/CheckFunctionExists.c.obj   -c /C/msys32/mingw32/share/cmake-3.12/Modules/CheckFunctionExists.c
Linking C executable cmTC_aabcd.exe

/C/msys32/mingw32/bin/cmake.exe -E remove -f CMakeFiles/cmTC_aabcd.dir/objects.a
ar cr CMakeFiles/cmTC_aabcd.dir/objects.a "CMakeFiles/cmTC_aabcd.dir/CheckFunctionExists.c.obj" 
/C/msys32/mingw32/bin/i686-w64-mingw32-gcc.exe  -DCHECK_FUNCTION_EXISTS=recvmsg    -Wl,--whole-archive CMakeFiles/cmTC_aabcd.dir/objects.a -Wl,--no-whole-archive  -o cmTC_aabcd.exe -Wl,--major-image-version,0,--minor-image-version,0 -liphlpapi -lws2_32 -lkernel32 -luser32 -lgdi32 -lwinspool -lshell32 -lole32 -loleaut32 -luuid -lcomdlg32 -ladvapi32 
CMakeFiles/cmTC_aabcd.dir/objects.a(CheckFunctionExists.c.obj):CheckFunctionExists.c:(.text+0xc): undefined reference to `recvmsg'

collect2.exe: error: ld returned 1 exit status

make[2]: *** [CMakeFiles/cmTC_aabcd.dir/build.make:88: cmTC_aabcd.exe] Error 1
make[2]: Leaving directory '/home/buildbot/slave/monero-static-win32/build/build/release/CMakeFiles/CMakeTmp'
make[1]: *** [Makefile:121: cmTC_aabcd/fast] Error 2
make[1]: Leaving directory '/home/buildbot/slave/monero-static-win32/build/build/release/CMakeFiles/CMakeTmp'


Determining if the function sbrk exists failed with the following output:
Change Dir: C:/msys32/home/buildbot/slave/monero-static-win32/build/build/release/CMakeFiles/CMakeTmp

Run Build Command:"C:/msys32/usr/bin/make.exe" "cmTC_49a18/fast"
make[1]: Entering directory '/home/buildbot/slave/monero-static-win32/build/build/release/CMakeFiles/CMakeTmp'
/usr/bin/make -f CMakeFiles/cmTC_49a18.dir/build.make CMakeFiles/cmTC_49a18.dir/build
make[2]: Entering directory '/home/buildbot/slave/monero-static-win32/build/build/release/CMakeFiles/CMakeTmp'
Building C object CMakeFiles/cmTC_49a18.dir/CheckFunctionExists.c.obj

/C/msys32/mingw32/bin/i686-w64-mingw32-gcc.exe   -DCHECK_FUNCTION_EXISTS=sbrk   -o CMakeFiles/cmTC_49a18.dir/CheckFunctionExists.c.obj   -c /C/msys32/mingw32/share/cmake-3.12/Modules/CheckFunctionExists.c
Linking C executable cmTC_49a18.exe

/C/msys32/mingw32/bin/cmake.exe -E remove -f CMakeFiles/cmTC_49a18.dir/objects.a
ar cr CMakeFiles/cmTC_49a18.dir/objects.a "CMakeFiles/cmTC_49a18.dir/CheckFunctionExists.c.obj" 
/C/msys32/mingw32/bin/i686-w64-mingw32-gcc.exe  -DCHECK_FUNCTION_EXISTS=sbrk    -Wl,--whole-archive CMakeFiles/cmTC_49a18.dir/objects.a -Wl,--no-whole-archive  -o cmTC_49a18.exe -Wl,--major-image-version,0,--minor-image-version,0 -liphlpapi -lws2_32 -lkernel32 -luser32 -lgdi32 -lwinspool -lshell32 -lole32 -loleaut32 -luuid -lcomdlg32 -ladvapi32 
CMakeFiles/cmTC_49a18.dir/objects.a(CheckFunctionExists.c.obj):CheckFunctionExists.c:(.text+0xc): undefined reference to `sbrk'

collect2.exe: error: ld returned 1 exit status

make[2]: *** [CMakeFiles/cmTC_49a18.dir/build.make:88: cmTC_49a18.exe] Error 1
make[2]: Leaving directory '/home/buildbot/slave/monero-static-win32/build/build/release/CMakeFiles/CMakeTmp'
make[1]: *** [Makefile:121: cmTC_49a18/fast] Error 2
make[1]: Leaving directory '/home/buildbot/slave/monero-static-win32/build/build/release/CMakeFiles/CMakeTmp'


Determining if the function sendmsg exists failed with the following output:
Change Dir: C:/msys32/home/buildbot/slave/monero-static-win32/build/build/release/CMakeFiles/CMakeTmp

Run Build Command:"C:/msys32/usr/bin/make.exe" "cmTC_2e8cc/fast"
make[1]: Entering directory '/home/buildbot/slave/monero-static-win32/build/build/release/CMakeFiles/CMakeTmp'
/usr/bin/make -f CMakeFiles/cmTC_2e8cc.dir/build.make CMakeFiles/cmTC_2e8cc.dir/build
make[2]: Entering directory '/home/buildbot/slave/monero-static-win32/build/build/release/CMakeFiles/CMakeTmp'
Building C object CMakeFiles/cmTC_2e8cc.dir/CheckFunctionExists.c.obj

/C/msys32/mingw32/bin/i686-w64-mingw32-gcc.exe   -DCHECK_FUNCTION_EXISTS=sendmsg   -o CMakeFiles/cmTC_2e8cc.dir/CheckFunctionExists.c.obj   -c /C/msys32/mingw32/share/cmake-3.12/Modules/CheckFunctionExists.c
Linking C executable cmTC_2e8cc.exe

/C/msys32/mingw32/bin/cmake.exe -E remove -f CMakeFiles/cmTC_2e8cc.dir/objects.a
ar cr CMakeFiles/cmTC_2e8cc.dir/objects.a "CMakeFiles/cmTC_2e8cc.dir/CheckFunctionExists.c.obj" 
/C/msys32/mingw32/bin/i686-w64-mingw32-gcc.exe  -DCHECK_FUNCTION_EXISTS=sendmsg    -Wl,--whole-archive CMakeFiles/cmTC_2e8cc.dir/objects.a -Wl,--no-whole-archive  -o cmTC_2e8cc.exe -Wl,--major-image-version,0,--minor-image-version,0 -liphlpapi -lws2_32 -lkernel32 -luser32 -lgdi32 -lwinspool -lshell32 -lole32 -loleaut32 -luuid -lcomdlg32 -ladvapi32 
CMakeFiles/cmTC_2e8cc.dir/objects.a(CheckFunctionExists.c.obj):CheckFunctionExists.c:(.text+0xc): undefined reference to `sendmsg'

collect2.exe: error: ld returned 1 exit status

make[2]: *** [CMakeFiles/cmTC_2e8cc.dir/build.make:88: cmTC_2e8cc.exe] Error 1
make[2]: Leaving directory '/home/buildbot/slave/monero-static-win32/build/build/release/CMakeFiles/CMakeTmp'
make[1]: *** [Makefile:121: cmTC_2e8cc/fast] Error 2
make[1]: Leaving directory '/home/buildbot/slave/monero-static-win32/build/build/release/CMakeFiles/CMakeTmp'


Determining if the function setregid exists failed with the following output:
Change Dir: C:/msys32/home/buildbot/slave/monero-static-win32/build/build/release/CMakeFiles/CMakeTmp

Run Build Command:"C:/msys32/usr/bin/make.exe" "cmTC_0f2cd/fast"
make[1]: Entering directory '/home/buildbot/slave/monero-static-win32/build/build/release/CMakeFiles/CMakeTmp'
/usr/bin/make -f CMakeFiles/cmTC_0f2cd.dir/build.make CMakeFiles/cmTC_0f2cd.dir/build
make[2]: Entering directory '/home/buildbot/slave/monero-static-win32/build/build/release/CMakeFiles/CMakeTmp'
Building C object CMakeFiles/cmTC_0f2cd.dir/CheckFunctionExists.c.obj

/C/msys32/mingw32/bin/i686-w64-mingw32-gcc.exe   -DCHECK_FUNCTION_EXISTS=setregid   -o CMakeFiles/cmTC_0f2cd.dir/CheckFunctionExists.c.obj   -c /C/msys32/mingw32/share/cmake-3.12/Modules/CheckFunctionExists.c
Linking C executable cmTC_0f2cd.exe

/C/msys32/mingw32/bin/cmake.exe -E remove -f CMakeFiles/cmTC_0f2cd.dir/objects.a
ar cr CMakeFiles/cmTC_0f2cd.dir/objects.a "CMakeFiles/cmTC_0f2cd.dir/CheckFunctionExists.c.obj" 
/C/msys32/mingw32/bin/i686-w64-mingw32-gcc.exe  -DCHECK_FUNCTION_EXISTS=setregid    -Wl,--whole-archive CMakeFiles/cmTC_0f2cd.dir/objects.a -Wl,--no-whole-archive  -o cmTC_0f2cd.exe -Wl,--major-image-version,0,--minor-image-version,0 -liphlpapi -lws2_32 -lkernel32 -luser32 -lgdi32 -lwinspool -lshell32 -lole32 -loleaut32 -luuid -lcomdlg32 -ladvapi32 
CMakeFiles/cmTC_0f2cd.dir/objects.a(CheckFunctionExists.c.obj):CheckFunctionExists.c:(.text+0xc): undefined reference to `setregid'

collect2.exe: error: ld returned 1 exit status

make[2]: *** [CMakeFiles/cmTC_0f2cd.dir/build.make:88: cmTC_0f2cd.exe] Error 1
make[2]: Leaving directory '/home/buildbot/slave/monero-static-win32/build/build/release/CMakeFiles/CMakeTmp'
make[1]: *** [Makefile:121: cmTC_0f2cd/fast] Error 2
make[1]: Leaving directory '/home/buildbot/slave/monero-static-win32/build/build/release/CMakeFiles/CMakeTmp'


Determining if the function setresgid exists failed with the following output:
Change Dir: C:/msys32/home/buildbot/slave/monero-static-win32/build/build/release/CMakeFiles/CMakeTmp

Run Build Command:"C:/msys32/usr/bin/make.exe" "cmTC_d37d0/fast"
make[1]: Entering directory '/home/buildbot/slave/monero-static-win32/build/build/release/CMakeFiles/CMakeTmp'
/usr/bin/make -f CMakeFiles/cmTC_d37d0.dir/build.make CMakeFiles/cmTC_d37d0.dir/build
make[2]: Entering directory '/home/buildbot/slave/monero-static-win32/build/build/release/CMakeFiles/CMakeTmp'
Building C object CMakeFiles/cmTC_d37d0.dir/CheckFunctionExists.c.obj

/C/msys32/mingw32/bin/i686-w64-mingw32-gcc.exe   -DCHECK_FUNCTION_EXISTS=setresgid   -o CMakeFiles/cmTC_d37d0.dir/CheckFunctionExists.c.obj   -c /C/msys32/mingw32/share/cmake-3.12/Modules/CheckFunctionExists.c
Linking C executable cmTC_d37d0.exe

/C/msys32/mingw32/bin/cmake.exe -E remove -f CMakeFiles/cmTC_d37d0.dir/objects.a
ar cr CMakeFiles/cmTC_d37d0.dir/objects.a "CMakeFiles/cmTC_d37d0.dir/CheckFunctionExists.c.obj" 
/C/msys32/mingw32/bin/i686-w64-mingw32-gcc.exe  -DCHECK_FUNCTION_EXISTS=setresgid    -Wl,--whole-archive CMakeFiles/cmTC_d37d0.dir/objects.a -Wl,--no-whole-archive  -o cmTC_d37d0.exe -Wl,--major-image-version,0,--minor-image-version,0 -liphlpapi -lws2_32 -lkernel32 -luser32 -lgdi32 -lwinspool -lshell32 -lole32 -loleaut32 -luuid -lcomdlg32 -ladvapi32 
CMakeFiles/cmTC_d37d0.dir/objects.a(CheckFunctionExists.c.obj):CheckFunctionExists.c:(.text+0xc): undefined reference to `setresgid'

collect2.exe: error: ld returned 1 exit status

make[2]: *** [CMakeFiles/cmTC_d37d0.dir/build.make:88: cmTC_d37d0.exe] Error 1
make[2]: Leaving directory '/home/buildbot/slave/monero-static-win32/build/build/release/CMakeFiles/CMakeTmp'
make[1]: *** [Makefile:121: cmTC_d37d0/fast] Error 2
make[1]: Leaving directory '/home/buildbot/slave/monero-static-win32/build/build/release/CMakeFiles/CMakeTmp'


Determining if the function setresuid exists failed with the following output:
Change Dir: C:/msys32/home/buildbot/slave/monero-static-win32/build/build/release/CMakeFiles/CMakeTmp

Run Build Command:"C:/msys32/usr/bin/make.exe" "cmTC_d6480/fast"
make[1]: Entering directory '/home/buildbot/slave/monero-static-win32/build/build/release/CMakeFiles/CMakeTmp'
/usr/bin/make -f CMakeFiles/cmTC_d6480.dir/build.make CMakeFiles/cmTC_d6480.dir/build
make[2]: Entering directory '/home/buildbot/slave/monero-static-win32/build/build/release/CMakeFiles/CMakeTmp'
Building C object CMakeFiles/cmTC_d6480.dir/CheckFunctionExists.c.obj

/C/msys32/mingw32/bin/i686-w64-mingw32-gcc.exe   -DCHECK_FUNCTION_EXISTS=setresuid   -o CMakeFiles/cmTC_d6480.dir/CheckFunctionExists.c.obj   -c /C/msys32/mingw32/share/cmake-3.12/Modules/CheckFunctionExists.c
Linking C executable cmTC_d6480.exe

/C/msys32/mingw32/bin/cmake.exe -E remove -f CMakeFiles/cmTC_d6480.dir/objects.a
ar cr CMakeFiles/cmTC_d6480.dir/objects.a "CMakeFiles/cmTC_d6480.dir/CheckFunctionExists.c.obj" 
/C/msys32/mingw32/bin/i686-w64-mingw32-gcc.exe  -DCHECK_FUNCTION_EXISTS=setresuid    -Wl,--whole-archive CMakeFiles/cmTC_d6480.dir/objects.a -Wl,--no-whole-archive  -o cmTC_d6480.exe -Wl,--major-image-version,0,--minor-image-version,0 -liphlpapi -lws2_32 -lkernel32 -luser32 -lgdi32 -lwinspool -lshell32 -lole32 -loleaut32 -luuid -lcomdlg32 -ladvapi32 
CMakeFiles/cmTC_d6480.dir/objects.a(CheckFunctionExists.c.obj):CheckFunctionExists.c:(.text+0xc): undefined reference to `setresuid'

collect2.exe: error: ld returned 1 exit status

make[2]: *** [CMakeFiles/cmTC_d6480.dir/build.make:88: cmTC_d6480.exe] Error 1
make[2]: Leaving directory '/home/buildbot/slave/monero-static-win32/build/build/release/CMakeFiles/CMakeTmp'
make[1]: *** [Makefile:121: cmTC_d6480/fast] Error 2
make[1]: Leaving directory '/home/buildbot/slave/monero-static-win32/build/build/release/CMakeFiles/CMakeTmp'


Determining if the function setreuid exists failed with the following output:
Change Dir: C:/msys32/home/buildbot/slave/monero-static-win32/build/build/release/CMakeFiles/CMakeTmp

Run Build Command:"C:/msys32/usr/bin/make.exe" "cmTC_83798/fast"
make[1]: Entering directory '/home/buildbot/slave/monero-static-win32/build/build/release/CMakeFiles/CMakeTmp'
/usr/bin/make -f CMakeFiles/cmTC_83798.dir/build.make CMakeFiles/cmTC_83798.dir/build
make[2]: Entering directory '/home/buildbot/slave/monero-static-win32/build/build/release/CMakeFiles/CMakeTmp'
Building C object CMakeFiles/cmTC_83798.dir/CheckFunctionExists.c.obj

/C/msys32/mingw32/bin/i686-w64-mingw32-gcc.exe   -DCHECK_FUNCTION_EXISTS=setreuid   -o CMakeFiles/cmTC_83798.dir/CheckFunctionExists.c.obj   -c /C/msys32/mingw32/share/cmake-3.12/Modules/CheckFunctionExists.c
Linking C executable cmTC_83798.exe

/C/msys32/mingw32/bin/cmake.exe -E remove -f CMakeFiles/cmTC_83798.dir/objects.a
ar cr CMakeFiles/cmTC_83798.dir/objects.a "CMakeFiles/cmTC_83798.dir/CheckFunctionExists.c.obj" 
/C/msys32/mingw32/bin/i686-w64-mingw32-gcc.exe  -DCHECK_FUNCTION_EXISTS=setreuid    -Wl,--whole-archive CMakeFiles/cmTC_83798.dir/objects.a -Wl,--no-whole-archive  -o cmTC_83798.exe -Wl,--major-image-version,0,--minor-image-version,0 -liphlpapi -lws2_32 -lkernel32 -luser32 -lgdi32 -lwinspool -lshell32 -lole32 -loleaut32 -luuid -lcomdlg32 -ladvapi32 
CMakeFiles/cmTC_83798.dir/objects.a(CheckFunctionExists.c.obj):CheckFunctionExists.c:(.text+0xc): undefined reference to `setreuid'

collect2.exe: error: ld returned 1 exit status

make[2]: *** [CMakeFiles/cmTC_83798.dir/build.make:88: cmTC_83798.exe] Error 1
make[2]: Leaving directory '/home/buildbot/slave/monero-static-win32/build/build/release/CMakeFiles/CMakeTmp'
make[1]: *** [Makefile:121: cmTC_83798/fast] Error 2
make[1]: Leaving directory '/home/buildbot/slave/monero-static-win32/build/build/release/CMakeFiles/CMakeTmp'


Determining if the function setrlimit exists failed with the following output:
Change Dir: C:/msys32/home/buildbot/slave/monero-static-win32/build/build/release/CMakeFiles/CMakeTmp

Run Build Command:"C:/msys32/usr/bin/make.exe" "cmTC_0cb7c/fast"
make[1]: Entering directory '/home/buildbot/slave/monero-static-win32/build/build/release/CMakeFiles/CMakeTmp'
/usr/bin/make -f CMakeFiles/cmTC_0cb7c.dir/build.make CMakeFiles/cmTC_0cb7c.dir/build
make[2]: Entering directory '/home/buildbot/slave/monero-static-win32/build/build/release/CMakeFiles/CMakeTmp'
Building C object CMakeFiles/cmTC_0cb7c.dir/CheckFunctionExists.c.obj

/C/msys32/mingw32/bin/i686-w64-mingw32-gcc.exe   -DCHECK_FUNCTION_EXISTS=setrlimit   -o CMakeFiles/cmTC_0cb7c.dir/CheckFunctionExists.c.obj   -c /C/msys32/mingw32/share/cmake-3.12/Modules/CheckFunctionExists.c
Linking C executable cmTC_0cb7c.exe

/C/msys32/mingw32/bin/cmake.exe -E remove -f CMakeFiles/cmTC_0cb7c.dir/objects.a
ar cr CMakeFiles/cmTC_0cb7c.dir/objects.a "CMakeFiles/cmTC_0cb7c.dir/CheckFunctionExists.c.obj" 
/C/msys32/mingw32/bin/i686-w64-mingw32-gcc.exe  -DCHECK_FUNCTION_EXISTS=setrlimit    -Wl,--whole-archive CMakeFiles/cmTC_0cb7c.dir/objects.a -Wl,--no-whole-archive  -o cmTC_0cb7c.exe -Wl,--major-image-version,0,--minor-image-version,0 -liphlpapi -lws2_32 -lkernel32 -luser32 -lgdi32 -lwinspool -lshell32 -lole32 -loleaut32 -luuid -lcomdlg32 -ladvapi32 
CMakeFiles/cmTC_0cb7c.dir/objects.a(CheckFunctionExists.c.obj):CheckFunctionExists.c:(.text+0xc): undefined reference to `setrlimit'

collect2.exe: error: ld returned 1 exit status

make[2]: *** [CMakeFiles/cmTC_0cb7c.dir/build.make:88: cmTC_0cb7c.exe] Error 1
make[2]: Leaving directory '/home/buildbot/slave/monero-static-win32/build/build/release/CMakeFiles/CMakeTmp'
make[1]: *** [Makefile:121: cmTC_0cb7c/fast] Error 2
make[1]: Leaving directory '/home/buildbot/slave/monero-static-win32/build/build/release/CMakeFiles/CMakeTmp'


Determining if the function setsid exists failed with the following output:
Change Dir: C:/msys32/home/buildbot/slave/monero-static-win32/build/build/release/CMakeFiles/CMakeTmp

Run Build Command:"C:/msys32/usr/bin/make.exe" "cmTC_c86cb/fast"
make[1]: Entering directory '/home/buildbot/slave/monero-static-win32/build/build/release/CMakeFiles/CMakeTmp'
/usr/bin/make -f CMakeFiles/cmTC_c86cb.dir/build.make CMakeFiles/cmTC_c86cb.dir/build
make[2]: Entering directory '/home/buildbot/slave/monero-static-win32/build/build/release/CMakeFiles/CMakeTmp'
Building C object CMakeFiles/cmTC_c86cb.dir/CheckFunctionExists.c.obj

/C/msys32/mingw32/bin/i686-w64-mingw32-gcc.exe   -DCHECK_FUNCTION_EXISTS=setsid   -o CMakeFiles/cmTC_c86cb.dir/CheckFunctionExists.c.obj   -c /C/msys32/mingw32/share/cmake-3.12/Modules/CheckFunctionExists.c
Linking C executable cmTC_c86cb.exe

/C/msys32/mingw32/bin/cmake.exe -E remove -f CMakeFiles/cmTC_c86cb.dir/objects.a
ar cr CMakeFiles/cmTC_c86cb.dir/objects.a "CMakeFiles/cmTC_c86cb.dir/CheckFunctionExists.c.obj" 
/C/msys32/mingw32/bin/i686-w64-mingw32-gcc.exe  -DCHECK_FUNCTION_EXISTS=setsid    -Wl,--whole-archive CMakeFiles/cmTC_c86cb.dir/objects.a -Wl,--no-whole-archive  -o cmTC_c86cb.exe -Wl,--major-image-version,0,--minor-image-version,0 -liphlpapi -lws2_32 -lkernel32 -luser32 -lgdi32 -lwinspool -lshell32 -lole32 -loleaut32 -luuid -lcomdlg32 -ladvapi32 
CMakeFiles/cmTC_c86cb.dir/objects.a(CheckFunctionExists.c.obj):CheckFunctionExists.c:(.text+0xc): undefined reference to `setsid'

collect2.exe: error: ld returned 1 exit status

make[2]: *** [CMakeFiles/cmTC_c86cb.dir/build.make:88: cmTC_c86cb.exe] Error 1
make[2]: Leaving directory '/home/buildbot/slave/monero-static-win32/build/build/release/CMakeFiles/CMakeTmp'
make[1]: *** [Makefile:121: cmTC_c86cb/fast] Error 2
make[1]: Leaving directory '/home/buildbot/slave/monero-static-win32/build/build/release/CMakeFiles/CMakeTmp'


Determining if the function setusercontent exists failed with the following output:
Change Dir: C:/msys32/home/buildbot/slave/monero-static-win32/build/build/release/CMakeFiles/CMakeTmp

Run Build Command:"C:/msys32/usr/bin/make.exe" "cmTC_5cf52/fast"
make[1]: Entering directory '/home/buildbot/slave/monero-static-win32/build/build/release/CMakeFiles/CMakeTmp'
/usr/bin/make -f CMakeFiles/cmTC_5cf52.dir/build.make CMakeFiles/cmTC_5cf52.dir/build
make[2]: Entering directory '/home/buildbot/slave/monero-static-win32/build/build/release/CMakeFiles/CMakeTmp'
Building C object CMakeFiles/cmTC_5cf52.dir/CheckFunctionExists.c.obj

/C/msys32/mingw32/bin/i686-w64-mingw32-gcc.exe   -DCHECK_FUNCTION_EXISTS=setusercontent   -o CMakeFiles/cmTC_5cf52.dir/CheckFunctionExists.c.obj   -c /C/msys32/mingw32/share/cmake-3.12/Modules/CheckFunctionExists.c
Linking C executable cmTC_5cf52.exe

/C/msys32/mingw32/bin/cmake.exe -E remove -f CMakeFiles/cmTC_5cf52.dir/objects.a
ar cr CMakeFiles/cmTC_5cf52.dir/objects.a "CMakeFiles/cmTC_5cf52.dir/CheckFunctionExists.c.obj" 
/C/msys32/mingw32/bin/i686-w64-mingw32-gcc.exe  -DCHECK_FUNCTION_EXISTS=setusercontent    -Wl,--whole-archive CMakeFiles/cmTC_5cf52.dir/objects.a -Wl,--no-whole-archive  -o cmTC_5cf52.exe -Wl,--major-image-version,0,--minor-image-version,0 -liphlpapi -lws2_32 -lkernel32 -luser32 -lgdi32 -lwinspool -lshell32 -lole32 -loleaut32 -luuid -lcomdlg32 -ladvapi32 
CMakeFiles/cmTC_5cf52.dir/objects.a(CheckFunctionExists.c.obj):CheckFunctionExists.c:(.text+0xc): undefined reference to `setusercontent'

collect2.exe: error: ld returned 1 exit status

make[2]: *** [CMakeFiles/cmTC_5cf52.dir/build.make:88: cmTC_5cf52.exe] Error 1
make[2]: Leaving directory '/home/buildbot/slave/monero-static-win32/build/build/release/CMakeFiles/CMakeTmp'
make[1]: *** [Makefile:121: cmTC_5cf52/fast] Error 2
make[1]: Leaving directory '/home/buildbot/slave/monero-static-win32/build/build/release/CMakeFiles/CMakeTmp'


Determining if the function sigprocmask exists failed with the following output:
Change Dir: C:/msys32/home/buildbot/slave/monero-static-win32/build/build/release/CMakeFiles/CMakeTmp

Run Build Command:"C:/msys32/usr/bin/make.exe" "cmTC_3971a/fast"
make[1]: Entering directory '/home/buildbot/slave/monero-static-win32/build/build/release/CMakeFiles/CMakeTmp'
/usr/bin/make -f CMakeFiles/cmTC_3971a.dir/build.make CMakeFiles/cmTC_3971a.dir/build
make[2]: Entering directory '/home/buildbot/slave/monero-static-win32/build/build/release/CMakeFiles/CMakeTmp'
Building C object CMakeFiles/cmTC_3971a.dir/CheckFunctionExists.c.obj

/C/msys32/mingw32/bin/i686-w64-mingw32-gcc.exe   -DCHECK_FUNCTION_EXISTS=sigprocmask   -o CMakeFiles/cmTC_3971a.dir/CheckFunctionExists.c.obj   -c /C/msys32/mingw32/share/cmake-3.12/Modules/CheckFunctionExists.c
Linking C executable cmTC_3971a.exe

/C/msys32/mingw32/bin/cmake.exe -E remove -f CMakeFiles/cmTC_3971a.dir/objects.a
ar cr CMakeFiles/cmTC_3971a.dir/objects.a "CMakeFiles/cmTC_3971a.dir/CheckFunctionExists.c.obj" 
/C/msys32/mingw32/bin/i686-w64-mingw32-gcc.exe  -DCHECK_FUNCTION_EXISTS=sigprocmask    -Wl,--whole-archive CMakeFiles/cmTC_3971a.dir/objects.a -Wl,--no-whole-archive  -o cmTC_3971a.exe -Wl,--major-image-version,0,--minor-image-version,0 -liphlpapi -lws2_32 -lkernel32 -luser32 -lgdi32 -lwinspool -lshell32 -lole32 -loleaut32 -luuid -lcomdlg32 -ladvapi32 
CMakeFiles/cmTC_3971a.dir/objects.a(CheckFunctionExists.c.obj):CheckFunctionExists.c:(.text+0xc): undefined reference to `sigprocmask'

collect2.exe: error: ld returned 1 exit status

make[2]: *** [CMakeFiles/cmTC_3971a.dir/build.make:88: cmTC_3971a.exe] Error 1
make[2]: Leaving directory '/home/buildbot/slave/monero-static-win32/build/build/release/CMakeFiles/CMakeTmp'
make[1]: *** [Makefile:121: cmTC_3971a/fast] Error 2
make[1]: Leaving directory '/home/buildbot/slave/monero-static-win32/build/build/release/CMakeFiles/CMakeTmp'


Determining if the function socketpair exists failed with the following output:
Change Dir: C:/msys32/home/buildbot/slave/monero-static-win32/build/build/release/CMakeFiles/CMakeTmp

Run Build Command:"C:/msys32/usr/bin/make.exe" "cmTC_96caa/fast"
make[1]: Entering directory '/home/buildbot/slave/monero-static-win32/build/build/release/CMakeFiles/CMakeTmp'
/usr/bin/make -f CMakeFiles/cmTC_96caa.dir/build.make CMakeFiles/cmTC_96caa.dir/build
make[2]: Entering directory '/home/buildbot/slave/monero-static-win32/build/build/release/CMakeFiles/CMakeTmp'
Building C object CMakeFiles/cmTC_96caa.dir/CheckFunctionExists.c.obj

/C/msys32/mingw32/bin/i686-w64-mingw32-gcc.exe   -DCHECK_FUNCTION_EXISTS=socketpair   -o CMakeFiles/cmTC_96caa.dir/CheckFunctionExists.c.obj   -c /C/msys32/mingw32/share/cmake-3.12/Modules/CheckFunctionExists.c
Linking C executable cmTC_96caa.exe

/C/msys32/mingw32/bin/cmake.exe -E remove -f CMakeFiles/cmTC_96caa.dir/objects.a
ar cr CMakeFiles/cmTC_96caa.dir/objects.a "CMakeFiles/cmTC_96caa.dir/CheckFunctionExists.c.obj" 
/C/msys32/mingw32/bin/i686-w64-mingw32-gcc.exe  -DCHECK_FUNCTION_EXISTS=socketpair    -Wl,--whole-archive CMakeFiles/cmTC_96caa.dir/objects.a -Wl,--no-whole-archive  -o cmTC_96caa.exe -Wl,--major-image-version,0,--minor-image-version,0 -liphlpapi -lws2_32 -lkernel32 -luser32 -lgdi32 -lwinspool -lshell32 -lole32 -loleaut32 -luuid -lcomdlg32 -ladvapi32 
CMakeFiles/cmTC_96caa.dir/objects.a(CheckFunctionExists.c.obj):CheckFunctionExists.c:(.text+0xc): undefined reference to `socketpair'

collect2.exe: error: ld returned 1 exit status

make[2]: *** [CMakeFiles/cmTC_96caa.dir/build.make:88: cmTC_96caa.exe] Error 1
make[2]: Leaving directory '/home/buildbot/slave/monero-static-win32/build/build/release/CMakeFiles/CMakeTmp'
make[1]: *** [Makefile:121: cmTC_96caa/fast] Error 2
make[1]: Leaving directory '/home/buildbot/slave/monero-static-win32/build/build/release/CMakeFiles/CMakeTmp'


Determining if the function srandom exists failed with the following output:
Change Dir: C:/msys32/home/buildbot/slave/monero-static-win32/build/build/release/CMakeFiles/CMakeTmp

Run Build Command:"C:/msys32/usr/bin/make.exe" "cmTC_d9720/fast"
make[1]: Entering directory '/home/buildbot/slave/monero-static-win32/build/build/release/CMakeFiles/CMakeTmp'
/usr/bin/make -f CMakeFiles/cmTC_d9720.dir/build.make CMakeFiles/cmTC_d9720.dir/build
make[2]: Entering directory '/home/buildbot/slave/monero-static-win32/build/build/release/CMakeFiles/CMakeTmp'
Building C object CMakeFiles/cmTC_d9720.dir/CheckFunctionExists.c.obj

/C/msys32/mingw32/bin/i686-w64-mingw32-gcc.exe   -DCHECK_FUNCTION_EXISTS=srandom   -o CMakeFiles/cmTC_d9720.dir/CheckFunctionExists.c.obj   -c /C/msys32/mingw32/share/cmake-3.12/Modules/CheckFunctionExists.c
Linking C executable cmTC_d9720.exe

/C/msys32/mingw32/bin/cmake.exe -E remove -f CMakeFiles/cmTC_d9720.dir/objects.a
ar cr CMakeFiles/cmTC_d9720.dir/objects.a "CMakeFiles/cmTC_d9720.dir/CheckFunctionExists.c.obj" 
/C/msys32/mingw32/bin/i686-w64-mingw32-gcc.exe  -DCHECK_FUNCTION_EXISTS=srandom    -Wl,--whole-archive CMakeFiles/cmTC_d9720.dir/objects.a -Wl,--no-whole-archive  -o cmTC_d9720.exe -Wl,--major-image-version,0,--minor-image-version,0 -liphlpapi -lws2_32 -lkernel32 -luser32 -lgdi32 -lwinspool -lshell32 -lole32 -loleaut32 -luuid -lcomdlg32 -ladvapi32 
CMakeFiles/cmTC_d9720.dir/objects.a(CheckFunctionExists.c.obj):CheckFunctionExists.c:(.text+0xc): undefined reference to `srandom'

collect2.exe: error: ld returned 1 exit status

make[2]: *** [CMakeFiles/cmTC_d9720.dir/build.make:88: cmTC_d9720.exe] Error 1
make[2]: Leaving directory '/home/buildbot/slave/monero-static-win32/build/build/release/CMakeFiles/CMakeTmp'
make[1]: *** [Makefile:121: cmTC_d9720/fast] Error 2
make[1]: Leaving directory '/home/buildbot/slave/monero-static-win32/build/build/release/CMakeFiles/CMakeTmp'


Determining if the function strsep exists failed with the following output:
Change Dir: C:/msys32/home/buildbot/slave/monero-static-win32/build/build/release/CMakeFiles/CMakeTmp

Run Build Command:"C:/msys32/usr/bin/make.exe" "cmTC_e3e42/fast"
make[1]: Entering directory '/home/buildbot/slave/monero-static-win32/build/build/release/CMakeFiles/CMakeTmp'
/usr/bin/make -f CMakeFiles/cmTC_e3e42.dir/build.make CMakeFiles/cmTC_e3e42.dir/build
make[2]: Entering directory '/home/buildbot/slave/monero-static-win32/build/build/release/CMakeFiles/CMakeTmp'
Building C object CMakeFiles/cmTC_e3e42.dir/CheckFunctionExists.c.obj

/C/msys32/mingw32/bin/i686-w64-mingw32-gcc.exe   -DCHECK_FUNCTION_EXISTS=strsep   -o CMakeFiles/cmTC_e3e42.dir/CheckFunctionExists.c.obj   -c /C/msys32/mingw32/share/cmake-3.12/Modules/CheckFunctionExists.c
Linking C executable cmTC_e3e42.exe

/C/msys32/mingw32/bin/cmake.exe -E remove -f CMakeFiles/cmTC_e3e42.dir/objects.a
ar cr CMakeFiles/cmTC_e3e42.dir/objects.a "CMakeFiles/cmTC_e3e42.dir/CheckFunctionExists.c.obj" 
/C/msys32/mingw32/bin/i686-w64-mingw32-gcc.exe  -DCHECK_FUNCTION_EXISTS=strsep    -Wl,--whole-archive CMakeFiles/cmTC_e3e42.dir/objects.a -Wl,--no-whole-archive  -o cmTC_e3e42.exe -Wl,--major-image-version,0,--minor-image-version,0 -liphlpapi -lws2_32 -lkernel32 -luser32 -lgdi32 -lwinspool -lshell32 -lole32 -loleaut32 -luuid -lcomdlg32 -ladvapi32 
CMakeFiles/cmTC_e3e42.dir/objects.a(CheckFunctionExists.c.obj):CheckFunctionExists.c:(.text+0xc): undefined reference to `strsep'

collect2.exe: error: ld returned 1 exit status

make[2]: *** [CMakeFiles/cmTC_e3e42.dir/build.make:88: cmTC_e3e42.exe] Error 1
make[2]: Leaving directory '/home/buildbot/slave/monero-static-win32/build/build/release/CMakeFiles/CMakeTmp'
make[1]: *** [Makefile:121: cmTC_e3e42/fast] Error 2
make[1]: Leaving directory '/home/buildbot/slave/monero-static-win32/build/build/release/CMakeFiles/CMakeTmp'


Determining if the function strlcat exists failed with the following output:
Change Dir: C:/msys32/home/buildbot/slave/monero-static-win32/build/build/release/CMakeFiles/CMakeTmp

Run Build Command:"C:/msys32/usr/bin/make.exe" "cmTC_fed94/fast"
make[1]: Entering directory '/home/buildbot/slave/monero-static-win32/build/build/release/CMakeFiles/CMakeTmp'
/usr/bin/make -f CMakeFiles/cmTC_fed94.dir/build.make CMakeFiles/cmTC_fed94.dir/build
make[2]: Entering directory '/home/buildbot/slave/monero-static-win32/build/build/release/CMakeFiles/CMakeTmp'
Building C object CMakeFiles/cmTC_fed94.dir/CheckFunctionExists.c.obj

/C/msys32/mingw32/bin/i686-w64-mingw32-gcc.exe   -DCHECK_FUNCTION_EXISTS=strlcat   -o CMakeFiles/cmTC_fed94.dir/CheckFunctionExists.c.obj   -c /C/msys32/mingw32/share/cmake-3.12/Modules/CheckFunctionExists.c
Linking C executable cmTC_fed94.exe

/C/msys32/mingw32/bin/cmake.exe -E remove -f CMakeFiles/cmTC_fed94.dir/objects.a
ar cr CMakeFiles/cmTC_fed94.dir/objects.a "CMakeFiles/cmTC_fed94.dir/CheckFunctionExists.c.obj" 
/C/msys32/mingw32/bin/i686-w64-mingw32-gcc.exe  -DCHECK_FUNCTION_EXISTS=strlcat    -Wl,--whole-archive CMakeFiles/cmTC_fed94.dir/objects.a -Wl,--no-whole-archive  -o cmTC_fed94.exe -Wl,--major-image-version,0,--minor-image-version,0 -liphlpapi -lws2_32 -lkernel32 -luser32 -lgdi32 -lwinspool -lshell32 -lole32 -loleaut32 -luuid -lcomdlg32 -ladvapi32 
CMakeFiles/cmTC_fed94.dir/objects.a(CheckFunctionExists.c.obj):CheckFunctionExists.c:(.text+0xc): undefined reference to `strlcat'

collect2.exe: error: ld returned 1 exit status

make[2]: *** [CMakeFiles/cmTC_fed94.dir/build.make:88: cmTC_fed94.exe] Error 1
make[2]: Leaving directory '/home/buildbot/slave/monero-static-win32/build/build/release/CMakeFiles/CMakeTmp'
make[1]: *** [Makefile:121: cmTC_fed94/fast] Error 2
make[1]: Leaving directory '/home/buildbot/slave/monero-static-win32/build/build/release/CMakeFiles/CMakeTmp'


Determining if the function strlcpy exists failed with the following output:
Change Dir: C:/msys32/home/buildbot/slave/monero-static-win32/build/build/release/CMakeFiles/CMakeTmp

Run Build Command:"C:/msys32/usr/bin/make.exe" "cmTC_8b25d/fast"
make[1]: Entering directory '/home/buildbot/slave/monero-static-win32/build/build/release/CMakeFiles/CMakeTmp'
/usr/bin/make -f CMakeFiles/cmTC_8b25d.dir/build.make CMakeFiles/cmTC_8b25d.dir/build
make[2]: Entering directory '/home/buildbot/slave/monero-static-win32/build/build/release/CMakeFiles/CMakeTmp'
Building C object CMakeFiles/cmTC_8b25d.dir/CheckFunctionExists.c.obj

/C/msys32/mingw32/bin/i686-w64-mingw32-gcc.exe   -DCHECK_FUNCTION_EXISTS=strlcpy   -o CMakeFiles/cmTC_8b25d.dir/CheckFunctionExists.c.obj   -c /C/msys32/mingw32/share/cmake-3.12/Modules/CheckFunctionExists.c
Linking C executable cmTC_8b25d.exe

/C/msys32/mingw32/bin/cmake.exe -E remove -f CMakeFiles/cmTC_8b25d.dir/objects.a
ar cr CMakeFiles/cmTC_8b25d.dir/objects.a "CMakeFiles/cmTC_8b25d.dir/CheckFunctionExists.c.obj" 
/C/msys32/mingw32/bin/i686-w64-mingw32-gcc.exe  -DCHECK_FUNCTION_EXISTS=strlcpy    -Wl,--whole-archive CMakeFiles/cmTC_8b25d.dir/objects.a -Wl,--no-whole-archive  -o cmTC_8b25d.exe -Wl,--major-image-version,0,--minor-image-version,0 -liphlpapi -lws2_32 -lkernel32 -luser32 -lgdi32 -lwinspool -lshell32 -lole32 -loleaut32 -luuid -lcomdlg32 -ladvapi32 
CMakeFiles/cmTC_8b25d.dir/objects.a(CheckFunctionExists.c.obj):CheckFunctionExists.c:(.text+0xc): undefined reference to `strlcpy'

collect2.exe: error: ld returned 1 exit status

make[2]: *** [CMakeFiles/cmTC_8b25d.dir/build.make:88: cmTC_8b25d.exe] Error 1
make[2]: Leaving directory '/home/buildbot/slave/monero-static-win32/build/build/release/CMakeFiles/CMakeTmp'
make[1]: *** [Makefile:121: cmTC_8b25d/fast] Error 2
make[1]: Leaving directory '/home/buildbot/slave/monero-static-win32/build/build/release/CMakeFiles/CMakeTmp'


Determining if the function strptime exists failed with the following output:
Change Dir: C:/msys32/home/buildbot/slave/monero-static-win32/build/build/release/CMakeFiles/CMakeTmp

Run Build Command:"C:/msys32/usr/bin/make.exe" "cmTC_a2a34/fast"
make[1]: Entering directory '/home/buildbot/slave/monero-static-win32/build/build/release/CMakeFiles/CMakeTmp'
/usr/bin/make -f CMakeFiles/cmTC_a2a34.dir/build.make CMakeFiles/cmTC_a2a34.dir/build
make[2]: Entering directory '/home/buildbot/slave/monero-static-win32/build/build/release/CMakeFiles/CMakeTmp'
Building C object CMakeFiles/cmTC_a2a34.dir/CheckFunctionExists.c.obj

/C/msys32/mingw32/bin/i686-w64-mingw32-gcc.exe   -DCHECK_FUNCTION_EXISTS=strptime   -o CMakeFiles/cmTC_a2a34.dir/CheckFunctionExists.c.obj   -c /C/msys32/mingw32/share/cmake-3.12/Modules/CheckFunctionExists.c
Linking C executable cmTC_a2a34.exe

/C/msys32/mingw32/bin/cmake.exe -E remove -f CMakeFiles/cmTC_a2a34.dir/objects.a
ar cr CMakeFiles/cmTC_a2a34.dir/objects.a "CMakeFiles/cmTC_a2a34.dir/CheckFunctionExists.c.obj" 
/C/msys32/mingw32/bin/i686-w64-mingw32-gcc.exe  -DCHECK_FUNCTION_EXISTS=strptime    -Wl,--whole-archive CMakeFiles/cmTC_a2a34.dir/objects.a -Wl,--no-whole-archive  -o cmTC_a2a34.exe -Wl,--major-image-version,0,--minor-image-version,0 -liphlpapi -lws2_32 -lkernel32 -luser32 -lgdi32 -lwinspool -lshell32 -lole32 -loleaut32 -luuid -lcomdlg32 -ladvapi32 
CMakeFiles/cmTC_a2a34.dir/objects.a(CheckFunctionExists.c.obj):CheckFunctionExists.c:(.text+0xc): undefined reference to `strptime'

collect2.exe: error: ld returned 1 exit status

make[2]: *** [CMakeFiles/cmTC_a2a34.dir/build.make:88: cmTC_a2a34.exe] Error 1
make[2]: Leaving directory '/home/buildbot/slave/monero-static-win32/build/build/release/CMakeFiles/CMakeTmp'
make[1]: *** [Makefile:121: cmTC_a2a34/fast] Error 2
make[1]: Leaving directory '/home/buildbot/slave/monero-static-win32/build/build/release/CMakeFiles/CMakeTmp'


Determining if the function writev exists failed with the following output:
Change Dir: C:/msys32/home/buildbot/slave/monero-static-win32/build/build/release/CMakeFiles/CMakeTmp

Run Build Command:"C:/msys32/usr/bin/make.exe" "cmTC_68e6a/fast"
make[1]: Entering directory '/home/buildbot/slave/monero-static-win32/build/build/release/CMakeFiles/CMakeTmp'
/usr/bin/make -f CMakeFiles/cmTC_68e6a.dir/build.make CMakeFiles/cmTC_68e6a.dir/build
make[2]: Entering directory '/home/buildbot/slave/monero-static-win32/build/build/release/CMakeFiles/CMakeTmp'
Building C object CMakeFiles/cmTC_68e6a.dir/CheckFunctionExists.c.obj

/C/msys32/mingw32/bin/i686-w64-mingw32-gcc.exe   -DCHECK_FUNCTION_EXISTS=writev   -o CMakeFiles/cmTC_68e6a.dir/CheckFunctionExists.c.obj   -c /C/msys32/mingw32/share/cmake-3.12/Modules/CheckFunctionExists.c
Linking C executable cmTC_68e6a.exe

/C/msys32/mingw32/bin/cmake.exe -E remove -f CMakeFiles/cmTC_68e6a.dir/objects.a
ar cr CMakeFiles/cmTC_68e6a.dir/objects.a "CMakeFiles/cmTC_68e6a.dir/CheckFunctionExists.c.obj" 
/C/msys32/mingw32/bin/i686-w64-mingw32-gcc.exe  -DCHECK_FUNCTION_EXISTS=writev    -Wl,--whole-archive CMakeFiles/cmTC_68e6a.dir/objects.a -Wl,--no-whole-archive  -o cmTC_68e6a.exe -Wl,--major-image-version,0,--minor-image-version,0 -liphlpapi -lws2_32 -lkernel32 -luser32 -lgdi32 -lwinspool -lshell32 -lole32 -loleaut32 -luuid -lcomdlg32 -ladvapi32 
CMakeFiles/cmTC_68e6a.dir/objects.a(CheckFunctionExists.c.obj):CheckFunctionExists.c:(.text+0xc): undefined reference to `writev'

collect2.exe: error: ld returned 1 exit status

make[2]: *** [CMakeFiles/cmTC_68e6a.dir/build.make:88: cmTC_68e6a.exe] Error 1
make[2]: Leaving directory '/home/buildbot/slave/monero-static-win32/build/build/release/CMakeFiles/CMakeTmp'
make[1]: *** [Makefile:121: cmTC_68e6a/fast] Error 2
make[1]: Leaving directory '/home/buildbot/slave/monero-static-win32/build/build/release/CMakeFiles/CMakeTmp'


Determining size of gid_t failed with the following output:
Change Dir: C:/msys32/home/buildbot/slave/monero-static-win32/build/build/release/CMakeFiles/CMakeTmp

Run Build Command:"C:/msys32/usr/bin/make.exe" "cmTC_37df6/fast"
make[1]: Entering directory '/home/buildbot/slave/monero-static-win32/build/build/release/CMakeFiles/CMakeTmp'
/usr/bin/make -f CMakeFiles/cmTC_37df6.dir/build.make CMakeFiles/cmTC_37df6.dir/build
make[2]: Entering directory '/home/buildbot/slave/monero-static-win32/build/build/release/CMakeFiles/CMakeTmp'
Building C object CMakeFiles/cmTC_37df6.dir/gid_t.c.obj

/C/msys32/mingw32/bin/i686-w64-mingw32-gcc.exe    -o CMakeFiles/cmTC_37df6.dir/gid_t.c.obj   -c /C/msys32/home/buildbot/slave/monero-static-win32/build/build/release/CMakeFiles/CheckTypeSize/gid_t.c
C:/msys32/home/buildbot/slave/monero-static-win32/build/build/release/CMakeFiles/CheckTypeSize/gid_t.c:24:22: error: 'gid_t' undeclared here (not in a function); did you mean 'pid_t'?

 #define SIZE (sizeof(gid_t))

                      ^

C:/msys32/home/buildbot/slave/monero-static-win32/build/build/release/CMakeFiles/CheckTypeSize/gid_t.c:26:12: note: in expansion of macro 'SIZE'

   ('0' + ((SIZE / 10000)%10)),

            ^~~~

make[2]: *** [CMakeFiles/cmTC_37df6.dir/build.make:66: CMakeFiles/cmTC_37df6.dir/gid_t.c.obj] Error 1
make[2]: Leaving directory '/home/buildbot/slave/monero-static-win32/build/build/release/CMakeFiles/CMakeTmp'
make[1]: *** [Makefile:121: cmTC_37df6/fast] Error 2
make[1]: Leaving directory '/home/buildbot/slave/monero-static-win32/build/build/release/CMakeFiles/CMakeTmp'

C:/msys32/home/buildbot/slave/monero-static-win32/build/build/release/CMakeFiles/CheckTypeSize/gid_t.c:
#include <sys/types.h>
#include <stdint.h>
#include <stddef.h>
#include "sys/types.h"


#undef KEY
#if defined(__i386)
# define KEY '_','_','i','3','8','6'
#elif defined(__x86_64)
# define KEY '_','_','x','8','6','_','6','4'
#elif defined(__ppc__)
# define KEY '_','_','p','p','c','_','_'
#elif defined(__ppc64__)
# define KEY '_','_','p','p','c','6','4','_','_'
#elif defined(__aarch64__)
# define KEY '_','_','a','a','r','c','h','6','4','_','_'
#elif defined(__ARM_ARCH_7A__)
# define KEY '_','_','A','R','M','_','A','R','C','H','_','7','A','_','_'
#elif defined(__ARM_ARCH_7S__)
# define KEY '_','_','A','R','M','_','A','R','C','H','_','7','S','_','_'
#endif

#define SIZE (sizeof(gid_t))
char info_size[] =  {'I', 'N', 'F', 'O', ':', 's','i','z','e','[',
  ('0' + ((SIZE / 10000)%10)),
  ('0' + ((SIZE / 1000)%10)),
  ('0' + ((SIZE / 100)%10)),
  ('0' + ((SIZE / 10)%10)),
  ('0' +  (SIZE    % 10)),
  ']',
#ifdef KEY
  ' ','k','e','y','[', KEY, ']',
#endif
  '\0'};

#ifdef __CLASSIC_C__
int main(argc, argv) int argc; char *argv[];
#else
int main(int argc, char *argv[])
#endif
{
  int require = 0;
  require += info_size[argc];
  (void)argv;
  return require;
}


Determining size of in_addr_t failed with the following output:
Change Dir: C:/msys32/home/buildbot/slave/monero-static-win32/build/build/release/CMakeFiles/CMakeTmp

Run Build Command:"C:/msys32/usr/bin/make.exe" "cmTC_257ec/fast"
make[1]: Entering directory '/home/buildbot/slave/monero-static-win32/build/build/release/CMakeFiles/CMakeTmp'
/usr/bin/make -f CMakeFiles/cmTC_257ec.dir/build.make CMakeFiles/cmTC_257ec.dir/build
make[2]: Entering directory '/home/buildbot/slave/monero-static-win32/build/build/release/CMakeFiles/CMakeTmp'
Building C object CMakeFiles/cmTC_257ec.dir/in_addr_t.c.obj

/C/msys32/mingw32/bin/i686-w64-mingw32-gcc.exe    -o CMakeFiles/cmTC_257ec.dir/in_addr_t.c.obj   -c /C/msys32/home/buildbot/slave/monero-static-win32/build/build/release/CMakeFiles/CheckTypeSize/in_addr_t.c
C:/msys32/home/buildbot/slave/monero-static-win32/build/build/release/CMakeFiles/CheckTypeSize/in_addr_t.c:4:10: fatal error: netinet/in.h: No such file or directory

 #include "netinet/in.h"

          ^~~~~~~~~~~~~~

compilation terminated.

make[2]: *** [CMakeFiles/cmTC_257ec.dir/build.make:66: CMakeFiles/cmTC_257ec.dir/in_addr_t.c.obj] Error 1
make[2]: Leaving directory '/home/buildbot/slave/monero-static-win32/build/build/release/CMakeFiles/CMakeTmp'
make[1]: *** [Makefile:121: cmTC_257ec/fast] Error 2
make[1]: Leaving directory '/home/buildbot/slave/monero-static-win32/build/build/release/CMakeFiles/CMakeTmp'

C:/msys32/home/buildbot/slave/monero-static-win32/build/build/release/CMakeFiles/CheckTypeSize/in_addr_t.c:
#include <sys/types.h>
#include <stdint.h>
#include <stddef.h>
#include "netinet/in.h"


#undef KEY
#if defined(__i386)
# define KEY '_','_','i','3','8','6'
#elif defined(__x86_64)
# define KEY '_','_','x','8','6','_','6','4'
#elif defined(__ppc__)
# define KEY '_','_','p','p','c','_','_'
#elif defined(__ppc64__)
# define KEY '_','_','p','p','c','6','4','_','_'
#elif defined(__aarch64__)
# define KEY '_','_','a','a','r','c','h','6','4','_','_'
#elif defined(__ARM_ARCH_7A__)
# define KEY '_','_','A','R','M','_','A','R','C','H','_','7','A','_','_'
#elif defined(__ARM_ARCH_7S__)
# define KEY '_','_','A','R','M','_','A','R','C','H','_','7','S','_','_'
#endif

#define SIZE (sizeof(in_addr_t))
char info_size[] =  {'I', 'N', 'F', 'O', ':', 's','i','z','e','[',
  ('0' + ((SIZE / 10000)%10)),
  ('0' + ((SIZE / 1000)%10)),
  ('0' + ((SIZE / 100)%10)),
  ('0' + ((SIZE / 10)%10)),
  ('0' +  (SIZE    % 10)),
  ']',
#ifdef KEY
  ' ','k','e','y','[', KEY, ']',
#endif
  '\0'};

#ifdef __CLASSIC_C__
int main(argc, argv) int argc; char *argv[];
#else
int main(int argc, char *argv[])
#endif
{
  int require = 0;
  require += info_size[argc];
  (void)argv;
  return require;
}


Determining size of in_port_t failed with the following output:
Change Dir: C:/msys32/home/buildbot/slave/monero-static-win32/build/build/release/CMakeFiles/CMakeTmp

Run Build Command:"C:/msys32/usr/bin/make.exe" "cmTC_2c639/fast"
make[1]: Entering directory '/home/buildbot/slave/monero-static-win32/build/build/release/CMakeFiles/CMakeTmp'
/usr/bin/make -f CMakeFiles/cmTC_2c639.dir/build.make CMakeFiles/cmTC_2c639.dir/build
make[2]: Entering directory '/home/buildbot/slave/monero-static-win32/build/build/release/CMakeFiles/CMakeTmp'
Building C object CMakeFiles/cmTC_2c639.dir/in_port_t.c.obj

/C/msys32/mingw32/bin/i686-w64-mingw32-gcc.exe    -o CMakeFiles/cmTC_2c639.dir/in_port_t.c.obj   -c /C/msys32/home/buildbot/slave/monero-static-win32/build/build/release/CMakeFiles/CheckTypeSize/in_port_t.c
C:/msys32/home/buildbot/slave/monero-static-win32/build/build/release/CMakeFiles/CheckTypeSize/in_port_t.c:4:10: fatal error: netinet/in.h: No such file or directory

 #include "netinet/in.h"

          ^~~~~~~~~~~~~~

compilation terminated.

make[2]: *** [CMakeFiles/cmTC_2c639.dir/build.make:66: CMakeFiles/cmTC_2c639.dir/in_port_t.c.obj] Error 1
make[2]: Leaving directory '/home/buildbot/slave/monero-static-win32/build/build/release/CMakeFiles/CMakeTmp'
make[1]: *** [Makefile:121: cmTC_2c639/fast] Error 2
make[1]: Leaving directory '/home/buildbot/slave/monero-static-win32/build/build/release/CMakeFiles/CMakeTmp'

C:/msys32/home/buildbot/slave/monero-static-win32/build/build/release/CMakeFiles/CheckTypeSize/in_port_t.c:
#include <sys/types.h>
#include <stdint.h>
#include <stddef.h>
#include "netinet/in.h"


#undef KEY
#if defined(__i386)
# define KEY '_','_','i','3','8','6'
#elif defined(__x86_64)
# define KEY '_','_','x','8','6','_','6','4'
#elif defined(__ppc__)
# define KEY '_','_','p','p','c','_','_'
#elif defined(__ppc64__)
# define KEY '_','_','p','p','c','6','4','_','_'
#elif defined(__aarch64__)
# define KEY '_','_','a','a','r','c','h','6','4','_','_'
#elif defined(__ARM_ARCH_7A__)
# define KEY '_','_','A','R','M','_','A','R','C','H','_','7','A','_','_'
#elif defined(__ARM_ARCH_7S__)
# define KEY '_','_','A','R','M','_','A','R','C','H','_','7','S','_','_'
#endif

#define SIZE (sizeof(in_port_t))
char info_size[] =  {'I', 'N', 'F', 'O', ':', 's','i','z','e','[',
  ('0' + ((SIZE / 10000)%10)),
  ('0' + ((SIZE / 1000)%10)),
  ('0' + ((SIZE / 100)%10)),
  ('0' + ((SIZE / 10)%10)),
  ('0' +  (SIZE    % 10)),
  ']',
#ifdef KEY
  ' ','k','e','y','[', KEY, ']',
#endif
  '\0'};

#ifdef __CLASSIC_C__
int main(argc, argv) int argc; char *argv[];
#else
int main(int argc, char *argv[])
#endif
{
  int require = 0;
  require += info_size[argc];
  (void)argv;
  return require;
}


Determining size of rlim_t failed with the following output:
Change Dir: C:/msys32/home/buildbot/slave/monero-static-win32/build/build/release/CMakeFiles/CMakeTmp

Run Build Command:"C:/msys32/usr/bin/make.exe" "cmTC_2a1ff/fast"
make[1]: Entering directory '/home/buildbot/slave/monero-static-win32/build/build/release/CMakeFiles/CMakeTmp'
/usr/bin/make -f CMakeFiles/cmTC_2a1ff.dir/build.make CMakeFiles/cmTC_2a1ff.dir/build
make[2]: Entering directory '/home/buildbot/slave/monero-static-win32/build/build/release/CMakeFiles/CMakeTmp'
Building C object CMakeFiles/cmTC_2a1ff.dir/rlim_t.c.obj

/C/msys32/mingw32/bin/i686-w64-mingw32-gcc.exe    -o CMakeFiles/cmTC_2a1ff.dir/rlim_t.c.obj   -c /C/msys32/home/buildbot/slave/monero-static-win32/build/build/release/CMakeFiles/CheckTypeSize/rlim_t.c
C:/msys32/home/buildbot/slave/monero-static-win32/build/build/release/CMakeFiles/CheckTypeSize/rlim_t.c:4:10: fatal error: sys/resource.h: No such file or directory

 #include "sys/resource.h"

          ^~~~~~~~~~~~~~~~

compilation terminated.

make[2]: *** [CMakeFiles/cmTC_2a1ff.dir/build.make:66: CMakeFiles/cmTC_2a1ff.dir/rlim_t.c.obj] Error 1
make[2]: Leaving directory '/home/buildbot/slave/monero-static-win32/build/build/release/CMakeFiles/CMakeTmp'
make[1]: *** [Makefile:121: cmTC_2a1ff/fast] Error 2
make[1]: Leaving directory '/home/buildbot/slave/monero-static-win32/build/build/release/CMakeFiles/CMakeTmp'

C:/msys32/home/buildbot/slave/monero-static-win32/build/build/release/CMakeFiles/CheckTypeSize/rlim_t.c:
#include <sys/types.h>
#include <stdint.h>
#include <stddef.h>
#include "sys/resource.h"


#undef KEY
#if defined(__i386)
# define KEY '_','_','i','3','8','6'
#elif defined(__x86_64)
# define KEY '_','_','x','8','6','_','6','4'
#elif defined(__ppc__)
# define KEY '_','_','p','p','c','_','_'
#elif defined(__ppc64__)
# define KEY '_','_','p','p','c','6','4','_','_'
#elif defined(__aarch64__)
# define KEY '_','_','a','a','r','c','h','6','4','_','_'
#elif defined(__ARM_ARCH_7A__)
# define KEY '_','_','A','R','M','_','A','R','C','H','_','7','A','_','_'
#elif defined(__ARM_ARCH_7S__)
# define KEY '_','_','A','R','M','_','A','R','C','H','_','7','S','_','_'
#endif

#define SIZE (sizeof(rlim_t))
char info_size[] =  {'I', 'N', 'F', 'O', ':', 's','i','z','e','[',
  ('0' + ((SIZE / 10000)%10)),
  ('0' + ((SIZE / 1000)%10)),
  ('0' + ((SIZE / 100)%10)),
  ('0' + ((SIZE / 10)%10)),
  ('0' +  (SIZE    % 10)),
  ']',
#ifdef KEY
  ' ','k','e','y','[', KEY, ']',
#endif
  '\0'};

#ifdef __CLASSIC_C__
int main(argc, argv) int argc; char *argv[];
#else
int main(int argc, char *argv[])
#endif
{
  int require = 0;
  require += info_size[argc];
  (void)argv;
  return require;
}


Determining size of uid_t failed with the following output:
Change Dir: C:/msys32/home/buildbot/slave/monero-static-win32/build/build/release/CMakeFiles/CMakeTmp

Run Build Command:"C:/msys32/usr/bin/make.exe" "cmTC_734a5/fast"
make[1]: Entering directory '/home/buildbot/slave/monero-static-win32/build/build/release/CMakeFiles/CMakeTmp'
/usr/bin/make -f CMakeFiles/cmTC_734a5.dir/build.make CMakeFiles/cmTC_734a5.dir/build
make[2]: Entering directory '/home/buildbot/slave/monero-static-win32/build/build/release/CMakeFiles/CMakeTmp'
Building C object CMakeFiles/cmTC_734a5.dir/uid_t.c.obj

/C/msys32/mingw32/bin/i686-w64-mingw32-gcc.exe    -o CMakeFiles/cmTC_734a5.dir/uid_t.c.obj   -c /C/msys32/home/buildbot/slave/monero-static-win32/build/build/release/CMakeFiles/CheckTypeSize/uid_t.c
C:/msys32/home/buildbot/slave/monero-static-win32/build/build/release/CMakeFiles/CheckTypeSize/uid_t.c:24:22: error: 'uid_t' undeclared here (not in a function); did you mean 'pid_t'?

 #define SIZE (sizeof(uid_t))

                      ^

C:/msys32/home/buildbot/slave/monero-static-win32/build/build/release/CMakeFiles/CheckTypeSize/uid_t.c:26:12: note: in expansion of macro 'SIZE'

   ('0' + ((SIZE / 10000)%10)),

            ^~~~

make[2]: *** [CMakeFiles/cmTC_734a5.dir/build.make:66: CMakeFiles/cmTC_734a5.dir/uid_t.c.obj] Error 1
make[2]: Leaving directory '/home/buildbot/slave/monero-static-win32/build/build/release/CMakeFiles/CMakeTmp'
make[1]: *** [Makefile:121: cmTC_734a5/fast] Error 2
make[1]: Leaving directory '/home/buildbot/slave/monero-static-win32/build/build/release/CMakeFiles/CMakeTmp'

C:/msys32/home/buildbot/slave/monero-static-win32/build/build/release/CMakeFiles/CheckTypeSize/uid_t.c:
#include <sys/types.h>
#include <stdint.h>
#include <stddef.h>
#include "sys/types.h"


#undef KEY
#if defined(__i386)
# define KEY '_','_','i','3','8','6'
#elif defined(__x86_64)
# define KEY '_','_','x','8','6','_','6','4'
#elif defined(__ppc__)
# define KEY '_','_','p','p','c','_','_'
#elif defined(__ppc64__)
# define KEY '_','_','p','p','c','6','4','_','_'
#elif defined(__aarch64__)
# define KEY '_','_','a','a','r','c','h','6','4','_','_'
#elif defined(__ARM_ARCH_7A__)
# define KEY '_','_','A','R','M','_','A','R','C','H','_','7','A','_','_'
#elif defined(__ARM_ARCH_7S__)
# define KEY '_','_','A','R','M','_','A','R','C','H','_','7','S','_','_'
#endif

#define SIZE (sizeof(uid_t))
char info_size[] =  {'I', 'N', 'F', 'O', ':', 's','i','z','e','[',
  ('0' + ((SIZE / 10000)%10)),
  ('0' + ((SIZE / 1000)%10)),
  ('0' + ((SIZE / 100)%10)),
  ('0' + ((SIZE / 10)%10)),
  ('0' +  (SIZE    % 10)),
  ']',
#ifdef KEY
  ' ','k','e','y','[', KEY, ']',
#endif
  '\0'};

#ifdef __CLASSIC_C__
int main(argc, argv) int argc; char *argv[];
#else
int main(int argc, char *argv[])
#endif
{
  int require = 0;
  require += info_size[argc];
  (void)argv;
  return require;
}


Determining if the pthread_rwlock_t exist failed with the following output:
Change Dir: C:/msys32/home/buildbot/slave/monero-static-win32/build/build/release/CMakeFiles/CMakeTmp

Run Build Command:"C:/msys32/usr/bin/make.exe" "cmTC_b2c36/fast"
make[1]: Entering directory '/home/buildbot/slave/monero-static-win32/build/build/release/CMakeFiles/CMakeTmp'
/usr/bin/make -f CMakeFiles/cmTC_b2c36.dir/build.make CMakeFiles/cmTC_b2c36.dir/build
make[2]: Entering directory '/home/buildbot/slave/monero-static-win32/build/build/release/CMakeFiles/CMakeTmp'
Building C object CMakeFiles/cmTC_b2c36.dir/CheckSymbolExists.c.obj

/C/msys32/mingw32/bin/i686-w64-mingw32-gcc.exe    -o CMakeFiles/cmTC_b2c36.dir/CheckSymbolExists.c.obj   -c /C/msys32/home/buildbot/slave/monero-static-win32/build/build/release/CMakeFiles/CMakeTmp/CheckSymbolExists.c
C:/msys32/home/buildbot/slave/monero-static-win32/build/build/release/CMakeFiles/CMakeTmp/CheckSymbolExists.c: In function 'main':

C:/msys32/home/buildbot/slave/monero-static-win32/build/build/release/CMakeFiles/CMakeTmp/CheckSymbolExists.c:8:19: error: expected expression before 'pthread_rwlock_t'

   return ((int*)(&pthread_rwlock_t))[argc];

                   ^~~~~~~~~~~~~~~~

make[2]: *** [CMakeFiles/cmTC_b2c36.dir/build.make:66: CMakeFiles/cmTC_b2c36.dir/CheckSymbolExists.c.obj] Error 1
make[2]: Leaving directory '/home/buildbot/slave/monero-static-win32/build/build/release/CMakeFiles/CMakeTmp'
make[1]: *** [Makefile:121: cmTC_b2c36/fast] Error 2
make[1]: Leaving directory '/home/buildbot/slave/monero-static-win32/build/build/release/CMakeFiles/CMakeTmp'

File C:/msys32/home/buildbot/slave/monero-static-win32/build/build/release/CMakeFiles/CMakeTmp/CheckSymbolExists.c:
/* */
#include <pthread.h>

int main(int argc, char** argv)
{
  (void)argv;
#ifndef pthread_rwlock_t
  return ((int*)(&pthread_rwlock_t))[argc];
#else
  (void)argc;
  return 0;
#endif
}

Determining if the pthread_spinlock_t exist failed with the following output:
Change Dir: C:/msys32/home/buildbot/slave/monero-static-win32/build/build/release/CMakeFiles/CMakeTmp

Run Build Command:"C:/msys32/usr/bin/make.exe" "cmTC_6dd93/fast"
make[1]: Entering directory '/home/buildbot/slave/monero-static-win32/build/build/release/CMakeFiles/CMakeTmp'
/usr/bin/make -f CMakeFiles/cmTC_6dd93.dir/build.make CMakeFiles/cmTC_6dd93.dir/build
make[2]: Entering directory '/home/buildbot/slave/monero-static-win32/build/build/release/CMakeFiles/CMakeTmp'
Building C object CMakeFiles/cmTC_6dd93.dir/CheckSymbolExists.c.obj

/C/msys32/mingw32/bin/i686-w64-mingw32-gcc.exe    -o CMakeFiles/cmTC_6dd93.dir/CheckSymbolExists.c.obj   -c /C/msys32/home/buildbot/slave/monero-static-win32/build/build/release/CMakeFiles/CMakeTmp/CheckSymbolExists.c
C:/msys32/home/buildbot/slave/monero-static-win32/build/build/release/CMakeFiles/CMakeTmp/CheckSymbolExists.c: In function 'main':

C:/msys32/home/buildbot/slave/monero-static-win32/build/build/release/CMakeFiles/CMakeTmp/CheckSymbolExists.c:8:19: error: expected expression before 'pthread_spinlock_t'

   return ((int*)(&pthread_spinlock_t))[argc];

                   ^~~~~~~~~~~~~~~~~~

make[2]: *** [CMakeFiles/cmTC_6dd93.dir/build.make:66: CMakeFiles/cmTC_6dd93.dir/CheckSymbolExists.c.obj] Error 1
make[2]: Leaving directory '/home/buildbot/slave/monero-static-win32/build/build/release/CMakeFiles/CMakeTmp'
make[1]: *** [Makefile:121: cmTC_6dd93/fast] Error 2
make[1]: Leaving directory '/home/buildbot/slave/monero-static-win32/build/build/release/CMakeFiles/CMakeTmp'

File C:/msys32/home/buildbot/slave/monero-static-win32/build/build/release/CMakeFiles/CMakeTmp/CheckSymbolExists.c:
/* */
#include <pthread.h>

int main(int argc, char** argv)
{
  (void)argv;
#ifndef pthread_spinlock_t
  return ((int*)(&pthread_spinlock_t))[argc];
#else
  (void)argc;
  return 0;
#endif
}

Determining if the LIBRESSL_VERSION_TEXT exist failed with the following output:
Change Dir: C:/msys32/home/buildbot/slave/monero-static-win32/build/build/release/CMakeFiles/CMakeTmp

Run Build Command:"C:/msys32/usr/bin/make.exe" "cmTC_66bcd/fast"
make[1]: Entering directory '/home/buildbot/slave/monero-static-win32/build/build/release/CMakeFiles/CMakeTmp'
/usr/bin/make -f CMakeFiles/cmTC_66bcd.dir/build.make CMakeFiles/cmTC_66bcd.dir/build
make[2]: Entering directory '/home/buildbot/slave/monero-static-win32/build/build/release/CMakeFiles/CMakeTmp'
Building C object CMakeFiles/cmTC_66bcd.dir/CheckSymbolExists.c.obj

/C/msys32/mingw32/bin/i686-w64-mingw32-gcc.exe    -o CMakeFiles/cmTC_66bcd.dir/CheckSymbolExists.c.obj   -c /C/msys32/home/buildbot/slave/monero-static-win32/build/build/release/CMakeFiles/CMakeTmp/CheckSymbolExists.c
C:/msys32/home/buildbot/slave/monero-static-win32/build/build/release/CMakeFiles/CMakeTmp/CheckSymbolExists.c: In function 'main':

C:/msys32/home/buildbot/slave/monero-static-win32/build/build/release/CMakeFiles/CMakeTmp/CheckSymbolExists.c:8:19: error: 'LIBRESSL_VERSION_TEXT' undeclared (first use in this function); did you mean 'OPENSSL_VERSION_TEXT'?

   return ((int*)(&LIBRESSL_VERSION_TEXT))[argc];

                   ^~~~~~~~~~~~~~~~~~~~~

                   OPENSSL_VERSION_TEXT

C:/msys32/home/buildbot/slave/monero-static-win32/build/build/release/CMakeFiles/CMakeTmp/CheckSymbolExists.c:8:19: note: each undeclared identifier is reported only once for each function it appears in

make[2]: *** [CMakeFiles/cmTC_66bcd.dir/build.make:66: CMakeFiles/cmTC_66bcd.dir/CheckSymbolExists.c.obj] Error 1
make[2]: Leaving directory '/home/buildbot/slave/monero-static-win32/build/build/release/CMakeFiles/CMakeTmp'
make[1]: *** [Makefile:121: cmTC_66bcd/fast] Error 2
make[1]: Leaving directory '/home/buildbot/slave/monero-static-win32/build/build/release/CMakeFiles/CMakeTmp'

File C:/msys32/home/buildbot/slave/monero-static-win32/build/build/release/CMakeFiles/CMakeTmp/CheckSymbolExists.c:
/* */
#include <openssl/opensslv.h>

int main(int argc, char** argv)
{
  (void)argv;
#ifndef LIBRESSL_VERSION_TEXT
  return ((int*)(&LIBRESSL_VERSION_TEXT))[argc];
#else
  (void)argc;
  return 0;
#endif
}

Determining if the -Wl,-z,relro linker flag is supported failed with the following output:
Change Dir: C:/msys32/home/buildbot/slave/monero-static-win32/build/build/release/CMakeFiles/CMakeTmp

Run Build Command:"C:/msys32/usr/bin/make.exe" "cmTC_b316b/fast"
make[1]: Entering directory '/home/buildbot/slave/monero-static-win32/build/build/release/CMakeFiles/CMakeTmp'
/usr/bin/make -f CMakeFiles/cmTC_b316b.dir/build.make CMakeFiles/cmTC_b316b.dir/build
make[2]: Entering directory '/home/buildbot/slave/monero-static-win32/build/build/release/CMakeFiles/CMakeTmp'
Building C object CMakeFiles/cmTC_b316b.dir/CheckLinkerFlag.c.obj

/C/msys32/mingw32/bin/i686-w64-mingw32-gcc.exe   -Wl,-z,relro    -Wl,-z,relro -o CMakeFiles/cmTC_b316b.dir/CheckLinkerFlag.c.obj   -c /C/msys32/home/buildbot/slave/monero-static-win32/build/cmake/CheckLinkerFlag.c
Linking C executable cmTC_b316b.exe

/C/msys32/mingw32/bin/cmake.exe -E remove -f CMakeFiles/cmTC_b316b.dir/objects.a
ar cr CMakeFiles/cmTC_b316b.dir/objects.a "CMakeFiles/cmTC_b316b.dir/CheckLinkerFlag.c.obj" 
/C/msys32/mingw32/bin/i686-w64-mingw32-gcc.exe -Wl,-z,relro     -Wl,--whole-archive CMakeFiles/cmTC_b316b.dir/objects.a -Wl,--no-whole-archive  -o cmTC_b316b.exe -Wl,--major-image-version,0,--minor-image-version,0 -lkernel32 -luser32 -lgdi32 -lwinspool -lshell32 -lole32 -loleaut32 -luuid -lcomdlg32 -ladvapi32 
C:/msys32/mingw32/bin/../lib/gcc/i686-w64-mingw32/7.4.0/../../../../i686-w64-mingw32/bin/ld.exe: unrecognized option '-z'

C:/msys32/mingw32/bin/../lib/gcc/i686-w64-mingw32/7.4.0/../../../../i686-w64-mingw32/bin/ld.exe: use the --help option for usage information

collect2.exe: error: ld returned 1 exit status

make[2]: *** [CMakeFiles/cmTC_b316b.dir/build.make:88: cmTC_b316b.exe] Error 1
make[2]: Leaving directory '/home/buildbot/slave/monero-static-win32/build/build/release/CMakeFiles/CMakeTmp'
make[1]: *** [Makefile:121: cmTC_b316b/fast] Error 2
make[1]: Leaving directory '/home/buildbot/slave/monero-static-win32/build/build/release/CMakeFiles/CMakeTmp'


Determining if the -Wl,-z,now linker flag is supported failed with the following output:
Change Dir: C:/msys32/home/buildbot/slave/monero-static-win32/build/build/release/CMakeFiles/CMakeTmp

Run Build Command:"C:/msys32/usr/bin/make.exe" "cmTC_d0b6f/fast"
make[1]: Entering directory '/home/buildbot/slave/monero-static-win32/build/build/release/CMakeFiles/CMakeTmp'
/usr/bin/make -f CMakeFiles/cmTC_d0b6f.dir/build.make CMakeFiles/cmTC_d0b6f.dir/build
make[2]: Entering directory '/home/buildbot/slave/monero-static-win32/build/build/release/CMakeFiles/CMakeTmp'
Building C object CMakeFiles/cmTC_d0b6f.dir/CheckLinkerFlag.c.obj

/C/msys32/mingw32/bin/i686-w64-mingw32-gcc.exe   -Wl,-z,now    -Wl,-z,now -o CMakeFiles/cmTC_d0b6f.dir/CheckLinkerFlag.c.obj   -c /C/msys32/home/buildbot/slave/monero-static-win32/build/cmake/CheckLinkerFlag.c
Linking C executable cmTC_d0b6f.exe

/C/msys32/mingw32/bin/cmake.exe -E remove -f CMakeFiles/cmTC_d0b6f.dir/objects.a
ar cr CMakeFiles/cmTC_d0b6f.dir/objects.a "CMakeFiles/cmTC_d0b6f.dir/CheckLinkerFlag.c.obj" 
/C/msys32/mingw32/bin/i686-w64-mingw32-gcc.exe -Wl,-z,now     -Wl,--whole-archive CMakeFiles/cmTC_d0b6f.dir/objects.a -Wl,--no-whole-archive  -o cmTC_d0b6f.exe -Wl,--major-image-version,0,--minor-image-version,0 -lkernel32 -luser32 -lgdi32 -lwinspool -lshell32 -lole32 -loleaut32 -luuid -lcomdlg32 -ladvapi32 
C:/msys32/mingw32/bin/../lib/gcc/i686-w64-mingw32/7.4.0/../../../../i686-w64-mingw32/bin/ld.exe: unrecognized option '-z'

C:/msys32/mingw32/bin/../lib/gcc/i686-w64-mingw32/7.4.0/../../../../i686-w64-mingw32/bin/ld.exe: use the --help option for usage information

collect2.exe: error: ld returned 1 exit status

make[2]: *** [CMakeFiles/cmTC_d0b6f.dir/build.make:88: cmTC_d0b6f.exe] Error 1
make[2]: Leaving directory '/home/buildbot/slave/monero-static-win32/build/build/release/CMakeFiles/CMakeTmp'
make[1]: *** [Makefile:121: cmTC_d0b6f/fast] Error 2
make[1]: Leaving directory '/home/buildbot/slave/monero-static-win32/build/build/release/CMakeFiles/CMakeTmp'


Determining if the -Wl,-z,noexecstack linker flag is supported failed with the following output:
Change Dir: C:/msys32/home/buildbot/slave/monero-static-win32/build/build/release/CMakeFiles/CMakeTmp

Run Build Command:"C:/msys32/usr/bin/make.exe" "cmTC_bd9c7/fast"
make[1]: Entering directory '/home/buildbot/slave/monero-static-win32/build/build/release/CMakeFiles/CMakeTmp'
/usr/bin/make -f CMakeFiles/cmTC_bd9c7.dir/build.make CMakeFiles/cmTC_bd9c7.dir/build
make[2]: Entering directory '/home/buildbot/slave/monero-static-win32/build/build/release/CMakeFiles/CMakeTmp'
Building C object CMakeFiles/cmTC_bd9c7.dir/CheckLinkerFlag.c.obj

/C/msys32/mingw32/bin/i686-w64-mingw32-gcc.exe   -Wl,-z,noexecstack    -Wl,-z,noexecstack -o CMakeFiles/cmTC_bd9c7.dir/CheckLinkerFlag.c.obj   -c /C/msys32/home/buildbot/slave/monero-static-win32/build/cmake/CheckLinkerFlag.c
Linking C executable cmTC_bd9c7.exe

/C/msys32/mingw32/bin/cmake.exe -E remove -f CMakeFiles/cmTC_bd9c7.dir/objects.a
ar cr CMakeFiles/cmTC_bd9c7.dir/objects.a "CMakeFiles/cmTC_bd9c7.dir/CheckLinkerFlag.c.obj" 
/C/msys32/mingw32/bin/i686-w64-mingw32-gcc.exe -Wl,-z,noexecstack     -Wl,--whole-archive CMakeFiles/cmTC_bd9c7.dir/objects.a -Wl,--no-whole-archive  -o cmTC_bd9c7.exe -Wl,--major-image-version,0,--minor-image-version,0 -lkernel32 -luser32 -lgdi32 -lwinspool -lshell32 -lole32 -loleaut32 -luuid -lcomdlg32 -ladvapi32 
C:/msys32/mingw32/bin/../lib/gcc/i686-w64-mingw32/7.4.0/../../../../i686-w64-mingw32/bin/ld.exe: unrecognized option '-z'

C:/msys32/mingw32/bin/../lib/gcc/i686-w64-mingw32/7.4.0/../../../../i686-w64-mingw32/bin/ld.exe: use the --help option for usage information

collect2.exe: error: ld returned 1 exit status

make[2]: *** [CMakeFiles/cmTC_bd9c7.dir/build.make:88: cmTC_bd9c7.exe] Error 1
make[2]: Leaving directory '/home/buildbot/slave/monero-static-win32/build/build/release/CMakeFiles/CMakeTmp'
make[1]: *** [Makefile:121: cmTC_bd9c7/fast] Error 2
make[1]: Leaving directory '/home/buildbot/slave/monero-static-win32/build/build/release/CMakeFiles/CMakeTmp'


Determining if the -Wl,-z,noexecheap linker flag is supported failed with the following output:
Change Dir: C:/msys32/home/buildbot/slave/monero-static-win32/build/build/release/CMakeFiles/CMakeTmp

Run Build Command:"C:/msys32/usr/bin/make.exe" "cmTC_69c5e/fast"
make[1]: Entering directory '/home/buildbot/slave/monero-static-win32/build/build/release/CMakeFiles/CMakeTmp'
/usr/bin/make -f CMakeFiles/cmTC_69c5e.dir/build.make CMakeFiles/cmTC_69c5e.dir/build
make[2]: Entering directory '/home/buildbot/slave/monero-static-win32/build/build/release/CMakeFiles/CMakeTmp'
Building C object CMakeFiles/cmTC_69c5e.dir/CheckLinkerFlag.c.obj

/C/msys32/mingw32/bin/i686-w64-mingw32-gcc.exe   -Wl,-z,noexecheap    -Wl,-z,noexecheap -o CMakeFiles/cmTC_69c5e.dir/CheckLinkerFlag.c.obj   -c /C/msys32/home/buildbot/slave/monero-static-win32/build/cmake/CheckLinkerFlag.c
Linking C executable cmTC_69c5e.exe

/C/msys32/mingw32/bin/cmake.exe -E remove -f CMakeFiles/cmTC_69c5e.dir/objects.a
ar cr CMakeFiles/cmTC_69c5e.dir/objects.a "CMakeFiles/cmTC_69c5e.dir/CheckLinkerFlag.c.obj" 
/C/msys32/mingw32/bin/i686-w64-mingw32-gcc.exe -Wl,-z,noexecheap     -Wl,--whole-archive CMakeFiles/cmTC_69c5e.dir/objects.a -Wl,--no-whole-archive  -o cmTC_69c5e.exe -Wl,--major-image-version,0,--minor-image-version,0 -lkernel32 -luser32 -lgdi32 -lwinspool -lshell32 -lole32 -loleaut32 -luuid -lcomdlg32 -ladvapi32 
C:/msys32/mingw32/bin/../lib/gcc/i686-w64-mingw32/7.4.0/../../../../i686-w64-mingw32/bin/ld.exe: unrecognized option '-z'

C:/msys32/mingw32/bin/../lib/gcc/i686-w64-mingw32/7.4.0/../../../../i686-w64-mingw32/bin/ld.exe: use the --help option for usage information

collect2.exe: error: ld returned 1 exit status

make[2]: *** [CMakeFiles/cmTC_69c5e.dir/build.make:88: cmTC_69c5e.exe] Error 1
make[2]: Leaving directory '/home/buildbot/slave/monero-static-win32/build/build/release/CMakeFiles/CMakeTmp'
make[1]: *** [Makefile:121: cmTC_69c5e/fast] Error 2
make[1]: Leaving directory '/home/buildbot/slave/monero-static-win32/build/build/release/CMakeFiles/CMakeTmp'


Determining if the function rl_copy_text exists failed with the following output:
Change Dir: C:/msys32/home/buildbot/slave/monero-static-win32/build/build/release/CMakeFiles/CMakeTmp

Run Build Command:"C:/msys32/usr/bin/make.exe" "cmTC_2b79f/fast"
make[1]: Entering directory '/home/buildbot/slave/monero-static-win32/build/build/release/CMakeFiles/CMakeTmp'
/usr/bin/make -f CMakeFiles/cmTC_2b79f.dir/build.make CMakeFiles/cmTC_2b79f.dir/build
make[2]: Entering directory '/home/buildbot/slave/monero-static-win32/build/build/release/CMakeFiles/CMakeTmp'
Building C object CMakeFiles/cmTC_2b79f.dir/CheckFunctionExists.c.obj

/C/msys32/mingw32/bin/i686-w64-mingw32-gcc.exe   -maes -march=i686 -fno-strict-aliasing -std=c11 -D_GNU_SOURCE -m32 -DWIN32_LEAN_AND_MEAN  -Wall -Wextra -Wpointer-arith -Wundef -Wvla -Wwrite-strings -Wno-error=extra -Wno-error=deprecated-declarations -Wno-unused-parameter -Wno-unused-variable -Wno-error=unused-variable -Wno-error=undef -Wno-error=uninitialized -Wlogical-op -Wno-error=maybe-uninitialized -Wno-error=cpp -Wno-error=unused-value -Wno-error=unused-but-set-variable -Waggregate-return -Wnested-externs -Wold-style-definition -Wstrict-prototypes  -fPIC  -U_FORTIFY_SOURCE -D_FORTIFY_SOURCE=1 -Wformat -Wformat-security -mmitigate-rop -fno-strict-aliasing -DCHECK_FUNCTION_EXISTS=rl_copy_text   -o CMakeFiles/cmTC_2b79f.dir/CheckFunctionExists.c.obj   -c /C/msys32/mingw32/share/cmake-3.12/Modules/CheckFunctionExists.c
Linking C executable cmTC_2b79f.exe

/C/msys32/mingw32/bin/cmake.exe -E remove -f CMakeFiles/cmTC_2b79f.dir/objects.a
ar cr CMakeFiles/cmTC_2b79f.dir/objects.a "CMakeFiles/cmTC_2b79f.dir/CheckFunctionExists.c.obj" 
/C/msys32/mingw32/bin/i686-w64-mingw32-gcc.exe  -maes -march=i686 -fno-strict-aliasing -std=c11 -D_GNU_SOURCE -m32 -DWIN32_LEAN_AND_MEAN  -Wall -Wextra -Wpointer-arith -Wundef -Wvla -Wwrite-strings -Wno-error=extra -Wno-error=deprecated-declarations -Wno-unused-parameter -Wno-unused-variable -Wno-error=unused-variable -Wno-error=undef -Wno-error=uninitialized -Wlogical-op -Wno-error=maybe-uninitialized -Wno-error=cpp -Wno-error=unused-value -Wno-error=unused-but-set-variable -Waggregate-return -Wnested-externs -Wold-style-definition -Wstrict-prototypes  -fPIC  -U_FORTIFY_SOURCE -D_FORTIFY_SOURCE=1 -Wformat -Wformat-security -mmitigate-rop -fno-strict-aliasing -DCHECK_FUNCTION_EXISTS=rl_copy_text    -Wl,--whole-archive CMakeFiles/cmTC_2b79f.dir/objects.a -Wl,--no-whole-archive  -o cmTC_2b79f.exe -Wl,--major-image-version,0,--minor-image-version,0 /C/msys32/mingw32/lib/libreadline.a -lkernel32 -luser32 -lgdi32 -lwinspool -lshell32 -lole32 -loleaut32 -luuid -lcomdlg32 -ladvapi32 
C:/msys32/mingw32/lib/libreadline.a(terminal.o):(.text+0x1a6): undefined reference to `tgetnum'

C:/msys32/mingw32/lib/libreadline.a(terminal.o):(.text+0x2df): undefined reference to `tgetnum'

C:/msys32/mingw32/lib/libreadline.a(terminal.o):(.text+0x757): undefined reference to `tgetent'

C:/msys32/mingw32/lib/libreadline.a(terminal.o):(.text+0x793): undefined reference to `tgetstr'

C:/msys32/mingw32/lib/libreadline.a(terminal.o):(.text+0x7e6): undefined reference to `tgetflag'

C:/msys32/mingw32/lib/libreadline.a(terminal.o):(.text+0x833): undefined reference to `tgetflag'

C:/msys32/mingw32/lib/libreadline.a(terminal.o):(.text+0x948): undefined reference to `tgetflag'

C:/msys32/mingw32/lib/libreadline.a(terminal.o):(.text+0xb2c): undefined reference to `tputs'

C:/msys32/mingw32/lib/libreadline.a(terminal.o):(.text+0xc17): undefined reference to `tputs'

C:/msys32/mingw32/lib/libreadline.a(terminal.o):(.text+0xc59): undefined reference to `tputs'

C:/msys32/mingw32/lib/libreadline.a(terminal.o):(.text+0xcb7): undefined reference to `tputs'

C:/msys32/mingw32/lib/libreadline.a(terminal.o):(.text+0xcf8): undefined reference to `tputs'

C:/msys32/mingw32/lib/libreadline.a(terminal.o):(.text+0xd4a): more undefined references to `tputs' follow

collect2.exe: error: ld returned 1 exit status

make[2]: *** [CMakeFiles/cmTC_2b79f.dir/build.make:89: cmTC_2b79f.exe] Error 1
make[2]: Leaving directory '/home/buildbot/slave/monero-static-win32/build/build/release/CMakeFiles/CMakeTmp'
make[1]: *** [Makefile:121: cmTC_2b79f/fast] Error 2
make[1]: Leaving directory '/home/buildbot/slave/monero-static-win32/build/build/release/CMakeFiles/CMakeTmp'


Determining if the function rl_filename_completion_function exists failed with the following output:
Change Dir: C:/msys32/home/buildbot/slave/monero-static-win32/build/build/release/CMakeFiles/CMakeTmp

Run Build Command:"C:/msys32/usr/bin/make.exe" "cmTC_28337/fast"
make[1]: Entering directory '/home/buildbot/slave/monero-static-win32/build/build/release/CMakeFiles/CMakeTmp'
/usr/bin/make -f CMakeFiles/cmTC_28337.dir/build.make CMakeFiles/cmTC_28337.dir/build
make[2]: Entering directory '/home/buildbot/slave/monero-static-win32/build/build/release/CMakeFiles/CMakeTmp'
Building C object CMakeFiles/cmTC_28337.dir/CheckFunctionExists.c.obj

/C/msys32/mingw32/bin/i686-w64-mingw32-gcc.exe   -maes -march=i686 -fno-strict-aliasing -std=c11 -D_GNU_SOURCE -m32 -DWIN32_LEAN_AND_MEAN  -Wall -Wextra -Wpointer-arith -Wundef -Wvla -Wwrite-strings -Wno-error=extra -Wno-error=deprecated-declarations -Wno-unused-parameter -Wno-unused-variable -Wno-error=unused-variable -Wno-error=undef -Wno-error=uninitialized -Wlogical-op -Wno-error=maybe-uninitialized -Wno-error=cpp -Wno-error=unused-value -Wno-error=unused-but-set-variable -Waggregate-return -Wnested-externs -Wold-style-definition -Wstrict-prototypes  -fPIC  -U_FORTIFY_SOURCE -D_FORTIFY_SOURCE=1 -Wformat -Wformat-security -mmitigate-rop -fno-strict-aliasing -DCHECK_FUNCTION_EXISTS=rl_filename_completion_function   -o CMakeFiles/cmTC_28337.dir/CheckFunctionExists.c.obj   -c /C/msys32/mingw32/share/cmake-3.12/Modules/CheckFunctionExists.c
Linking C executable cmTC_28337.exe

/C/msys32/mingw32/bin/cmake.exe -E remove -f CMakeFiles/cmTC_28337.dir/objects.a
ar cr CMakeFiles/cmTC_28337.dir/objects.a "CMakeFiles/cmTC_28337.dir/CheckFunctionExists.c.obj" 
/C/msys32/mingw32/bin/i686-w64-mingw32-gcc.exe  -maes -march=i686 -fno-strict-aliasing -std=c11 -D_GNU_SOURCE -m32 -DWIN32_LEAN_AND_MEAN  -Wall -Wextra -Wpointer-arith -Wundef -Wvla -Wwrite-strings -Wno-error=extra -Wno-error=deprecated-declarations -Wno-unused-parameter -Wno-unused-variable -Wno-error=unused-variable -Wno-error=undef -Wno-error=uninitialized -Wlogical-op -Wno-error=maybe-uninitialized -Wno-error=cpp -Wno-error=unused-value -Wno-error=unused-but-set-variable -Waggregate-return -Wnested-externs -Wold-style-definition -Wstrict-prototypes  -fPIC  -U_FORTIFY_SOURCE -D_FORTIFY_SOURCE=1 -Wformat -Wformat-security -mmitigate-rop -fno-strict-aliasing -DCHECK_FUNCTION_EXISTS=rl_filename_completion_function    -Wl,--whole-archive CMakeFiles/cmTC_28337.dir/objects.a -Wl,--no-whole-archive  -o cmTC_28337.exe -Wl,--major-image-version,0,--minor-image-version,0 /C/msys32/mingw32/lib/libreadline.a -lkernel32 -luser32 -lgdi32 -lwinspool -lshell32 -lole32 -loleaut32 -luuid -lcomdlg32 -ladvapi32 
C:/msys32/mingw32/lib/libreadline.a(display.o):(.text+0x99f): undefined reference to `tputs'

C:/msys32/mingw32/lib/libreadline.a(display.o):(.text+0xa9a): undefined reference to `tputs'

C:/msys32/mingw32/lib/libreadline.a(display.o):(.text+0xaec): undefined reference to `tputs'

C:/msys32/mingw32/lib/libreadline.a(display.o):(.text+0x12e4): undefined reference to `tputs'

C:/msys32/mingw32/lib/libreadline.a(display.o):(.text+0x18b3): undefined reference to `tputs'

C:/msys32/mingw32/lib/libreadline.a(display.o):(.text+0x29ad): more undefined references to `tputs' follow

C:/msys32/mingw32/lib/libreadline.a(terminal.o):(.text+0x1a6): undefined reference to `tgetnum'

C:/msys32/mingw32/lib/libreadline.a(terminal.o):(.text+0x2df): undefined reference to `tgetnum'

C:/msys32/mingw32/lib/libreadline.a(terminal.o):(.text+0x757): undefined reference to `tgetent'

C:/msys32/mingw32/lib/libreadline.a(terminal.o):(.text+0x793): undefined reference to `tgetstr'

C:/msys32/mingw32/lib/libreadline.a(terminal.o):(.text+0x7e6): undefined reference to `tgetflag'

C:/msys32/mingw32/lib/libreadline.a(terminal.o):(.text+0x833): undefined reference to `tgetflag'

C:/msys32/mingw32/lib/libreadline.a(terminal.o):(.text+0x948): undefined reference to `tgetflag'

C:/msys32/mingw32/lib/libreadline.a(terminal.o):(.text+0xb2c): undefined reference to `tputs'

C:/msys32/mingw32/lib/libreadline.a(terminal.o):(.text+0xc17): undefined reference to `tputs'

C:/msys32/mingw32/lib/libreadline.a(terminal.o):(.text+0xc59): undefined reference to `tputs'

C:/msys32/mingw32/lib/libreadline.a(terminal.o):(.text+0xcb7): undefined reference to `tputs'

C:/msys32/mingw32/lib/libreadline.a(terminal.o):(.text+0xcf8): undefined reference to `tputs'

C:/msys32/mingw32/lib/libreadline.a(terminal.o):(.text+0xd4a): more undefined references to `tputs' follow

collect2.exe: error: ld returned 1 exit status

make[2]: *** [CMakeFiles/cmTC_28337.dir/build.make:89: cmTC_28337.exe] Error 1
make[2]: Leaving directory '/home/buildbot/slave/monero-static-win32/build/build/release/CMakeFiles/CMakeTmp'
make[1]: *** [Makefile:121: cmTC_28337/fast] Error 2
make[1]: Leaving directory '/home/buildbot/slave/monero-static-win32/build/build/release/CMakeFiles/CMakeTmp'