(view as text)
make release-test
 in dir C:\msys32\home\buildbot\slave\monero-static-win32\build (timeout 1200 secs)
 watching logfiles {'LastTest': 'build/release/Testing/Temporary/LastTest.log', 'CTestCostData.txt': 'build/release/Testing/Temporary/CTestCostData.txt'}
 argv: ['make', 'release-test']
 environment:
  ALLUSERSPROFILE=C:\ProgramData
  APPDATA=C:\WINDOWS\system32\config\systemprofile\AppData\Roaming
  ARGS= -E 'core_tests|libwallet_api_tests' 
  CHOCOLATEYINSTALL=C:\ProgramData\chocolatey
  COMMONPROGRAMFILES=C:\Program Files\Common Files
  COMPUTERNAME=DESKTOP-7NB6IPI
  COMSPEC=C:\WINDOWS\system32\cmd.exe
  DRIVERDATA=C:\Windows\System32\Drivers\DriverData
  DXSDK_DIR=C:\Program Files\Microsoft DirectX SDK (June 2010)\
  GTEST_FILTER=-DNSResolver.*:AddressFromURL.*
  HOME=C:\msys32\home\SYSTEM
  LOCALAPPDATA=C:\WINDOWS\system32\config\systemprofile\AppData\Local
  NUMBER_OF_PROCESSORS=1
  OS=Windows_NT
  PATH=C:\msys32\usr\bin;C:\Python27;C:\Python27\Scripts;C:\WINDOWS\system32;C:\WINDOWS;C:\WINDOWS\System32\Wbem;C:\WINDOWS\System32\WindowsPowerShell\v1.0;C:\ProgramData\chocolatey\bin;C:\msys32\mingw32\bin;C:\WINDOWS\System32\OpenSSH;C:\WINDOWS\system32\config\systemprofile\AppData\Local\Microsoft\WindowsApps;C:\python27\lib\site-packages\pywin32_system32
  PATHEXT=.COM;.EXE;.BAT;.CMD;.VBS;.VBE;.JS;.JSE;.WSF;.WSH;.MSC
  PROCESSOR_ARCHITECTURE=x86
  PROCESSOR_IDENTIFIER=x86 Family 6 Model 60 Stepping 3, GenuineIntel
  PROCESSOR_LEVEL=6
  PROCESSOR_REVISION=3c03
  PROGRAMDATA=C:\ProgramData
  PROGRAMFILES=C:\Program Files
  PSMODULEPATH=C:\Program Files\WindowsPowerShell\Modules;C:\WINDOWS\system32\WindowsPowerShell\v1.0\Modules
  PUBLIC=C:\Users\Public
  PWD=C:\msys32\home\buildbot\slave\monero-static-win32\build
  SYSTEMDRIVE=C:
  SYSTEMROOT=C:\WINDOWS
  TEMP=C:\WINDOWS\TEMP
  TERM=cygwin
  TMP=C:\WINDOWS\TEMP
  USERDOMAIN=WORKGROUP
  USERNAME=DESKTOP-7NB6IPI$
  USERPROFILE=C:\WINDOWS\system32\config\systemprofile
  USE_SINGLE_BUILDDIR=1
  WINDIR=C:\WINDOWS
 using PTY: False
mkdir -p build/release
cd build/release && cmake -D BUILD_TESTS=ON -D CMAKE_BUILD_TYPE=release ../.. && make && make test
-- CMake version 3.12.0
-- Building build tag win-x32
-- Checking submodules
-- Submodule 'external/miniupnp' is up-to-date
-- Submodule 'external/unbound' is up-to-date
-- Submodule 'external/rapidjson' is up-to-date
-- Submodule 'external/trezor-common' is up-to-date
-- Could not find DEVELOPER_LOCAL_TOOLS in env (not required)
-- BOOST_IGNORE_SYSTEM_PATHS defaults to OFF
-- Could not find DEVELOPER_LIBUNBOUND_OLD in env (not required)
-- Building for a 32-bit system
-- Building internal libraries as static
-- MSYS location: C:/msys32
-- Could not find DATABASE in env (not required unless you want to change database type from default: lmdb)
-- Using LMDB as default DB type
-- looking for liblzma
-- liblzma found
-- Could not find libunwind (missing: LIBUNWIND_INCLUDE_DIR) 
-- Stack trace on exception disabled
-- Using OpenSSL include dir at C:/msys32/mingw32/include
-- Could NOT find MiniUPnPc (missing: MINIUPNP_INCLUDE_DIR MINIUPNP_LIBRARY) 
-- Using in-tree miniupnpc
-- Looking for libunbound
-- Using 32-bit LMDB from source tree
-- Using HIDAPI include dir at C:/msys32/mingw32/include/hidapi
-- Could NOT find Protobuf (missing: Protobuf_LIBRARIES Protobuf_INCLUDE_DIR) 
-- Could NOT find Protobuf (missing: Protobuf_LIBRARIES Protobuf_INCLUDE_DIR) 
-- Could not find Protobuf
-- Building on x86 for i686
-- AES support enabled
-- Using C security hardening flags:  -Wformat -Wformat-security -mmitigate-rop
-- Using C++ security hardening flags:  -Wformat -Wformat-security -mmitigate-rop
-- Using linker security hardening flags:  -Wl,--dynamicbase -Wl,--nxcompat
-- Found Boost Version: 106700
-- Could NOT find Readline (missing: Readline_INCLUDE_DIR) 
-- Could not find GNU readline library so building without readline support
-- Found Git: C:/msys32/usr/bin/git.exe
-- Trezor support disabled
-- Could NOT find GTest (missing: GTEST_LIBRARY GTEST_MAIN_LIBRARY) 
-- GTest not found on the system: will use GTest bundled with this source
Doxygen: graphviz not found - graphs disabled
-- Configuring done
-- Generating done
-- Build files have been written to: C:/msys32/home/buildbot/slave/monero-static-win32/build/build/release
make[1]: Entering directory '/home/buildbot/slave/monero-static-win32/build/build/release'
make[2]: Entering directory '/home/buildbot/slave/monero-static-win32/build/build/release'
make[3]: Entering directory '/home/buildbot/slave/monero-static-win32/build/build/release'
make[3]: Leaving directory '/home/buildbot/slave/monero-static-win32/build/build/release'
[  2%] Built target generate_translations_header
make[3]: Entering directory '/home/buildbot/slave/monero-static-win32/build/build/release'
make[3]: Leaving directory '/home/buildbot/slave/monero-static-win32/build/build/release'
[  6%] Built target libminiupnpc-static
make[3]: Entering directory '/home/buildbot/slave/monero-static-win32/build/build/release'
make[3]: Leaving directory '/home/buildbot/slave/monero-static-win32/build/build/release'
[ 27%] Built target unbound
make[3]: Entering directory '/home/buildbot/slave/monero-static-win32/build/build/release'
make[3]: Leaving directory '/home/buildbot/slave/monero-static-win32/build/build/release'
[ 27%] Built target lmdb
make[3]: Entering directory '/home/buildbot/slave/monero-static-win32/build/build/release'
make[3]: Leaving directory '/home/buildbot/slave/monero-static-win32/build/build/release'
[ 28%] Built target easylogging
make[3]: Entering directory '/home/buildbot/slave/monero-static-win32/build/build/release'
make[3]: Leaving directory '/home/buildbot/slave/monero-static-win32/build/build/release'
make[3]: Entering directory '/home/buildbot/slave/monero-static-win32/build/build/release'
[ 29%] Building CXX object contrib/epee/src/CMakeFiles/epee_readline.dir/readline_buffer.cpp.obj
[ 29%] Linking CXX static library libepee_readline.a
make[3]: Leaving directory '/home/buildbot/slave/monero-static-win32/build/build/release'
[ 29%] Built target epee_readline
make[3]: Entering directory '/home/buildbot/slave/monero-static-win32/build/build/release'
make[3]: Leaving directory '/home/buildbot/slave/monero-static-win32/build/build/release'
make[3]: Entering directory '/home/buildbot/slave/monero-static-win32/build/build/release'
[ 29%] Building CXX object contrib/epee/src/CMakeFiles/epee.dir/hex.cpp.obj
[ 29%] Building CXX object contrib/epee/src/CMakeFiles/epee.dir/http_auth.cpp.obj
[ 29%] Building CXX object contrib/epee/src/CMakeFiles/epee.dir/mlog.cpp.obj
[ 29%] Building CXX object contrib/epee/src/CMakeFiles/epee.dir/net_utils_base.cpp.obj
[ 30%] Building CXX object contrib/epee/src/CMakeFiles/epee.dir/string_tools.cpp.obj
[ 30%] Building CXX object contrib/epee/src/CMakeFiles/epee.dir/wipeable_string.cpp.obj
[ 30%] Building C object contrib/epee/src/CMakeFiles/epee.dir/memwipe.c.obj
[ 30%] Building CXX object contrib/epee/src/CMakeFiles/epee.dir/connection_basic.cpp.obj
[ 31%] Building CXX object contrib/epee/src/CMakeFiles/epee.dir/network_throttle.cpp.obj
[ 31%] Building CXX object contrib/epee/src/CMakeFiles/epee.dir/network_throttle-detail.cpp.obj
[ 31%] Building CXX object contrib/epee/src/CMakeFiles/epee.dir/mlocker.cpp.obj
C:/msys32/home/buildbot/slave/monero-static-win32/build/contrib/epee/src/mlocker.cpp:59:2: warning: #warning Missing query_page_size implementation [-Wcpp]
 #warning Missing query_page_size implementation
  ^~~~~~~
C:/msys32/home/buildbot/slave/monero-static-win32/build/contrib/epee/src/mlocker.cpp:71:2: warning: #warning Missing do_lock implementation [-Wcpp]
 #warning Missing do_lock implementation
  ^~~~~~~
C:/msys32/home/buildbot/slave/monero-static-win32/build/contrib/epee/src/mlocker.cpp:85:2: warning: #warning Missing implementation of page size detection [-Wcpp]
 #warning Missing implementation of page size detection
  ^~~~~~~
[ 31%] Linking CXX static library libepee.a
make[3]: Leaving directory '/home/buildbot/slave/monero-static-win32/build/build/release'
[ 31%] Built target epee
make[3]: Entering directory '/home/buildbot/slave/monero-static-win32/build/build/release'
make[3]: Leaving directory '/home/buildbot/slave/monero-static-win32/build/build/release'
[ 31%] Built target genversion
make[3]: Entering directory '/home/buildbot/slave/monero-static-win32/build/build/release'
make[3]: Leaving directory '/home/buildbot/slave/monero-static-win32/build/build/release'
make[3]: Entering directory '/home/buildbot/slave/monero-static-win32/build/build/release'
[ 31%] Building CXX object src/CMakeFiles/obj_version.dir/__/version.cpp.obj
make[3]: Leaving directory '/home/buildbot/slave/monero-static-win32/build/build/release'
[ 31%] Built target obj_version
make[3]: Entering directory '/home/buildbot/slave/monero-static-win32/build/build/release'
make[3]: Leaving directory '/home/buildbot/slave/monero-static-win32/build/build/release'
make[3]: Entering directory '/home/buildbot/slave/monero-static-win32/build/build/release'
[ 32%] Linking CXX static library libversion.a
make[3]: Leaving directory '/home/buildbot/slave/monero-static-win32/build/build/release'
[ 32%] Built target version
make[3]: Entering directory '/home/buildbot/slave/monero-static-win32/build/build/release'
make[3]: Leaving directory '/home/buildbot/slave/monero-static-win32/build/build/release'
make[3]: Entering directory '/home/buildbot/slave/monero-static-win32/build/build/release'
[ 32%] Building C object src/crypto/CMakeFiles/obj_cncrypto.dir/aesb.c.obj
[ 32%] Building C object src/crypto/CMakeFiles/obj_cncrypto.dir/blake256.c.obj
[ 33%] Building C object src/crypto/CMakeFiles/obj_cncrypto.dir/chacha.c.obj
[ 33%] Building C object src/crypto/CMakeFiles/obj_cncrypto.dir/crypto-ops-data.c.obj
[ 33%] Building C object src/crypto/CMakeFiles/obj_cncrypto.dir/crypto-ops.c.obj
[ 33%] Building CXX object src/crypto/CMakeFiles/obj_cncrypto.dir/crypto.cpp.obj
[ 33%] Building C object src/crypto/CMakeFiles/obj_cncrypto.dir/groestl.c.obj
[ 34%] Building C object src/crypto/CMakeFiles/obj_cncrypto.dir/hash-extra-blake.c.obj
[ 34%] Building C object src/crypto/CMakeFiles/obj_cncrypto.dir/hash-extra-groestl.c.obj
[ 34%] Building C object src/crypto/CMakeFiles/obj_cncrypto.dir/hash-extra-jh.c.obj
[ 34%] Building C object src/crypto/CMakeFiles/obj_cncrypto.dir/hash-extra-skein.c.obj
[ 35%] Building C object src/crypto/CMakeFiles/obj_cncrypto.dir/hash.c.obj
[ 35%] Building C object src/crypto/CMakeFiles/obj_cncrypto.dir/jh.c.obj
[ 35%] Building C object src/crypto/CMakeFiles/obj_cncrypto.dir/keccak.c.obj
[ 35%] Building C object src/crypto/CMakeFiles/obj_cncrypto.dir/oaes_lib.c.obj
[ 36%] Building C object src/crypto/CMakeFiles/obj_cncrypto.dir/random.c.obj
[ 36%] Building C object src/crypto/CMakeFiles/obj_cncrypto.dir/skein.c.obj
[ 36%] Building C object src/crypto/CMakeFiles/obj_cncrypto.dir/slow-hash.c.obj
[ 36%] Building C object src/crypto/CMakeFiles/obj_cncrypto.dir/tree-hash.c.obj
make[3]: Leaving directory '/home/buildbot/slave/monero-static-win32/build/build/release'
[ 36%] Built target obj_cncrypto
make[3]: Entering directory '/home/buildbot/slave/monero-static-win32/build/build/release'
make[3]: Leaving directory '/home/buildbot/slave/monero-static-win32/build/build/release'
make[3]: Entering directory '/home/buildbot/slave/monero-static-win32/build/build/release'
[ 36%] Linking CXX static library libcncrypto.a
make[3]: Leaving directory '/home/buildbot/slave/monero-static-win32/build/build/release'
[ 36%] Built target cncrypto
make[3]: Entering directory '/home/buildbot/slave/monero-static-win32/build/build/release'
make[3]: Leaving directory '/home/buildbot/slave/monero-static-win32/build/build/release'
make[3]: Entering directory '/home/buildbot/slave/monero-static-win32/build/build/release'
[ 36%] Building CXX object src/common/CMakeFiles/obj_common.dir/base58.cpp.obj
[ 37%] Building CXX object src/common/CMakeFiles/obj_common.dir/command_line.cpp.obj
[ 37%] Building CXX object src/common/CMakeFiles/obj_common.dir/dns_utils.cpp.obj
[ 37%] Building CXX object src/common/CMakeFiles/obj_common.dir/download.cpp.obj
[ 37%] Building CXX object src/common/CMakeFiles/obj_common.dir/error.cpp.obj
[ 38%] Building CXX object src/common/CMakeFiles/obj_common.dir/expect.cpp.obj
[ 38%] Building CXX object src/common/CMakeFiles/obj_common.dir/util.cpp.obj
[ 38%] Building CXX object src/common/CMakeFiles/obj_common.dir/i18n.cpp.obj
[ 38%] Building CXX object src/common/CMakeFiles/obj_common.dir/notify.cpp.obj
[ 39%] Building CXX object src/common/CMakeFiles/obj_common.dir/password.cpp.obj
[ 39%] Building CXX object src/common/CMakeFiles/obj_common.dir/perf_timer.cpp.obj
[ 39%] Building CXX object src/common/CMakeFiles/obj_common.dir/spawn.cpp.obj
[ 39%] Building CXX object src/common/CMakeFiles/obj_common.dir/threadpool.cpp.obj
[ 39%] Building CXX object src/common/CMakeFiles/obj_common.dir/updates.cpp.obj
[ 40%] Building C object src/common/CMakeFiles/obj_common.dir/aligned.c.obj
[ 40%] Building CXX object src/common/CMakeFiles/obj_common.dir/combinator.cpp.obj
make[3]: Leaving directory '/home/buildbot/slave/monero-static-win32/build/build/release'
[ 40%] Built target obj_common
make[3]: Entering directory '/home/buildbot/slave/monero-static-win32/build/build/release'
make[3]: Leaving directory '/home/buildbot/slave/monero-static-win32/build/build/release'
make[3]: Entering directory '/home/buildbot/slave/monero-static-win32/build/build/release'
[ 41%] Linking CXX static library libcommon.a
make[3]: Leaving directory '/home/buildbot/slave/monero-static-win32/build/build/release'
[ 41%] Built target common
make[3]: Entering directory '/home/buildbot/slave/monero-static-win32/build/build/release'
make[3]: Leaving directory '/home/buildbot/slave/monero-static-win32/build/build/release'
make[3]: Entering directory '/home/buildbot/slave/monero-static-win32/build/build/release'
[ 41%] Building CXX object src/ringct/CMakeFiles/obj_ringct_basic.dir/rctOps.cpp.obj
[ 42%] Building CXX object src/ringct/CMakeFiles/obj_ringct_basic.dir/rctTypes.cpp.obj
[ 42%] Building C object src/ringct/CMakeFiles/obj_ringct_basic.dir/rctCryptoOps.c.obj
[ 42%] Building CXX object src/ringct/CMakeFiles/obj_ringct_basic.dir/multiexp.cc.obj
[ 42%] Building CXX object src/ringct/CMakeFiles/obj_ringct_basic.dir/bulletproofs.cc.obj
make[3]: Leaving directory '/home/buildbot/slave/monero-static-win32/build/build/release'
[ 42%] Built target obj_ringct_basic
make[3]: Entering directory '/home/buildbot/slave/monero-static-win32/build/build/release'
make[3]: Leaving directory '/home/buildbot/slave/monero-static-win32/build/build/release'
make[3]: Entering directory '/home/buildbot/slave/monero-static-win32/build/build/release'
[ 42%] Linking CXX static library libringct_basic.a
make[3]: Leaving directory '/home/buildbot/slave/monero-static-win32/build/build/release'
[ 42%] Built target ringct_basic
make[3]: Entering directory '/home/buildbot/slave/monero-static-win32/build/build/release'
make[3]: Leaving directory '/home/buildbot/slave/monero-static-win32/build/build/release'
make[3]: Entering directory '/home/buildbot/slave/monero-static-win32/build/build/release'
[ 42%] Building CXX object src/ringct/CMakeFiles/obj_ringct.dir/rctSigs.cpp.obj
make[3]: Leaving directory '/home/buildbot/slave/monero-static-win32/build/build/release'
[ 42%] Built target obj_ringct
make[3]: Entering directory '/home/buildbot/slave/monero-static-win32/build/build/release'
make[3]: Leaving directory '/home/buildbot/slave/monero-static-win32/build/build/release'
make[3]: Entering directory '/home/buildbot/slave/monero-static-win32/build/build/release'
[ 42%] Building CXX object src/device/CMakeFiles/obj_device.dir/device.cpp.obj
[ 42%] Building CXX object src/device/CMakeFiles/obj_device.dir/device_default.cpp.obj
[ 43%] Building CXX object src/device/CMakeFiles/obj_device.dir/log.cpp.obj
[ 43%] Building CXX object src/device/CMakeFiles/obj_device.dir/device_ledger.cpp.obj
[ 43%] Building CXX object src/device/CMakeFiles/obj_device.dir/device_io_hid.cpp.obj
make[3]: Leaving directory '/home/buildbot/slave/monero-static-win32/build/build/release'
[ 43%] Built target obj_device
make[3]: Entering directory '/home/buildbot/slave/monero-static-win32/build/build/release'
make[3]: Leaving directory '/home/buildbot/slave/monero-static-win32/build/build/release'
make[3]: Entering directory '/home/buildbot/slave/monero-static-win32/build/build/release'
[ 43%] Linking CXX static library libdevice.a
make[3]: Leaving directory '/home/buildbot/slave/monero-static-win32/build/build/release'
[ 43%] Built target device
make[3]: Entering directory '/home/buildbot/slave/monero-static-win32/build/build/release'
make[3]: Leaving directory '/home/buildbot/slave/monero-static-win32/build/build/release'
make[3]: Entering directory '/home/buildbot/slave/monero-static-win32/build/build/release'
[ 43%] Building CXX object src/checkpoints/CMakeFiles/obj_checkpoints.dir/checkpoints.cpp.obj
make[3]: Leaving directory '/home/buildbot/slave/monero-static-win32/build/build/release'
[ 43%] Built target obj_checkpoints
make[3]: Entering directory '/home/buildbot/slave/monero-static-win32/build/build/release'
make[3]: Leaving directory '/home/buildbot/slave/monero-static-win32/build/build/release'
make[3]: Entering directory '/home/buildbot/slave/monero-static-win32/build/build/release'
[ 43%] Linking CXX static library libcheckpoints.a
make[3]: Leaving directory '/home/buildbot/slave/monero-static-win32/build/build/release'
[ 43%] Built target checkpoints
make[3]: Entering directory '/home/buildbot/slave/monero-static-win32/build/build/release'
make[3]: Leaving directory '/home/buildbot/slave/monero-static-win32/build/build/release'
make[3]: Entering directory '/home/buildbot/slave/monero-static-win32/build/build/release'
[ 43%] Building CXX object src/cryptonote_basic/CMakeFiles/obj_cryptonote_basic.dir/account.cpp.obj
[ 43%] Building CXX object src/cryptonote_basic/CMakeFiles/obj_cryptonote_basic.dir/cryptonote_basic_impl.cpp.obj
[ 44%] Building CXX object src/cryptonote_basic/CMakeFiles/obj_cryptonote_basic.dir/cryptonote_format_utils.cpp.obj
[ 44%] Building CXX object src/cryptonote_basic/CMakeFiles/obj_cryptonote_basic.dir/difficulty.cpp.obj
[ 44%] Building CXX object src/cryptonote_basic/CMakeFiles/obj_cryptonote_basic.dir/hardfork.cpp.obj
[ 44%] Building CXX object src/cryptonote_basic/CMakeFiles/obj_cryptonote_basic.dir/miner.cpp.obj
make[3]: Leaving directory '/home/buildbot/slave/monero-static-win32/build/build/release'
[ 44%] Built target obj_cryptonote_basic
make[3]: Entering directory '/home/buildbot/slave/monero-static-win32/build/build/release'
make[3]: Leaving directory '/home/buildbot/slave/monero-static-win32/build/build/release'
make[3]: Entering directory '/home/buildbot/slave/monero-static-win32/build/build/release'
[ 44%] Linking CXX static library libcryptonote_basic.a
make[3]: Leaving directory '/home/buildbot/slave/monero-static-win32/build/build/release'
[ 44%] Built target cryptonote_basic
make[3]: Entering directory '/home/buildbot/slave/monero-static-win32/build/build/release'
make[3]: Leaving directory '/home/buildbot/slave/monero-static-win32/build/build/release'
make[3]: Entering directory '/home/buildbot/slave/monero-static-win32/build/build/release'
[ 44%] Linking CXX static library libringct.a
make[3]: Leaving directory '/home/buildbot/slave/monero-static-win32/build/build/release'
[ 44%] Built target ringct
make[3]: Entering directory '/home/buildbot/slave/monero-static-win32/build/build/release'
make[3]: Leaving directory '/home/buildbot/slave/monero-static-win32/build/build/release'
make[3]: Entering directory '/home/buildbot/slave/monero-static-win32/build/build/release'
[ 45%] Building CXX object src/cryptonote_core/CMakeFiles/obj_cryptonote_core.dir/blockchain.cpp.obj
[ 45%] Building CXX object src/cryptonote_core/CMakeFiles/obj_cryptonote_core.dir/cryptonote_core.cpp.obj
[ 45%] Building CXX object src/cryptonote_core/CMakeFiles/obj_cryptonote_core.dir/tx_pool.cpp.obj
[ 45%] Building CXX object src/cryptonote_core/CMakeFiles/obj_cryptonote_core.dir/cryptonote_tx_utils.cpp.obj
make[3]: Leaving directory '/home/buildbot/slave/monero-static-win32/build/build/release'
[ 45%] Built target obj_cryptonote_core
make[3]: Entering directory '/home/buildbot/slave/monero-static-win32/build/build/release'
make[3]: Leaving directory '/home/buildbot/slave/monero-static-win32/build/build/release'
make[3]: Entering directory '/home/buildbot/slave/monero-static-win32/build/build/release'
[ 45%] Building CXX object src/multisig/CMakeFiles/obj_multisig.dir/multisig.cpp.obj
make[3]: Leaving directory '/home/buildbot/slave/monero-static-win32/build/build/release'
[ 45%] Built target obj_multisig
make[3]: Entering directory '/home/buildbot/slave/monero-static-win32/build/build/release'
make[3]: Leaving directory '/home/buildbot/slave/monero-static-win32/build/build/release'
make[3]: Entering directory '/home/buildbot/slave/monero-static-win32/build/build/release'
[ 45%] Linking CXX static library libmultisig.a
make[3]: Leaving directory '/home/buildbot/slave/monero-static-win32/build/build/release'
[ 45%] Built target multisig
make[3]: Entering directory '/home/buildbot/slave/monero-static-win32/build/build/release'
make[3]: Leaving directory '/home/buildbot/slave/monero-static-win32/build/build/release'
make[3]: Entering directory '/home/buildbot/slave/monero-static-win32/build/build/release'
[ 45%] Building CXX object src/blockchain_db/CMakeFiles/obj_blockchain_db.dir/blockchain_db.cpp.obj
[ 46%] Building CXX object src/blockchain_db/CMakeFiles/obj_blockchain_db.dir/lmdb/db_lmdb.cpp.obj
make[3]: Leaving directory '/home/buildbot/slave/monero-static-win32/build/build/release'
[ 46%] Built target obj_blockchain_db
make[3]: Entering directory '/home/buildbot/slave/monero-static-win32/build/build/release'
make[3]: Leaving directory '/home/buildbot/slave/monero-static-win32/build/build/release'
make[3]: Entering directory '/home/buildbot/slave/monero-static-win32/build/build/release'
[ 46%] Linking CXX static library libblockchain_db.a
make[3]: Leaving directory '/home/buildbot/slave/monero-static-win32/build/build/release'
[ 46%] Built target blockchain_db
make[3]: Entering directory '/home/buildbot/slave/monero-static-win32/build/build/release'
make[3]: Leaving directory '/home/buildbot/slave/monero-static-win32/build/build/release'
make[3]: Entering directory '/home/buildbot/slave/monero-static-win32/build/build/release'
[ 46%] Linking CXX static library libcryptonote_core.a
make[3]: Leaving directory '/home/buildbot/slave/monero-static-win32/build/build/release'
[ 46%] Built target cryptonote_core
make[3]: Entering directory '/home/buildbot/slave/monero-static-win32/build/build/release'
make[3]: Leaving directory '/home/buildbot/slave/monero-static-win32/build/build/release'
make[3]: Entering directory '/home/buildbot/slave/monero-static-win32/build/build/release'
[ 47%] Building CXX object src/mnemonics/CMakeFiles/obj_mnemonics.dir/electrum-words.cpp.obj
make[3]: Leaving directory '/home/buildbot/slave/monero-static-win32/build/build/release'
[ 47%] Built target obj_mnemonics
make[3]: Entering directory '/home/buildbot/slave/monero-static-win32/build/build/release'
make[3]: Leaving directory '/home/buildbot/slave/monero-static-win32/build/build/release'
make[3]: Entering directory '/home/buildbot/slave/monero-static-win32/build/build/release'
[ 47%] Linking CXX static library libmnemonics.a
make[3]: Leaving directory '/home/buildbot/slave/monero-static-win32/build/build/release'
[ 47%] Built target mnemonics
make[3]: Entering directory '/home/buildbot/slave/monero-static-win32/build/build/release'
make[3]: Leaving directory '/home/buildbot/slave/monero-static-win32/build/build/release'
make[3]: Entering directory '/home/buildbot/slave/monero-static-win32/build/build/release'
[ 48%] Building CXX object src/serialization/CMakeFiles/obj_serialization.dir/json_object.cpp.obj
make[3]: Leaving directory '/home/buildbot/slave/monero-static-win32/build/build/release'
[ 48%] Built target obj_serialization
make[3]: Entering directory '/home/buildbot/slave/monero-static-win32/build/build/release'
make[3]: Leaving directory '/home/buildbot/slave/monero-static-win32/build/build/release'
make[3]: Entering directory '/home/buildbot/slave/monero-static-win32/build/build/release'
[ 48%] Building CXX object src/p2p/CMakeFiles/obj_p2p.dir/net_node.cpp.obj
make[3]: Leaving directory '/home/buildbot/slave/monero-static-win32/build/build/release'
[ 48%] Built target obj_p2p
make[3]: Entering directory '/home/buildbot/slave/monero-static-win32/build/build/release'
make[3]: Leaving directory '/home/buildbot/slave/monero-static-win32/build/build/release'
make[3]: Entering directory '/home/buildbot/slave/monero-static-win32/build/build/release'
[ 48%] Linking CXX static library libp2p.a
make[3]: Leaving directory '/home/buildbot/slave/monero-static-win32/build/build/release'
[ 48%] Built target p2p
make[3]: Entering directory '/home/buildbot/slave/monero-static-win32/build/build/release'
make[3]: Leaving directory '/home/buildbot/slave/monero-static-win32/build/build/release'
make[3]: Entering directory '/home/buildbot/slave/monero-static-win32/build/build/release'
[ 50%] Building CXX object src/cryptonote_protocol/CMakeFiles/obj_cryptonote_protocol.dir/block_queue.cpp.obj
[ 50%] Building CXX object src/cryptonote_protocol/CMakeFiles/obj_cryptonote_protocol.dir/cryptonote_protocol_handler-base.cpp.obj
make[3]: Leaving directory '/home/buildbot/slave/monero-static-win32/build/build/release'
[ 50%] Built target obj_cryptonote_protocol
make[3]: Entering directory '/home/buildbot/slave/monero-static-win32/build/build/release'
make[3]: Leaving directory '/home/buildbot/slave/monero-static-win32/build/build/release'
make[3]: Entering directory '/home/buildbot/slave/monero-static-win32/build/build/release'
[ 51%] Linking CXX static library libcryptonote_protocol.a
make[3]: Leaving directory '/home/buildbot/slave/monero-static-win32/build/build/release'
[ 51%] Built target cryptonote_protocol
make[3]: Entering directory '/home/buildbot/slave/monero-static-win32/build/build/release'
make[3]: Leaving directory '/home/buildbot/slave/monero-static-win32/build/build/release'
make[3]: Entering directory '/home/buildbot/slave/monero-static-win32/build/build/release'
[ 51%] Linking CXX static library libserialization.a
make[3]: Leaving directory '/home/buildbot/slave/monero-static-win32/build/build/release'
[ 51%] Built target serialization
make[3]: Entering directory '/home/buildbot/slave/monero-static-win32/build/build/release'
make[3]: Leaving directory '/home/buildbot/slave/monero-static-win32/build/build/release'
make[3]: Entering directory '/home/buildbot/slave/monero-static-win32/build/build/release'
[ 51%] Building CXX object src/rpc/CMakeFiles/obj_daemon_messages.dir/message.cpp.obj
[ 51%] Building CXX object src/rpc/CMakeFiles/obj_daemon_messages.dir/daemon_messages.cpp.obj
make[3]: Leaving directory '/home/buildbot/slave/monero-static-win32/build/build/release'
[ 51%] Built target obj_daemon_messages
make[3]: Entering directory '/home/buildbot/slave/monero-static-win32/build/build/release'
make[3]: Leaving directory '/home/buildbot/slave/monero-static-win32/build/build/release'
make[3]: Entering directory '/home/buildbot/slave/monero-static-win32/build/build/release'
[ 51%] Linking CXX static library libdaemon_messages.a
make[3]: Leaving directory '/home/buildbot/slave/monero-static-win32/build/build/release'
[ 51%] Built target daemon_messages
make[3]: Entering directory '/home/buildbot/slave/monero-static-win32/build/build/release'
make[3]: Leaving directory '/home/buildbot/slave/monero-static-win32/build/build/release'
make[3]: Entering directory '/home/buildbot/slave/monero-static-win32/build/build/release'
[ 51%] Building CXX object src/rpc/CMakeFiles/obj_rpc_base.dir/rpc_args.cpp.obj
make[3]: Leaving directory '/home/buildbot/slave/monero-static-win32/build/build/release'
[ 51%] Built target obj_rpc_base
make[3]: Entering directory '/home/buildbot/slave/monero-static-win32/build/build/release'
make[3]: Leaving directory '/home/buildbot/slave/monero-static-win32/build/build/release'
make[3]: Entering directory '/home/buildbot/slave/monero-static-win32/build/build/release'
[ 52%] Linking CXX static library librpc_base.a
make[3]: Leaving directory '/home/buildbot/slave/monero-static-win32/build/build/release'
[ 52%] Built target rpc_base
make[3]: Entering directory '/home/buildbot/slave/monero-static-win32/build/build/release'
make[3]: Leaving directory '/home/buildbot/slave/monero-static-win32/build/build/release'
make[3]: Entering directory '/home/buildbot/slave/monero-static-win32/build/build/release'
[ 52%] Building CXX object src/rpc/CMakeFiles/obj_daemon_rpc_server.dir/daemon_handler.cpp.obj
[ 53%] Building CXX object src/rpc/CMakeFiles/obj_daemon_rpc_server.dir/zmq_server.cpp.obj
make[3]: Leaving directory '/home/buildbot/slave/monero-static-win32/build/build/release'
[ 53%] Built target obj_daemon_rpc_server
make[3]: Entering directory '/home/buildbot/slave/monero-static-win32/build/build/release'
make[3]: Leaving directory '/home/buildbot/slave/monero-static-win32/build/build/release'
make[3]: Entering directory '/home/buildbot/slave/monero-static-win32/build/build/release'
[ 54%] Building CXX object src/rpc/CMakeFiles/obj_rpc.dir/core_rpc_server.cpp.obj
[ 54%] Building CXX object src/rpc/CMakeFiles/obj_rpc.dir/rpc_handler.cpp.obj
[ 54%] Building CXX object src/rpc/CMakeFiles/obj_rpc.dir/instanciations.cpp.obj
make[3]: Leaving directory '/home/buildbot/slave/monero-static-win32/build/build/release'
[ 54%] Built target obj_rpc
make[3]: Entering directory '/home/buildbot/slave/monero-static-win32/build/build/release'
make[3]: Leaving directory '/home/buildbot/slave/monero-static-win32/build/build/release'
make[3]: Entering directory '/home/buildbot/slave/monero-static-win32/build/build/release'
[ 54%] Linking CXX static library librpc.a
make[3]: Leaving directory '/home/buildbot/slave/monero-static-win32/build/build/release'
[ 54%] Built target rpc
make[3]: Entering directory '/home/buildbot/slave/monero-static-win32/build/build/release'
make[3]: Leaving directory '/home/buildbot/slave/monero-static-win32/build/build/release'
make[3]: Entering directory '/home/buildbot/slave/monero-static-win32/build/build/release'
[ 55%] Linking CXX static library libdaemon_rpc_server.a
make[3]: Leaving directory '/home/buildbot/slave/monero-static-win32/build/build/release'
[ 55%] Built target daemon_rpc_server
make[3]: Entering directory '/home/buildbot/slave/monero-static-win32/build/build/release'
make[3]: Leaving directory '/home/buildbot/slave/monero-static-win32/build/build/release'
make[3]: Entering directory '/home/buildbot/slave/monero-static-win32/build/build/release'
[ 55%] Building CXX object src/device_trezor/CMakeFiles/obj_device_trezor.dir/device_trezor.cpp.obj
make[3]: Leaving directory '/home/buildbot/slave/monero-static-win32/build/build/release'
[ 55%] Built target obj_device_trezor
make[3]: Entering directory '/home/buildbot/slave/monero-static-win32/build/build/release'
make[3]: Leaving directory '/home/buildbot/slave/monero-static-win32/build/build/release'
make[3]: Entering directory '/home/buildbot/slave/monero-static-win32/build/build/release'
[ 55%] Linking CXX static library libdevice_trezor.a
make[3]: Leaving directory '/home/buildbot/slave/monero-static-win32/build/build/release'
[ 55%] Built target device_trezor
make[3]: Entering directory '/home/buildbot/slave/monero-static-win32/build/build/release'
make[3]: Leaving directory '/home/buildbot/slave/monero-static-win32/build/build/release'
make[3]: Entering directory '/home/buildbot/slave/monero-static-win32/build/build/release'
[ 55%] Building CXX object src/wallet/CMakeFiles/obj_wallet.dir/wallet2.cpp.obj
C:/msys32/home/buildbot/slave/monero-static-win32/build/src/wallet/wallet2.cpp: In function 'std::unique_ptr<tools::wallet2> {anonymous}::make_basic(const boost::program_options::variables_map&, bool, const {anonymous}::options&, const std::function<boost::optional<tools::password_container>(const char*, bool)>&)':
C:/msys32/home/buildbot/slave/monero-static-win32/build/src/wallet/wallet2.cpp:328:71: warning: '*((void*)& trusted_daemon +1)' may be used uninitialized in this function [-Wmaybe-uninitialized]
   wallet->init(std::move(daemon_address), std::move(login), 0, false, *trusted_daemon);
                                                                       ^~~~~~~~~~~~~~~
[ 55%] Building CXX object src/wallet/CMakeFiles/obj_wallet.dir/wallet_args.cpp.obj
[ 56%] Building CXX object src/wallet/CMakeFiles/obj_wallet.dir/ringdb.cpp.obj
[ 56%] Building CXX object src/wallet/CMakeFiles/obj_wallet.dir/node_rpc_proxy.cpp.obj
make[3]: Leaving directory '/home/buildbot/slave/monero-static-win32/build/build/release'
[ 56%] Built target obj_wallet
make[3]: Entering directory '/home/buildbot/slave/monero-static-win32/build/build/release'
make[3]: Leaving directory '/home/buildbot/slave/monero-static-win32/build/build/release'
make[3]: Entering directory '/home/buildbot/slave/monero-static-win32/build/build/release'
[ 56%] Linking CXX static library ../../lib/libwallet.a
make[3]: Leaving directory '/home/buildbot/slave/monero-static-win32/build/build/release'
[ 56%] Built target wallet
make[3]: Entering directory '/home/buildbot/slave/monero-static-win32/build/build/release'
make[3]: Leaving directory '/home/buildbot/slave/monero-static-win32/build/build/release'
make[3]: Entering directory '/home/buildbot/slave/monero-static-win32/build/build/release'
[ 56%] Building CXX object src/daemonizer/CMakeFiles/obj_daemonizer.dir/windows_service.cpp.obj
make[3]: Leaving directory '/home/buildbot/slave/monero-static-win32/build/build/release'
[ 56%] Built target obj_daemonizer
make[3]: Entering directory '/home/buildbot/slave/monero-static-win32/build/build/release'
make[3]: Leaving directory '/home/buildbot/slave/monero-static-win32/build/build/release'
make[3]: Entering directory '/home/buildbot/slave/monero-static-win32/build/build/release'
[ 56%] Linking CXX static library libdaemonizer.a
make[3]: Leaving directory '/home/buildbot/slave/monero-static-win32/build/build/release'
[ 56%] Built target daemonizer
make[3]: Entering directory '/home/buildbot/slave/monero-static-win32/build/build/release'
make[3]: Leaving directory '/home/buildbot/slave/monero-static-win32/build/build/release'
make[3]: Entering directory '/home/buildbot/slave/monero-static-win32/build/build/release'
[ 56%] Building CXX object src/wallet/CMakeFiles/wallet_rpc_server.dir/wallet_rpc_server.cpp.obj
In file included from C:/msys32/home/buildbot/slave/monero-static-win32/build/src/daemonizer/daemonizer.h:63:0,
                 from C:/msys32/home/buildbot/slave/monero-static-win32/build/src/wallet/wallet_rpc_server.cpp:54:
C:/msys32/home/buildbot/slave/monero-static-win32/build/src/daemonizer/windows_daemonizer.inl: In function 'bool daemonizer::daemonize(int, const char**, T_executor&&, const boost::program_options::variables_map&)':
C:/msys32/home/buildbot/slave/monero-static-win32/build/src/daemonizer/windows_daemonizer.inl:183:0: note: -Wmisleading-indentation is disabled from this point onwards, since column-tracking was disabled due to the size of the code/headers
     return false;
 
[ 57%] Linking CXX executable ../../bin/monero-wallet-rpc.exe
make[3]: Leaving directory '/home/buildbot/slave/monero-static-win32/build/build/release'
[ 57%] Built target wallet_rpc_server
make[3]: Entering directory '/home/buildbot/slave/monero-static-win32/build/build/release'
make[3]: Leaving directory '/home/buildbot/slave/monero-static-win32/build/build/release'
make[3]: Entering directory '/home/buildbot/slave/monero-static-win32/build/build/release'
[ 58%] Building CXX object src/simplewallet/CMakeFiles/simplewallet.dir/simplewallet.cpp.obj
[ 58%] Linking CXX executable ../../bin/monero-wallet-cli.exe
make[3]: Leaving directory '/home/buildbot/slave/monero-static-win32/build/build/release'
[ 58%] Built target simplewallet
make[3]: Entering directory '/home/buildbot/slave/monero-static-win32/build/build/release'
make[3]: Leaving directory '/home/buildbot/slave/monero-static-win32/build/build/release'
make[3]: Entering directory '/home/buildbot/slave/monero-static-win32/build/build/release'
[ 58%] Building CXX object src/gen_multisig/CMakeFiles/gen_multisig.dir/gen_multisig.cpp.obj
[ 58%] Linking CXX executable ../../bin/monero-gen-trusted-multisig.exe
make[3]: Leaving directory '/home/buildbot/slave/monero-static-win32/build/build/release'
[ 58%] Built target gen_multisig
make[3]: Entering directory '/home/buildbot/slave/monero-static-win32/build/build/release'
make[3]: Leaving directory '/home/buildbot/slave/monero-static-win32/build/build/release'
make[3]: Entering directory '/home/buildbot/slave/monero-static-win32/build/build/release'
[ 58%] Building CXX object src/blocks/CMakeFiles/blocks.dir/blocks.cpp.obj
[ 58%] Building C object src/blocks/CMakeFiles/blocks.dir/generated_checkpoints.c.obj
[ 59%] Building C object src/blocks/CMakeFiles/blocks.dir/generated_testnet_blocks.c.obj
[ 59%] Building C object src/blocks/CMakeFiles/blocks.dir/generated_stagenet_blocks.c.obj
[ 59%] Linking CXX static library libblocks.a
make[3]: Leaving directory '/home/buildbot/slave/monero-static-win32/build/build/release'
[ 60%] Built target blocks
make[3]: Entering directory '/home/buildbot/slave/monero-static-win32/build/build/release'
make[3]: Leaving directory '/home/buildbot/slave/monero-static-win32/build/build/release'
make[3]: Entering directory '/home/buildbot/slave/monero-static-win32/build/build/release'
[ 60%] Building CXX object src/daemon/CMakeFiles/daemon.dir/command_parser_executor.cpp.obj
[ 60%] Building CXX object src/daemon/CMakeFiles/daemon.dir/command_server.cpp.obj
[ 60%] Building CXX object src/daemon/CMakeFiles/daemon.dir/daemon.cpp.obj
In file included from C:/msys32/home/buildbot/slave/monero-static-win32/build/src/daemonizer/daemonizer.h:63:0,
                 from C:/msys32/home/buildbot/slave/monero-static-win32/build/src/daemon/command_line_args.h:34,
                 from C:/msys32/home/buildbot/slave/monero-static-win32/build/src/daemon/daemon.cpp:47:
C:/msys32/home/buildbot/slave/monero-static-win32/build/src/daemonizer/windows_daemonizer.inl: In function 'bool daemonizer::daemonize(int, const char**, T_executor&&, const boost::program_options::variables_map&)':
C:/msys32/home/buildbot/slave/monero-static-win32/build/src/daemonizer/windows_daemonizer.inl:183:0: note: -Wmisleading-indentation is disabled from this point onwards, since column-tracking was disabled due to the size of the code/headers
     return false;
 
C:/msys32/home/buildbot/slave/monero-static-win32/build/src/daemonizer/windows_daemonizer.inl: At global scope:
C:/msys32/home/buildbot/slave/monero-static-win32/build/src/daemonizer/windows_daemonizer.inl:65:0: warning: 'std::__cxx11::string daemonizer::{anonymous}::get_argument_string(int, const char**)' defined but not used [-Wunused-function]
     std::string get_argument_string(int argc, char const * argv[])
 
In file included from C:/msys32/home/buildbot/slave/monero-static-win32/build/src/daemonizer/windows_daemonizer.inl:33:0,
                 from C:/msys32/home/buildbot/slave/monero-static-win32/build/src/daemonizer/daemonizer.h:63,
                 from C:/msys32/home/buildbot/slave/monero-static-win32/build/src/daemon/command_line_args.h:34,
                 from C:/msys32/home/buildbot/slave/monero-static-win32/build/src/daemon/daemon.cpp:47:
C:/msys32/home/buildbot/slave/monero-static-win32/build/src/daemonizer/windows_service_runner.h:45:23: warning: 'std::vector<char> windows::{anonymous}::vecstring(const string&)' defined but not used [-Wunused-function]
     std::vector<char> vecstring(std::string const & str)
                       ^~~~~~~~~
[ 61%] Building CXX object src/daemon/CMakeFiles/daemon.dir/executor.cpp.obj
[ 61%] Building CXX object src/daemon/CMakeFiles/daemon.dir/main.cpp.obj
In file included from C:/msys32/home/buildbot/slave/monero-static-win32/build/src/daemonizer/daemonizer.h:63:0,
                 from C:/msys32/home/buildbot/slave/monero-static-win32/build/src/daemon/main.cpp:40:
C:/msys32/home/buildbot/slave/monero-static-win32/build/src/daemonizer/windows_daemonizer.inl: In function 'bool daemonizer::daemonize(int, const char**, T_executor&&, const boost::program_options::variables_map&)':
C:/msys32/home/buildbot/slave/monero-static-win32/build/src/daemonizer/windows_daemonizer.inl:183:0: note: -Wmisleading-indentation is disabled from this point onwards, since column-tracking was disabled due to the size of the code/headers
     return false;
 
[ 61%] Building CXX object src/daemon/CMakeFiles/daemon.dir/rpc_command_executor.cpp.obj
[ 61%] Linking CXX executable ../../bin/monerod.exe
make[3]: Leaving directory '/home/buildbot/slave/monero-static-win32/build/build/release'
[ 61%] Built target daemon
make[3]: Entering directory '/home/buildbot/slave/monero-static-win32/build/build/release'
make[3]: Leaving directory '/home/buildbot/slave/monero-static-win32/build/build/release'
make[3]: Entering directory '/home/buildbot/slave/monero-static-win32/build/build/release'
[ 61%] Building CXX object src/blockchain_utilities/CMakeFiles/blockchain_export.dir/blockchain_export.cpp.obj
[ 61%] Building CXX object src/blockchain_utilities/CMakeFiles/blockchain_export.dir/bootstrap_file.cpp.obj
[ 61%] Building CXX object src/blockchain_utilities/CMakeFiles/blockchain_export.dir/blocksdat_file.cpp.obj
[ 61%] Linking CXX executable ../../bin/monero-blockchain-export.exe
make[3]: Leaving directory '/home/buildbot/slave/monero-static-win32/build/build/release'
[ 61%] Built target blockchain_export
make[3]: Entering directory '/home/buildbot/slave/monero-static-win32/build/build/release'
make[3]: Leaving directory '/home/buildbot/slave/monero-static-win32/build/build/release'
make[3]: Entering directory '/home/buildbot/slave/monero-static-win32/build/build/release'
[ 61%] Building CXX object src/blockchain_utilities/CMakeFiles/blockchain_ancestry.dir/blockchain_ancestry.cpp.obj
[ 61%] Linking CXX executable ../../bin/monero-blockchain-ancestry.exe
make[3]: Leaving directory '/home/buildbot/slave/monero-static-win32/build/build/release'
[ 61%] Built target blockchain_ancestry
make[3]: Entering directory '/home/buildbot/slave/monero-static-win32/build/build/release'
make[3]: Leaving directory '/home/buildbot/slave/monero-static-win32/build/build/release'
make[3]: Entering directory '/home/buildbot/slave/monero-static-win32/build/build/release'
[ 62%] Building CXX object src/blockchain_utilities/CMakeFiles/blockchain_stats.dir/blockchain_stats.cpp.obj
[ 62%] Linking CXX executable ../../bin/monero-blockchain-stats.exe
make[3]: Leaving directory '/home/buildbot/slave/monero-static-win32/build/build/release'
[ 62%] Built target blockchain_stats
make[3]: Entering directory '/home/buildbot/slave/monero-static-win32/build/build/release'
make[3]: Leaving directory '/home/buildbot/slave/monero-static-win32/build/build/release'
make[3]: Entering directory '/home/buildbot/slave/monero-static-win32/build/build/release'
[ 63%] Building CXX object src/blockchain_utilities/CMakeFiles/blockchain_import.dir/blockchain_import.cpp.obj
[ 63%] Building CXX object src/blockchain_utilities/CMakeFiles/blockchain_import.dir/bootstrap_file.cpp.obj
[ 63%] Building CXX object src/blockchain_utilities/CMakeFiles/blockchain_import.dir/blocksdat_file.cpp.obj
[ 63%] Linking CXX executable ../../bin/monero-blockchain-import.exe
make[3]: Leaving directory '/home/buildbot/slave/monero-static-win32/build/build/release'
[ 63%] Built target blockchain_import
make[3]: Entering directory '/home/buildbot/slave/monero-static-win32/build/build/release'
make[3]: Leaving directory '/home/buildbot/slave/monero-static-win32/build/build/release'
make[3]: Entering directory '/home/buildbot/slave/monero-static-win32/build/build/release'
[ 64%] Building CXX object src/blockchain_utilities/CMakeFiles/blockchain_blackball.dir/blockchain_blackball.cpp.obj
[ 64%] Linking CXX executable ../../bin/monero-blockchain-mark-spent-outputs.exe
make[3]: Leaving directory '/home/buildbot/slave/monero-static-win32/build/build/release'
[ 64%] Built target blockchain_blackball
make[3]: Entering directory '/home/buildbot/slave/monero-static-win32/build/build/release'
make[3]: Leaving directory '/home/buildbot/slave/monero-static-win32/build/build/release'
make[3]: Entering directory '/home/buildbot/slave/monero-static-win32/build/build/release'
[ 64%] Building CXX object src/blockchain_utilities/CMakeFiles/blockchain_usage.dir/blockchain_usage.cpp.obj
[ 64%] Linking CXX executable ../../bin/monero-blockchain-usage.exe
make[3]: Leaving directory '/home/buildbot/slave/monero-static-win32/build/build/release'
[ 64%] Built target blockchain_usage
make[3]: Entering directory '/home/buildbot/slave/monero-static-win32/build/build/release'
make[3]: Leaving directory '/home/buildbot/slave/monero-static-win32/build/build/release'
make[3]: Entering directory '/home/buildbot/slave/monero-static-win32/build/build/release'
[ 64%] Building CXX object src/blockchain_utilities/CMakeFiles/blockchain_depth.dir/blockchain_depth.cpp.obj
[ 65%] Linking CXX executable ../../bin/monero-blockchain-depth.exe
make[3]: Leaving directory '/home/buildbot/slave/monero-static-win32/build/build/release'
[ 65%] Built target blockchain_depth
make[3]: Entering directory '/home/buildbot/slave/monero-static-win32/build/build/release'
Scanning dependencies of target googletest
make[3]: Leaving directory '/home/buildbot/slave/monero-static-win32/build/build/release'
make[3]: Entering directory '/home/buildbot/slave/monero-static-win32/build/build/release'
[ 65%] Creating directories for 'googletest'
[ 65%] No download step for 'googletest'
[ 66%] No patch step for 'googletest'
[ 66%] No update step for 'googletest'
[ 66%] Performing configure step for 'googletest'
-- The CXX compiler identification is GNU 7.3.0
-- The C compiler identification is GNU 7.3.0
-- Check for working CXX compiler: C:/msys32/mingw32/bin/g++.exe
-- Check for working CXX compiler: C:/msys32/mingw32/bin/g++.exe -- works
-- Detecting CXX compiler ABI info
-- Detecting CXX compiler ABI info - done
-- Detecting CXX compile features
-- Detecting CXX compile features - done
-- Check for working C compiler: C:/msys32/mingw32/bin/gcc.exe
-- Check for working C compiler: C:/msys32/mingw32/bin/gcc.exe -- works
-- Detecting C compiler ABI info
-- Detecting C compiler ABI info - done
-- Detecting C compile features
-- Detecting C compile features - done
-- Found PythonInterp: C:/Python27/python.exe (found version "2.7.12") 
-- Configuring done
-- Generating done
-- Build files have been written to: C:/msys32/home/buildbot/slave/monero-static-win32/build/build/release/tests/gtest
[ 66%] Performing build step for 'googletest'
make[4]: Entering directory '/C/msys32/home/buildbot/slave/monero-static-win32/build/build/release/tests/gtest'
make[5]: Entering directory '/C/msys32/home/buildbot/slave/monero-static-win32/build/build/release/tests/gtest'
make[6]: Entering directory '/C/msys32/home/buildbot/slave/monero-static-win32/build/build/release/tests/gtest'
Scanning dependencies of target gtest
make[6]: Leaving directory '/C/msys32/home/buildbot/slave/monero-static-win32/build/build/release/tests/gtest'
make[6]: Entering directory '/C/msys32/home/buildbot/slave/monero-static-win32/build/build/release/tests/gtest'
[ 25%] Building CXX object CMakeFiles/gtest.dir/src/gtest-all.cc.obj
[ 50%] Linking CXX static library libgtest.a
make[6]: Leaving directory '/C/msys32/home/buildbot/slave/monero-static-win32/build/build/release/tests/gtest'
[ 50%] Built target gtest
make[6]: Entering directory '/C/msys32/home/buildbot/slave/monero-static-win32/build/build/release/tests/gtest'
Scanning dependencies of target gtest_main
make[6]: Leaving directory '/C/msys32/home/buildbot/slave/monero-static-win32/build/build/release/tests/gtest'
make[6]: Entering directory '/C/msys32/home/buildbot/slave/monero-static-win32/build/build/release/tests/gtest'
[ 75%] Building CXX object CMakeFiles/gtest_main.dir/src/gtest_main.cc.obj
[100%] Linking CXX static library libgtest_main.a
make[6]: Leaving directory '/C/msys32/home/buildbot/slave/monero-static-win32/build/build/release/tests/gtest'
[100%] Built target gtest_main
make[5]: Leaving directory '/C/msys32/home/buildbot/slave/monero-static-win32/build/build/release/tests/gtest'
make[4]: Leaving directory '/C/msys32/home/buildbot/slave/monero-static-win32/build/build/release/tests/gtest'
[ 66%] No install step for 'googletest'
[ 67%] Completed 'googletest'
make[3]: Leaving directory '/home/buildbot/slave/monero-static-win32/build/build/release'
[ 67%] Built target googletest
make[3]: Entering directory '/home/buildbot/slave/monero-static-win32/build/build/release'
Scanning dependencies of target hash-target-tests
make[3]: Leaving directory '/home/buildbot/slave/monero-static-win32/build/build/release'
make[3]: Entering directory '/home/buildbot/slave/monero-static-win32/build/build/release'
[ 67%] Building CXX object tests/CMakeFiles/hash-target-tests.dir/hash-target.cpp.obj
[ 68%] Linking CXX executable hash-target-tests.exe
make[3]: Leaving directory '/home/buildbot/slave/monero-static-win32/build/build/release'
[ 68%] Built target hash-target-tests
make[3]: Entering directory '/home/buildbot/slave/monero-static-win32/build/build/release'
Scanning dependencies of target core_tests
make[3]: Leaving directory '/home/buildbot/slave/monero-static-win32/build/build/release'
make[3]: Entering directory '/home/buildbot/slave/monero-static-win32/build/build/release'
[ 68%] Building CXX object tests/core_tests/CMakeFiles/core_tests.dir/block_reward.cpp.obj
[ 68%] Building CXX object tests/core_tests/CMakeFiles/core_tests.dir/block_validation.cpp.obj
[ 69%] Building CXX object tests/core_tests/CMakeFiles/core_tests.dir/chain_split_1.cpp.obj
[ 69%] Building CXX object tests/core_tests/CMakeFiles/core_tests.dir/chain_switch_1.cpp.obj
[ 69%] Building CXX object tests/core_tests/CMakeFiles/core_tests.dir/chaingen.cpp.obj
[ 69%] Building CXX object tests/core_tests/CMakeFiles/core_tests.dir/chaingen001.cpp.obj
[ 70%] Building CXX object tests/core_tests/CMakeFiles/core_tests.dir/chaingen_main.cpp.obj
[ 70%] Building CXX object tests/core_tests/CMakeFiles/core_tests.dir/double_spend.cpp.obj
[ 70%] Building CXX object tests/core_tests/CMakeFiles/core_tests.dir/integer_overflow.cpp.obj
[ 70%] Building CXX object tests/core_tests/CMakeFiles/core_tests.dir/multisig.cpp.obj
[ 71%] Building CXX object tests/core_tests/CMakeFiles/core_tests.dir/ring_signature_1.cpp.obj
[ 71%] Building CXX object tests/core_tests/CMakeFiles/core_tests.dir/transaction_tests.cpp.obj
[ 71%] Building CXX object tests/core_tests/CMakeFiles/core_tests.dir/tx_validation.cpp.obj
[ 71%] Building CXX object tests/core_tests/CMakeFiles/core_tests.dir/v2_tests.cpp.obj
[ 71%] Building CXX object tests/core_tests/CMakeFiles/core_tests.dir/rct.cpp.obj
[ 72%] Building CXX object tests/core_tests/CMakeFiles/core_tests.dir/bulletproofs.cpp.obj
[ 72%] Linking CXX executable core_tests.exe
make[3]: Leaving directory '/home/buildbot/slave/monero-static-win32/build/build/release'
[ 72%] Built target core_tests
make[3]: Entering directory '/home/buildbot/slave/monero-static-win32/build/build/release'
Scanning dependencies of target load-from-binary_fuzz_tests
make[3]: Leaving directory '/home/buildbot/slave/monero-static-win32/build/build/release'
make[3]: Entering directory '/home/buildbot/slave/monero-static-win32/build/build/release'
[ 73%] Building CXX object tests/fuzz/CMakeFiles/load-from-binary_fuzz_tests.dir/load_from_binary.cpp.obj
[ 73%] Building CXX object tests/fuzz/CMakeFiles/load-from-binary_fuzz_tests.dir/fuzzer.cpp.obj
[ 73%] Linking CXX executable load-from-binary_fuzz_tests.exe
make[3]: Leaving directory '/home/buildbot/slave/monero-static-win32/build/build/release'
[ 73%] Built target load-from-binary_fuzz_tests
make[3]: Entering directory '/home/buildbot/slave/monero-static-win32/build/build/release'
Scanning dependencies of target base58_fuzz_tests
make[3]: Leaving directory '/home/buildbot/slave/monero-static-win32/build/build/release'
make[3]: Entering directory '/home/buildbot/slave/monero-static-win32/build/build/release'
[ 73%] Building CXX object tests/fuzz/CMakeFiles/base58_fuzz_tests.dir/base58.cpp.obj
[ 73%] Building CXX object tests/fuzz/CMakeFiles/base58_fuzz_tests.dir/fuzzer.cpp.obj
[ 73%] Linking CXX executable base58_fuzz_tests.exe
make[3]: Leaving directory '/home/buildbot/slave/monero-static-win32/build/build/release'
[ 73%] Built target base58_fuzz_tests
make[3]: Entering directory '/home/buildbot/slave/monero-static-win32/build/build/release'
Scanning dependencies of target signature_fuzz_tests
make[3]: Leaving directory '/home/buildbot/slave/monero-static-win32/build/build/release'
make[3]: Entering directory '/home/buildbot/slave/monero-static-win32/build/build/release'
[ 73%] Building CXX object tests/fuzz/CMakeFiles/signature_fuzz_tests.dir/signature.cpp.obj
[ 73%] Building CXX object tests/fuzz/CMakeFiles/signature_fuzz_tests.dir/fuzzer.cpp.obj
[ 73%] Linking CXX executable signature_fuzz_tests.exe
make[3]: Leaving directory '/home/buildbot/slave/monero-static-win32/build/build/release'
[ 73%] Built target signature_fuzz_tests
make[3]: Entering directory '/home/buildbot/slave/monero-static-win32/build/build/release'
Scanning dependencies of target load-from-json_fuzz_tests
make[3]: Leaving directory '/home/buildbot/slave/monero-static-win32/build/build/release'
make[3]: Entering directory '/home/buildbot/slave/monero-static-win32/build/build/release'
[ 73%] Building CXX object tests/fuzz/CMakeFiles/load-from-json_fuzz_tests.dir/load_from_json.cpp.obj
[ 74%] Building CXX object tests/fuzz/CMakeFiles/load-from-json_fuzz_tests.dir/fuzzer.cpp.obj
[ 74%] Linking CXX executable load-from-json_fuzz_tests.exe
make[3]: Leaving directory '/home/buildbot/slave/monero-static-win32/build/build/release'
[ 74%] Built target load-from-json_fuzz_tests
make[3]: Entering directory '/home/buildbot/slave/monero-static-win32/build/build/release'
Scanning dependencies of target cold-transaction_fuzz_tests
make[3]: Leaving directory '/home/buildbot/slave/monero-static-win32/build/build/release'
make[3]: Entering directory '/home/buildbot/slave/monero-static-win32/build/build/release'
[ 74%] Building CXX object tests/fuzz/CMakeFiles/cold-transaction_fuzz_tests.dir/cold-transaction.cpp.obj
[ 74%] Building CXX object tests/fuzz/CMakeFiles/cold-transaction_fuzz_tests.dir/fuzzer.cpp.obj
[ 74%] Linking CXX executable cold-transaction_fuzz_tests.exe
make[3]: Leaving directory '/home/buildbot/slave/monero-static-win32/build/build/release'
[ 74%] Built target cold-transaction_fuzz_tests
make[3]: Entering directory '/home/buildbot/slave/monero-static-win32/build/build/release'
Scanning dependencies of target block_fuzz_tests
make[3]: Leaving directory '/home/buildbot/slave/monero-static-win32/build/build/release'
make[3]: Entering directory '/home/buildbot/slave/monero-static-win32/build/build/release'
[ 74%] Building CXX object tests/fuzz/CMakeFiles/block_fuzz_tests.dir/block.cpp.obj
[ 75%] Building CXX object tests/fuzz/CMakeFiles/block_fuzz_tests.dir/fuzzer.cpp.obj
[ 75%] Linking CXX executable block_fuzz_tests.exe
make[3]: Leaving directory '/home/buildbot/slave/monero-static-win32/build/build/release'
[ 75%] Built target block_fuzz_tests
make[3]: Entering directory '/home/buildbot/slave/monero-static-win32/build/build/release'
Scanning dependencies of target transaction_fuzz_tests
make[3]: Leaving directory '/home/buildbot/slave/monero-static-win32/build/build/release'
make[3]: Entering directory '/home/buildbot/slave/monero-static-win32/build/build/release'
[ 76%] Building CXX object tests/fuzz/CMakeFiles/transaction_fuzz_tests.dir/transaction.cpp.obj
[ 76%] Building CXX object tests/fuzz/CMakeFiles/transaction_fuzz_tests.dir/fuzzer.cpp.obj
[ 76%] Linking CXX executable transaction_fuzz_tests.exe
make[3]: Leaving directory '/home/buildbot/slave/monero-static-win32/build/build/release'
[ 76%] Built target transaction_fuzz_tests
make[3]: Entering directory '/home/buildbot/slave/monero-static-win32/build/build/release'
Scanning dependencies of target cold-outputs_fuzz_tests
make[3]: Leaving directory '/home/buildbot/slave/monero-static-win32/build/build/release'
make[3]: Entering directory '/home/buildbot/slave/monero-static-win32/build/build/release'
[ 76%] Building CXX object tests/fuzz/CMakeFiles/cold-outputs_fuzz_tests.dir/cold-outputs.cpp.obj
[ 76%] Building CXX object tests/fuzz/CMakeFiles/cold-outputs_fuzz_tests.dir/fuzzer.cpp.obj
[ 77%] Linking CXX executable cold-outputs_fuzz_tests.exe
make[3]: Leaving directory '/home/buildbot/slave/monero-static-win32/build/build/release'
[ 77%] Built target cold-outputs_fuzz_tests
make[3]: Entering directory '/home/buildbot/slave/monero-static-win32/build/build/release'
Scanning dependencies of target levin_fuzz_tests
make[3]: Leaving directory '/home/buildbot/slave/monero-static-win32/build/build/release'
make[3]: Entering directory '/home/buildbot/slave/monero-static-win32/build/build/release'
[ 77%] Building CXX object tests/fuzz/CMakeFiles/levin_fuzz_tests.dir/levin.cpp.obj
[ 77%] Building CXX object tests/fuzz/CMakeFiles/levin_fuzz_tests.dir/fuzzer.cpp.obj
[ 77%] Linking CXX executable levin_fuzz_tests.exe
make[3]: Leaving directory '/home/buildbot/slave/monero-static-win32/build/build/release'
[ 77%] Built target levin_fuzz_tests
make[3]: Entering directory '/home/buildbot/slave/monero-static-win32/build/build/release'
Scanning dependencies of target parse-url_fuzz_tests
make[3]: Leaving directory '/home/buildbot/slave/monero-static-win32/build/build/release'
make[3]: Entering directory '/home/buildbot/slave/monero-static-win32/build/build/release'
[ 78%] Building CXX object tests/fuzz/CMakeFiles/parse-url_fuzz_tests.dir/parse_url.cpp.obj
[ 78%] Building CXX object tests/fuzz/CMakeFiles/parse-url_fuzz_tests.dir/fuzzer.cpp.obj
[ 78%] Linking CXX executable parse-url_fuzz_tests.exe
make[3]: Leaving directory '/home/buildbot/slave/monero-static-win32/build/build/release'
[ 78%] Built target parse-url_fuzz_tests
make[3]: Entering directory '/home/buildbot/slave/monero-static-win32/build/build/release'
Scanning dependencies of target bulletproof_fuzz_tests
make[3]: Leaving directory '/home/buildbot/slave/monero-static-win32/build/build/release'
make[3]: Entering directory '/home/buildbot/slave/monero-static-win32/build/build/release'
[ 78%] Building CXX object tests/fuzz/CMakeFiles/bulletproof_fuzz_tests.dir/bulletproof.cpp.obj
In file included from C:/msys32/home/buildbot/slave/monero-static-win32/build/src/cryptonote_basic/cryptonote_basic.h:50:0,
                 from C:/msys32/home/buildbot/slave/monero-static-win32/build/tests/fuzz/bulletproof.cpp:32:
C:/msys32/home/buildbot/slave/monero-static-win32/build/src/ringct/rctTypes.h: In member function 'virtual int BulletproofFuzzer::run(const string&)':
C:/msys32/home/buildbot/slave/monero-static-win32/build/src/ringct/rctTypes.h:182:12: warning: '<anonymous>.rct::Bulletproof::A' may be used uninitialized in this function [-Wmaybe-uninitialized]
     struct Bulletproof
            ^~~~~~~~~~~
C:/msys32/home/buildbot/slave/monero-static-win32/build/src/ringct/rctTypes.h:182:12: warning: '<anonymous>.rct::Bulletproof::S' may be used uninitialized in this function [-Wmaybe-uninitialized]
C:/msys32/home/buildbot/slave/monero-static-win32/build/src/ringct/rctTypes.h:182:12: warning: '<anonymous>.rct::Bulletproof::T1' may be used uninitialized in this function [-Wmaybe-uninitialized]
C:/msys32/home/buildbot/slave/monero-static-win32/build/src/ringct/rctTypes.h:182:12: warning: '<anonymous>.rct::Bulletproof::T2' may be used uninitialized in this function [-Wmaybe-uninitialized]
C:/msys32/home/buildbot/slave/monero-static-win32/build/src/ringct/rctTypes.h:182:12: warning: '<anonymous>.rct::Bulletproof::taux' may be used uninitialized in this function [-Wmaybe-uninitialized]
C:/msys32/home/buildbot/slave/monero-static-win32/build/src/ringct/rctTypes.h:182:12: warning: '<anonymous>.rct::Bulletproof::mu' may be used uninitialized in this function [-Wmaybe-uninitialized]
C:/msys32/home/buildbot/slave/monero-static-win32/build/src/ringct/rctTypes.h:182:12: warning: '<anonymous>.rct::Bulletproof::a' may be used uninitialized in this function [-Wmaybe-uninitialized]
C:/msys32/home/buildbot/slave/monero-static-win32/build/src/ringct/rctTypes.h:182:12: warning: '<anonymous>.rct::Bulletproof::b' may be used uninitialized in this function [-Wmaybe-uninitialized]
C:/msys32/home/buildbot/slave/monero-static-win32/build/src/ringct/rctTypes.h:182:12: warning: '<anonymous>.rct::Bulletproof::t' may be used uninitialized in this function [-Wmaybe-uninitialized]
[ 79%] Building CXX object tests/fuzz/CMakeFiles/bulletproof_fuzz_tests.dir/fuzzer.cpp.obj
[ 79%] Linking CXX executable bulletproof_fuzz_tests.exe
make[3]: Leaving directory '/home/buildbot/slave/monero-static-win32/build/build/release'
[ 79%] Built target bulletproof_fuzz_tests
make[3]: Entering directory '/home/buildbot/slave/monero-static-win32/build/build/release'
Scanning dependencies of target http-client_fuzz_tests
make[3]: Leaving directory '/home/buildbot/slave/monero-static-win32/build/build/release'
make[3]: Entering directory '/home/buildbot/slave/monero-static-win32/build/build/release'
[ 79%] Building CXX object tests/fuzz/CMakeFiles/http-client_fuzz_tests.dir/http-client.cpp.obj
[ 80%] Building CXX object tests/fuzz/CMakeFiles/http-client_fuzz_tests.dir/fuzzer.cpp.obj
[ 80%] Linking CXX executable http-client_fuzz_tests.exe
make[3]: Leaving directory '/home/buildbot/slave/monero-static-win32/build/build/release'
[ 80%] Built target http-client_fuzz_tests
make[3]: Entering directory '/home/buildbot/slave/monero-static-win32/build/build/release'
Scanning dependencies of target cncrypto-tests
make[3]: Leaving directory '/home/buildbot/slave/monero-static-win32/build/build/release'
make[3]: Entering directory '/home/buildbot/slave/monero-static-win32/build/build/release'
[ 81%] Building C object tests/crypto/CMakeFiles/cncrypto-tests.dir/crypto-ops-data.c.obj
[ 81%] Building C object tests/crypto/CMakeFiles/cncrypto-tests.dir/crypto-ops.c.obj
[ 81%] Building CXX object tests/crypto/CMakeFiles/cncrypto-tests.dir/crypto.cpp.obj
[ 81%] Building C object tests/crypto/CMakeFiles/cncrypto-tests.dir/hash.c.obj
[ 81%] Building CXX object tests/crypto/CMakeFiles/cncrypto-tests.dir/main.cpp.obj
[ 82%] Building C object tests/crypto/CMakeFiles/cncrypto-tests.dir/random.c.obj
[ 82%] Linking CXX executable cncrypto-tests.exe
make[3]: Leaving directory '/home/buildbot/slave/monero-static-win32/build/build/release'
[ 82%] Built target cncrypto-tests
make[3]: Entering directory '/home/buildbot/slave/monero-static-win32/build/build/release'
Scanning dependencies of target functional_tests
make[3]: Leaving directory '/home/buildbot/slave/monero-static-win32/build/build/release'
make[3]: Entering directory '/home/buildbot/slave/monero-static-win32/build/build/release'
[ 82%] Building CXX object tests/functional_tests/CMakeFiles/functional_tests.dir/main.cpp.obj
[ 82%] Building CXX object tests/functional_tests/CMakeFiles/functional_tests.dir/transactions_flow_test.cpp.obj
[ 83%] Building CXX object tests/functional_tests/CMakeFiles/functional_tests.dir/transactions_generation_from_blockchain.cpp.obj
[ 83%] Linking CXX executable functional_tests.exe
make[3]: Leaving directory '/home/buildbot/slave/monero-static-win32/build/build/release'
[ 83%] Built target functional_tests
make[3]: Entering directory '/home/buildbot/slave/monero-static-win32/build/build/release'
Scanning dependencies of target performance_tests
make[3]: Leaving directory '/home/buildbot/slave/monero-static-win32/build/build/release'
make[3]: Entering directory '/home/buildbot/slave/monero-static-win32/build/build/release'
[ 83%] Building CXX object tests/performance_tests/CMakeFiles/performance_tests.dir/main.cpp.obj
[ 84%] Linking CXX executable performance_tests.exe
make[3]: Leaving directory '/home/buildbot/slave/monero-static-win32/build/build/release'
[ 84%] Built target performance_tests
make[3]: Entering directory '/home/buildbot/slave/monero-static-win32/build/build/release'
Scanning dependencies of target core_proxy
make[3]: Leaving directory '/home/buildbot/slave/monero-static-win32/build/build/release'
make[3]: Entering directory '/home/buildbot/slave/monero-static-win32/build/build/release'
[ 84%] Building CXX object tests/core_proxy/CMakeFiles/core_proxy.dir/core_proxy.cpp.obj
[ 84%] Linking CXX executable core_proxy.exe
make[3]: Leaving directory '/home/buildbot/slave/monero-static-win32/build/build/release'
[ 84%] Built target core_proxy
make[3]: Entering directory '/home/buildbot/slave/monero-static-win32/build/build/release'
Scanning dependencies of target test_notifier
make[3]: Leaving directory '/home/buildbot/slave/monero-static-win32/build/build/release'
make[3]: Entering directory '/home/buildbot/slave/monero-static-win32/build/build/release'
[ 84%] Building CXX object tests/unit_tests/CMakeFiles/test_notifier.dir/test_notifier.cpp.obj
[ 84%] Linking CXX executable test_notifier.exe
make[3]: Leaving directory '/home/buildbot/slave/monero-static-win32/build/build/release'
[ 84%] Built target test_notifier
make[3]: Entering directory '/home/buildbot/slave/monero-static-win32/build/build/release'
Scanning dependencies of target unit_tests
make[3]: Leaving directory '/home/buildbot/slave/monero-static-win32/build/build/release'
make[3]: Entering directory '/home/buildbot/slave/monero-static-win32/build/build/release'
[ 84%] Building CXX object tests/unit_tests/CMakeFiles/unit_tests.dir/account.cpp.obj
[ 84%] Building CXX object tests/unit_tests/CMakeFiles/unit_tests.dir/apply_permutation.cpp.obj
[ 84%] Building CXX object tests/unit_tests/CMakeFiles/unit_tests.dir/address_from_url.cpp.obj
[ 85%] Building CXX object tests/unit_tests/CMakeFiles/unit_tests.dir/ban.cpp.obj
[ 85%] Building CXX object tests/unit_tests/CMakeFiles/unit_tests.dir/base58.cpp.obj
[ 85%] Building CXX object tests/unit_tests/CMakeFiles/unit_tests.dir/blockchain_db.cpp.obj
[ 85%] Building CXX object tests/unit_tests/CMakeFiles/unit_tests.dir/block_queue.cpp.obj
[ 86%] Building CXX object tests/unit_tests/CMakeFiles/unit_tests.dir/block_reward.cpp.obj
[ 86%] Building CXX object tests/unit_tests/CMakeFiles/unit_tests.dir/bulletproofs.cpp.obj
[ 86%] Building CXX object tests/unit_tests/CMakeFiles/unit_tests.dir/canonical_amounts.cpp.obj
[ 86%] Building CXX object tests/unit_tests/CMakeFiles/unit_tests.dir/chacha.cpp.obj
[ 86%] Building CXX object tests/unit_tests/CMakeFiles/unit_tests.dir/checkpoints.cpp.obj
[ 87%] Building CXX object tests/unit_tests/CMakeFiles/unit_tests.dir/command_line.cpp.obj
[ 87%] Building CXX object tests/unit_tests/CMakeFiles/unit_tests.dir/crypto.cpp.obj
[ 87%] Building CXX object tests/unit_tests/CMakeFiles/unit_tests.dir/decompose_amount_into_digits.cpp.obj
[ 87%] Building CXX object tests/unit_tests/CMakeFiles/unit_tests.dir/device.cpp.obj
[ 88%] Building CXX object tests/unit_tests/CMakeFiles/unit_tests.dir/dns_resolver.cpp.obj
[ 88%] Building CXX object tests/unit_tests/CMakeFiles/unit_tests.dir/epee_boosted_tcp_server.cpp.obj
[ 88%] Building CXX object tests/unit_tests/CMakeFiles/unit_tests.dir/epee_levin_protocol_handler_async.cpp.obj
[ 88%] Building CXX object tests/unit_tests/CMakeFiles/unit_tests.dir/epee_utils.cpp.obj
[ 89%] Building CXX object tests/unit_tests/CMakeFiles/unit_tests.dir/expect.cpp.obj
[ 89%] Building CXX object tests/unit_tests/CMakeFiles/unit_tests.dir/fee.cpp.obj
[ 89%] Building CXX object tests/unit_tests/CMakeFiles/unit_tests.dir/json_serialization.cpp.obj
[ 89%] Building CXX object tests/unit_tests/CMakeFiles/unit_tests.dir/get_xtype_from_string.cpp.obj
[ 89%] Building CXX object tests/unit_tests/CMakeFiles/unit_tests.dir/hashchain.cpp.obj
[ 90%] Building CXX object tests/unit_tests/CMakeFiles/unit_tests.dir/http.cpp.obj
[ 90%] Building CXX object tests/unit_tests/CMakeFiles/unit_tests.dir/keccak.cpp.obj
[ 90%] Building CXX object tests/unit_tests/CMakeFiles/unit_tests.dir/logging.cpp.obj
[ 90%] Building CXX object tests/unit_tests/CMakeFiles/unit_tests.dir/main.cpp.obj
[ 91%] Building CXX object tests/unit_tests/CMakeFiles/unit_tests.dir/memwipe.cpp.obj
[ 91%] Building CXX object tests/unit_tests/CMakeFiles/unit_tests.dir/mlocker.cpp.obj
[ 91%] Building CXX object tests/unit_tests/CMakeFiles/unit_tests.dir/mnemonics.cpp.obj
[ 91%] Building CXX object tests/unit_tests/CMakeFiles/unit_tests.dir/mul_div.cpp.obj
[ 92%] Building CXX object tests/unit_tests/CMakeFiles/unit_tests.dir/multiexp.cpp.obj
[ 92%] Building CXX object tests/unit_tests/CMakeFiles/unit_tests.dir/multisig.cpp.obj
[ 92%] Building CXX object tests/unit_tests/CMakeFiles/unit_tests.dir/notify.cpp.obj
[ 92%] Building CXX object tests/unit_tests/CMakeFiles/unit_tests.dir/output_distribution.cpp.obj
[ 92%] Building CXX object tests/unit_tests/CMakeFiles/unit_tests.dir/parse_amount.cpp.obj
[ 93%] Building CXX object tests/unit_tests/CMakeFiles/unit_tests.dir/random.cpp.obj
[ 93%] Building CXX object tests/unit_tests/CMakeFiles/unit_tests.dir/serialization.cpp.obj
[ 93%] Building CXX object tests/unit_tests/CMakeFiles/unit_tests.dir/sha256.cpp.obj
[ 93%] Building CXX object tests/unit_tests/CMakeFiles/unit_tests.dir/slow_memmem.cpp.obj
[ 94%] Building CXX object tests/unit_tests/CMakeFiles/unit_tests.dir/subaddress.cpp.obj
[ 94%] Building CXX object tests/unit_tests/CMakeFiles/unit_tests.dir/test_tx_utils.cpp.obj
[ 94%] Building CXX object tests/unit_tests/CMakeFiles/unit_tests.dir/test_peerlist.cpp.obj
[ 94%] Building CXX object tests/unit_tests/CMakeFiles/unit_tests.dir/test_protocol_pack.cpp.obj
[ 95%] Building CXX object tests/unit_tests/CMakeFiles/unit_tests.dir/threadpool.cpp.obj
[ 95%] Building CXX object tests/unit_tests/CMakeFiles/unit_tests.dir/hardfork.cpp.obj
[ 95%] Building CXX object tests/unit_tests/CMakeFiles/unit_tests.dir/unbound.cpp.obj
[ 95%] Building CXX object tests/unit_tests/CMakeFiles/unit_tests.dir/uri.cpp.obj
[ 95%] Building CXX object tests/unit_tests/CMakeFiles/unit_tests.dir/varint.cpp.obj
[ 96%] Building CXX object tests/unit_tests/CMakeFiles/unit_tests.dir/ringct.cpp.obj
[ 96%] Building CXX object tests/unit_tests/CMakeFiles/unit_tests.dir/output_selection.cpp.obj
[ 96%] Building CXX object tests/unit_tests/CMakeFiles/unit_tests.dir/vercmp.cpp.obj
[ 96%] Building CXX object tests/unit_tests/CMakeFiles/unit_tests.dir/ringdb.cpp.obj
[ 97%] Building CXX object tests/unit_tests/CMakeFiles/unit_tests.dir/wipeable_string.cpp.obj
[ 97%] Building CXX object tests/unit_tests/CMakeFiles/unit_tests.dir/is_hdd.cpp.obj
[ 97%] Building CXX object tests/unit_tests/CMakeFiles/unit_tests.dir/aligned.cpp.obj
[ 97%] Linking CXX executable unit_tests.exe
make[3]: Leaving directory '/home/buildbot/slave/monero-static-win32/build/build/release'
[ 97%] Built target unit_tests
make[3]: Entering directory '/home/buildbot/slave/monero-static-win32/build/build/release'
Scanning dependencies of target difficulty-tests
make[3]: Leaving directory '/home/buildbot/slave/monero-static-win32/build/build/release'
make[3]: Entering directory '/home/buildbot/slave/monero-static-win32/build/build/release'
[ 98%] Building CXX object tests/difficulty/CMakeFiles/difficulty-tests.dir/difficulty.cpp.obj
[ 98%] Linking CXX executable difficulty-tests.exe
make[3]: Leaving directory '/home/buildbot/slave/monero-static-win32/build/build/release'
[ 98%] Built target difficulty-tests
make[3]: Entering directory '/home/buildbot/slave/monero-static-win32/build/build/release'
Scanning dependencies of target hash-tests
make[3]: Leaving directory '/home/buildbot/slave/monero-static-win32/build/build/release'
make[3]: Entering directory '/home/buildbot/slave/monero-static-win32/build/build/release'
[ 98%] Building CXX object tests/hash/CMakeFiles/hash-tests.dir/main.cpp.obj
[ 98%] Linking CXX executable hash-tests.exe
make[3]: Leaving directory '/home/buildbot/slave/monero-static-win32/build/build/release'
[ 98%] Built target hash-tests
make[3]: Entering directory '/home/buildbot/slave/monero-static-win32/build/build/release'
Scanning dependencies of target net_load_tests_srv
make[3]: Leaving directory '/home/buildbot/slave/monero-static-win32/build/build/release'
make[3]: Entering directory '/home/buildbot/slave/monero-static-win32/build/build/release'
[ 98%] Building CXX object tests/net_load_tests/CMakeFiles/net_load_tests_srv.dir/srv.cpp.obj
[ 98%] Linking CXX executable net_load_tests_srv.exe
make[3]: Leaving directory '/home/buildbot/slave/monero-static-win32/build/build/release'
[ 98%] Built target net_load_tests_srv
make[3]: Entering directory '/home/buildbot/slave/monero-static-win32/build/build/release'
Scanning dependencies of target net_load_tests_clt
make[3]: Leaving directory '/home/buildbot/slave/monero-static-win32/build/build/release'
make[3]: Entering directory '/home/buildbot/slave/monero-static-win32/build/build/release'
[ 98%] Building CXX object tests/net_load_tests/CMakeFiles/net_load_tests_clt.dir/clt.cpp.obj
[100%] Linking CXX executable net_load_tests_clt.exe
make[3]: Leaving directory '/home/buildbot/slave/monero-static-win32/build/build/release'
[100%] Built target net_load_tests_clt
make[2]: Leaving directory '/home/buildbot/slave/monero-static-win32/build/build/release'
make[1]: Leaving directory '/home/buildbot/slave/monero-static-win32/build/build/release'
make[1]: Entering directory '/home/buildbot/slave/monero-static-win32/build/build/release'
Running tests...
Test project C:/msys32/home/buildbot/slave/monero-static-win32/build/build/release
      Start  1: hash-target
 1/14 Test  #1: hash-target ......................   Passed    0.42 sec
      Start  2: cncrypto
 2/14 Test  #2: cncrypto .........................   Passed   20.38 sec
      Start  3: unit_tests
 3/14 Test  #3: unit_tests .......................***Exception: SegFault 33.15 sec
      Start  4: difficulty
 4/14 Test  #4: difficulty .......................   Passed    0.16 sec
      Start  5: hash-fast
 5/14 Test  #5: hash-fast ........................   Passed    0.12 sec
      Start  6: hash-slow
 6/14 Test  #6: hash-slow ........................   Passed    0.25 sec
      Start  7: hash-slow-1
 7/14 Test  #7: hash-slow-1 ......................   Passed    0.33 sec
      Start  8: hash-slow-2
 8/14 Test  #8: hash-slow-2 ......................   Passed    1.00 sec
      Start  9: hash-tree
 9/14 Test  #9: hash-tree ........................   Passed    0.04 sec
      Start 10: hash-extra-blake
10/14 Test #10: hash-extra-blake .................   Passed    0.08 sec
      Start 11: hash-extra-groestl
11/14 Test #11: hash-extra-groestl ...............   Passed    0.11 sec
      Start 12: hash-extra-jh
12/14 Test #12: hash-extra-jh ....................   Passed    0.08 sec
      Start 13: hash-extra-skein
13/14 Test #13: hash-extra-skein .................   Passed    0.09 sec
      Start 14: hash-variant2-int-sqrt
14/14 Test #14: hash-variant2-int-sqrt ...........   Passed  687.51 sec

93% tests passed, 1 tests failed out of 14

Total Test time (real) = 744.00 sec

The following tests FAILED:
	  3 - unit_tests (SEGFAULT)
Errors while running CTest
make[1]: Leaving directory '/home/buildbot/slave/monero-static-win32/build/build/release'
make[1]: *** [Makefile:98: test] Error 8
make: *** [Makefile:91: release-test] Error 2
program finished with exit code 2
elapsedTime=3747.304000