(view as text)
make release-static-linux-i686
 in dir /home/vagrant/slave/monero-static-ubuntu-i686/build (timeout 1200 secs)
 watching logfiles {}
 argv: ['make', 'release-static-linux-i686']
 environment:
  HOME=/home/vagrant
  LANG=en_US
  LANGUAGE=en_US:
  LESSCLOSE=/usr/bin/lesspipe %s %s
  LESSOPEN=| /usr/bin/lesspipe %s
  LOGNAME=vagrant
  LS_COLORS=rs=0:di=01;34:ln=01;36:mh=00:pi=40;33:so=01;35:do=01;35:bd=40;33;01:cd=40;33;01:or=40;31;01:mi=00:su=37;41:sg=30;43:ca=30;41:tw=30;42:ow=34;42:st=37;44:ex=01;32:*.tar=01;31:*.tgz=01;31:*.arc=01;31:*.arj=01;31:*.taz=01;31:*.lha=01;31:*.lz4=01;31:*.lzh=01;31:*.lzma=01;31:*.tlz=01;31:*.txz=01;31:*.tzo=01;31:*.t7z=01;31:*.zip=01;31:*.z=01;31:*.Z=01;31:*.dz=01;31:*.gz=01;31:*.lrz=01;31:*.lz=01;31:*.lzo=01;31:*.xz=01;31:*.bz2=01;31:*.bz=01;31:*.tbz=01;31:*.tbz2=01;31:*.tz=01;31:*.deb=01;31:*.rpm=01;31:*.jar=01;31:*.war=01;31:*.ear=01;31:*.sar=01;31:*.rar=01;31:*.alz=01;31:*.ace=01;31:*.zoo=01;31:*.cpio=01;31:*.7z=01;31:*.rz=01;31:*.cab=01;31:*.jpg=01;35:*.jpeg=01;35:*.gif=01;35:*.bmp=01;35:*.pbm=01;35:*.pgm=01;35:*.ppm=01;35:*.tga=01;35:*.xbm=01;35:*.xpm=01;35:*.tif=01;35:*.tiff=01;35:*.png=01;35:*.svg=01;35:*.svgz=01;35:*.mng=01;35:*.pcx=01;35:*.mov=01;35:*.mpg=01;35:*.mpeg=01;35:*.m2v=01;35:*.mkv=01;35:*.webm=01;35:*.ogm=01;35:*.mp4=01;35:*.m4v=01;35:*.mp4v=01;35:*.vob=01;35:*.qt=01;35:*.nuv=01;35:*.wmv=01;35:*.asf=01;35:*.rm=01;35:*.rmvb=01;35:*.flc=01;35:*.avi=01;35:*.fli=01;35:*.flv=01;35:*.gl=01;35:*.dl=01;35:*.xcf=01;35:*.xwd=01;35:*.yuv=01;35:*.cgm=01;35:*.emf=01;35:*.ogv=01;35:*.ogx=01;35:*.aac=00;36:*.au=00;36:*.flac=00;36:*.m4a=00;36:*.mid=00;36:*.midi=00;36:*.mka=00;36:*.mp3=00;36:*.mpc=00;36:*.ogg=00;36:*.ra=00;36:*.wav=00;36:*.oga=00;36:*.opus=00;36:*.spx=00;36:*.xspf=00;36:
  MAIL=/var/mail/vagrant
  PATH=/home/vagrant/bin:/home/vagrant/.local/bin:/usr/local/sbin:/usr/local/bin:/usr/sbin:/usr/bin:/sbin:/bin:/usr/games:/usr/local/games
  PWD=/home/vagrant/slave/monero-static-ubuntu-i686/build
  SHELL=/bin/bash
  SHLVL=1
  SSH_CLIENT=10.0.2.2 42102 22
  SSH_CONNECTION=10.0.2.2 42102 10.0.2.15 22
  SSH_TTY=/dev/pts/0
  TERM=xterm-256color
  USER=vagrant
  USE_SINGLE_BUILDDIR=1
  XDG_RUNTIME_DIR=/run/user/900
  XDG_SESSION_ID=2
  _=/usr/local/bin/buildslave
 using PTY: False
mkdir -p build/release
cd build/release && cmake -D STATIC=ON -D ARCH="i686" -D BUILD_64=OFF -D CMAKE_BUILD_TYPE=release -D BUILD_TAG="linux-x86" ../.. && make
-- CMake version 3.5.1
-- The C compiler identification is GNU 5.4.0
-- The CXX compiler identification is GNU 5.4.0
-- Check for working C compiler: /usr/bin/cc
-- Check for working C compiler: /usr/bin/cc -- works
-- Detecting C compiler ABI info
-- Detecting C compiler ABI info - done
-- Detecting C compile features
-- Detecting C compile features - done
-- Check for working CXX compiler: /usr/bin/c++
-- Check for working CXX compiler: /usr/bin/c++ -- works
-- Detecting CXX compiler ABI info
-- Detecting CXX compiler ABI info - done
-- Detecting CXX compile features
-- Detecting CXX compile features - done
-- The ASM compiler identification is GNU
-- Found assembler: /usr/bin/cc
-- Building build tag linux-x86
-- Found Git: /usr/bin/git (found version "2.7.4") 
-- Checking submodules
-- Submodule 'external/miniupnp' is up-to-date
-- Submodule 'external/unbound' is up-to-date
-- Submodule 'external/rapidjson' is up-to-date
-- Submodule 'external/trezor-common' is up-to-date
-- Could not find DEVELOPER_LOCAL_TOOLS in env (not required)
-- BOOST_IGNORE_SYSTEM_PATHS defaults to OFF
-- Could not find DEVELOPER_LIBUNBOUND_OLD in env (not required)
-- Building for a 32-bit system
-- Building internal libraries as static
-- Could not find DATABASE in env (not required unless you want to change database type from default: lmdb)
-- Using LMDB as default DB type
-- Stack trace on exception enabled (using easylogging++)
-- Looking for pthread.h
-- Looking for pthread.h - found
-- Looking for pthread_create
-- Looking for pthread_create - not found
-- Check if compiler accepts -pthread
-- Check if compiler accepts -pthread - yes
-- Found Threads: TRUE  
-- Performing Test _pthread_c
-- Performing Test _pthread_c - Success
-- Performing Test _pthread_cxx
-- Performing Test _pthread_cxx - Success
-- Found OpenSSL: /usr/lib/i386-linux-gnu/libssl.a;/usr/lib/i386-linux-gnu/libcrypto.a (found version "1.0.2g") 
-- Using OpenSSL include dir at /usr/include
-- Found HIDAPI: /usr/local/lib/libhidapi-libusb.a  
-- Looking for memset_s in c
-- Looking for memset_s in c - not found
-- Looking for explicit_bzero in c
-- Looking for explicit_bzero in c - not found
-- Looking for strptime
-- Looking for strptime - found
-- Could NOT find MiniUPnPc (missing:  MINIUPNP_INCLUDE_DIR MINIUPNP_LIBRARY) 
-- Using in-tree miniupnpc
-- Looking for libunbound
-- Looking for arpa/inet.h
-- Looking for arpa/inet.h - found
-- Looking for endian.h
-- Looking for endian.h - found
-- Looking for dlfcn.h
-- Looking for dlfcn.h - found
-- Looking for event.h
-- Looking for event.h - found
-- Looking for getopt.h
-- Looking for getopt.h - found
-- Looking for glob.h
-- Looking for glob.h - found
-- Looking for grp.h
-- Looking for grp.h - found
-- Looking for inttypes.h
-- Looking for inttypes.h - found
-- Looking for iphlpapi.h
-- Looking for iphlpapi.h - not found
-- Looking for login_cap.h
-- Looking for login_cap.h - not found
-- Looking for memory.h
-- Looking for memory.h - found
-- Looking for netdb.h
-- Looking for netdb.h - found
-- Looking for netinet/in.h
-- Looking for netinet/in.h - found
-- Looking for pthread.h
-- Looking for pthread.h - found
-- Looking for pwd.h
-- Looking for pwd.h - found
-- Looking for stdarg.h
-- Looking for stdarg.h - found
-- Looking for stdbool.h
-- Looking for stdbool.h - found
-- Looking for stdint.h
-- Looking for stdint.h - found
-- Looking for stdlib.h
-- Looking for stdlib.h - found
-- Looking for strings.h
-- Looking for strings.h - found
-- Looking for string.h
-- Looking for string.h - found
-- Looking for sys/param.h
-- Looking for sys/param.h - found
-- Looking for sys/resource.h
-- Looking for sys/resource.h - found
-- Looking for sys/sha2.h
-- Looking for sys/sha2.h - not found
-- Looking for sys/socket.h
-- Looking for sys/socket.h - found
-- Looking for sys/stat.h
-- Looking for sys/stat.h - found
-- Looking for sys/sysctl.h
-- Looking for sys/sysctl.h - found
-- Looking for sys/types.h
-- Looking for sys/types.h - found
-- Looking for sys/uio.h
-- Looking for sys/uio.h - found
-- Looking for sys/un.h
-- Looking for sys/un.h - found
-- Looking for sys/wait.h
-- Looking for sys/wait.h - found
-- Looking for syslog.h
-- Looking for syslog.h - found
-- Looking for time.h
-- Looking for time.h - found
-- Looking for unistd.h
-- Looking for unistd.h - found
-- Looking for vfork.h
-- Looking for vfork.h - not found
-- Looking for windows.h
-- Looking for windows.h - not found
-- Looking for winsock2.h
-- Looking for winsock2.h - not found
-- Looking for ws2tcpip.h
-- Looking for ws2tcpip.h - not found
-- Looking for _beginthreadex
-- Looking for _beginthreadex - not found
-- Looking for arc4random
-- Looking for arc4random - not found
-- Looking for arc4random_uniform
-- Looking for arc4random_uniform - not found
-- Looking for chown
-- Looking for chown - found
-- Looking for chroot
-- Looking for chroot - found
-- Looking for ctime_r
-- Looking for ctime_r - found
-- Looking for daemon
-- Looking for daemon - found
-- Looking for endprotoent
-- Looking for endprotoent - found
-- Looking for endservent
-- Looking for endservent - found
-- Looking for fork
-- Looking for fork - found
-- Looking for fseeko
-- Looking for fseeko - found
-- Looking for fsync
-- Looking for fsync - found
-- Looking for getauxval
-- Looking for getauxval - found
-- Looking for getentropy
-- Looking for getentropy - not found
-- Looking for getpwnam
-- Looking for getpwnam - found
-- Looking for getrlimit
-- Looking for getrlimit - found
-- Looking for glob
-- Looking for glob - found
-- Looking for gmtime_r
-- Looking for gmtime_r - found
-- Looking for fcntl
-- Looking for fcntl - found
-- Looking for inet_aton
-- Looking for inet_aton - found
-- Looking for inet_ntop
-- Looking for inet_ntop - found
-- Looking for inet_pton
-- Looking for inet_pton - found
-- Looking for initgroups
-- Looking for initgroups - found
-- Looking for ioctlsocket
-- Looking for ioctlsocket - not found
-- Looking for isblank
-- Looking for isblank - found
-- Looking for kill
-- Looking for kill - found
-- Looking for localtime_r
-- Looking for localtime_r - found
-- Looking for malloc
-- Looking for malloc - found
-- Looking for memmove
-- Looking for memmove - found
-- Looking for random
-- Looking for random - found
-- Looking for reallocarray
-- Looking for reallocarray - not found
-- Looking for recvmsg
-- Looking for recvmsg - found
-- Looking for sbrk
-- Looking for sbrk - found
-- Looking for sendmsg
-- Looking for sendmsg - found
-- Looking for setregid
-- Looking for setregid - found
-- Looking for setresgid
-- Looking for setresgid - found
-- Looking for setresuid
-- Looking for setresuid - found
-- Looking for setreuid
-- Looking for setreuid - found
-- Looking for setrlimit
-- Looking for setrlimit - found
-- Looking for setsid
-- Looking for setsid - found
-- Looking for setusercontent
-- Looking for setusercontent - not found
-- Looking for sigprocmask
-- Looking for sigprocmask - found
-- Looking for sleep
-- Looking for sleep - found
-- Looking for snprintf
-- Looking for snprintf - found
-- Looking for socketpair
-- Looking for socketpair - found
-- Looking for srandom
-- Looking for srandom - found
-- Looking for strsep
-- Looking for strsep - found
-- Looking for strftime
-- Looking for strftime - found
-- Looking for strlcat
-- Looking for strlcat - not found
-- Looking for strlcpy
-- Looking for strlcpy - not found
-- Looking for strptime
-- Looking for strptime - found
-- Looking for tzset
-- Looking for tzset - found
-- Looking for usleep
-- Looking for usleep - found
-- Looking for writev
-- Looking for writev - found
-- Looking for getaddrinfo
-- Looking for getaddrinfo - found
-- Looking for stddef.h
-- Looking for stddef.h - found
-- Check size of time_t
-- Check size of time_t - done
-- Check size of gid_t
-- Check size of gid_t - done
-- Check size of in_addr_t
-- Check size of in_addr_t - done
-- Check size of in_port_t
-- Check size of in_port_t - done
-- Check size of int16_t
-- Check size of int16_t - done
-- Check size of int32_t
-- Check size of int32_t - done
-- Check size of int64_t
-- Check size of int64_t - done
-- Check size of int8_t
-- Check size of int8_t - done
-- Check size of pid_t
-- Check size of pid_t - done
-- Check size of rlim_t
-- Check size of rlim_t - done
-- Check size of ssize_t
-- Check size of ssize_t - done
-- Check size of uid_t
-- Check size of uid_t - done
-- Check size of uint16_t
-- Check size of uint16_t - done
-- Check size of uint32_t
-- Check size of uint32_t - done
-- Check size of uint64_t
-- Check size of uint64_t - done
-- Check size of uint8_t
-- Check size of uint8_t - done
-- Looking for PTHREAD_PRIO_INHERIT
-- Looking for PTHREAD_PRIO_INHERIT - not found
-- Looking for pthread_rwlock_t
-- Looking for pthread_rwlock_t - not found
-- Looking for pthread_spinlock_t
-- Looking for pthread_spinlock_t - not found
-- Looking for openssl/conf.h
-- Looking for openssl/conf.h - found
-- Looking for openssl/engine.h
-- Looking for openssl/engine.h - found
-- Looking for openssl/err.h
-- Looking for openssl/err.h - found
-- Looking for openssl/rand.h
-- Looking for openssl/rand.h - found
-- Looking for openssl/ssl.h
-- Looking for openssl/ssl.h - found
-- Looking for NID_secp384r1
-- Looking for NID_secp384r1 - found
-- Looking for NID_X9_62_prime256v1
-- Looking for NID_X9_62_prime256v1 - found
-- Looking for sk_SSL_COMP_pop_free
-- Looking for sk_SSL_COMP_pop_free - found
-- Looking for SSL_COMP_get_compression_methods
-- Looking for SSL_COMP_get_compression_methods - found
-- Looking for EVP_MD_CTX_new
-- Looking for EVP_MD_CTX_new - not found
-- Looking for EVP_sha1
-- Looking for EVP_sha1 - found
-- Looking for EVP_sha256
-- Looking for EVP_sha256 - found
-- Looking for EVP_sha512
-- Looking for EVP_sha512 - found
-- Looking for FIPS_mode
-- Looking for FIPS_mode - found
-- Looking for HMAC_Update
-- Looking for HMAC_Update - found
-- Looking for OPENSSL_config
-- Looking for OPENSSL_config - found
-- Looking for SHA512_Update
-- Looking for SHA512_Update - found
-- Found PkgConfig: /usr/bin/pkg-config (found version "0.29.1") 
-- Looking for LIBRESSL_VERSION_TEXT
-- Looking for LIBRESSL_VERSION_TEXT - not found
-- Using 32-bit LMDB from source tree
-- Using HIDAPI include dir at /usr/include/hidapi
-- Found Protobuf: /usr/lib/i386-linux-gnu/libprotobuf.a  
-- Protobuf lib: /usr/lib/i386-linux-gnu/libprotobuf.a, inc: /usr/include, protoc: /usr/bin/protoc
-- Found PythonInterp: /usr/bin/python (found version "2.7.12") 
-- Trezor protobuf messages regenerated out: "."
-- Checking for module 'libusb-1.0'
--   Found libusb-1.0, version 1.0.20
-- Looking for libusb_get_device_list in /usr/lib/i386-linux-gnu/libusb-1.0.a
-- Looking for libusb_get_device_list in /usr/lib/i386-linux-gnu/libusb-1.0.a - not found
-- Looking for libusb_get_port_numbers in /usr/lib/i386-linux-gnu/libusb-1.0.a
-- Looking for libusb_get_port_numbers in /usr/lib/i386-linux-gnu/libusb-1.0.a - not found
-- Building on i686 for i686
-- AES support enabled
-- Performing Test _Wformat_c
-- Performing Test _Wformat_c - Success
-- Performing Test _Wformat_cxx
-- Performing Test _Wformat_cxx - Success
-- Performing Test _Wformat_security_c
-- Performing Test _Wformat_security_c - Success
-- Performing Test _Wformat_security_cxx
-- Performing Test _Wformat_security_cxx - Success
-- Performing Test _fstack_protector_c
-- Performing Test _fstack_protector_c - Success
-- Performing Test _fstack_protector_cxx
-- Performing Test _fstack_protector_cxx - Success
-- Performing Test _fstack_protector_strong_c
-- Performing Test _fstack_protector_strong_c - Success
-- Performing Test _fstack_protector_strong_cxx
-- Performing Test _fstack_protector_strong_cxx - Success
-- Performing Test _fcf_protection=full_c
-- Performing Test _fcf_protection=full_c - Failed
-- Performing Test _fcf_protection=full_cxx
-- Performing Test _fcf_protection=full_cxx - Failed
-- Performing Test _fstack_clash_protection_c
-- Performing Test _fstack_clash_protection_c - Failed
-- Performing Test _fstack_clash_protection_cxx
-- Performing Test _fstack_clash_protection_cxx - Failed
-- Performing Test _mmitigate_rop_c
-- Performing Test _mmitigate_rop_c - Failed
-- Performing Test _mmitigate_rop_cxx
-- Performing Test _mmitigate_rop_cxx - Failed
-- Looking for -pie linker flag
-- Looking for -pie linker flag - found
-- Looking for -Wl,-z,relro linker flag
-- Looking for -Wl,-z,relro linker flag - found
-- Looking for -Wl,-z,now linker flag
-- Looking for -Wl,-z,now linker flag - found
-- Looking for -Wl,-z,noexecstack linker flag
-- Looking for -Wl,-z,noexecstack linker flag - found
-- Looking for -Wl,-z,noexecheap linker flag
-- Looking for -Wl,-z,noexecheap linker flag - not found
-- Using C security hardening flags:  -Wformat -Wformat-security -fstack-protector -fstack-protector-strong
-- Using C++ security hardening flags:  -Wformat -Wformat-security -fstack-protector -fstack-protector-strong
-- Using linker security hardening flags:  -pie -Wl,-z,relro -Wl,-z,now -Wl,-z,noexecstack
-- Found Boost Version: 105800
-- Found Readline: /usr/include  
-- Looking for rl_copy_text
-- Looking for rl_copy_text - not found
-- Looking for rl_filename_completion_function
-- Looking for rl_filename_completion_function - not found
-- Looking for rl_copy_text
-- Looking for rl_copy_text - found
-- Looking for rl_filename_completion_function
-- Looking for rl_filename_completion_function - found
-- Found readline library at: /usr
-- Found Git: /usr/bin/git
-- Trezor support enabled
-- Found Doxygen: /usr/bin/doxygen (found version "1.8.11") 
-- Performing Test HAVE_C11
-- Performing Test HAVE_C11 - Success
-- Configuring done
-- Generating done
-- Build files have been written to: /home/vagrant/slave/monero-static-ubuntu-i686/build/build/release
make[1]: Entering directory '/home/vagrant/slave/monero-static-ubuntu-i686/build/build/release'
make[2]: Entering directory '/home/vagrant/slave/monero-static-ubuntu-i686/build/build/release'
make[3]: Entering directory '/home/vagrant/slave/monero-static-ubuntu-i686/build/build/release'
Scanning dependencies of target generate_translations_header
make[3]: Leaving directory '/home/vagrant/slave/monero-static-ubuntu-i686/build/build/release'
make[3]: Entering directory '/home/vagrant/slave/monero-static-ubuntu-i686/build/build/release'
[  0%] Creating directories for 'generate_translations_header'
[  0%] No download step for 'generate_translations_header'
[  0%] No patch step for 'generate_translations_header'
[  1%] No update step for 'generate_translations_header'
[  1%] Performing configure step for 'generate_translations_header'
-- The C compiler identification is GNU 5.4.0
-- The CXX compiler identification is GNU 5.4.0
-- Check for working C compiler: /usr/bin/cc
-- Check for working C compiler: /usr/bin/cc -- works
-- Detecting C compiler ABI info
-- Detecting C compiler ABI info - done
-- Detecting C compile features
-- Detecting C compile features - done
-- Check for working CXX compiler: /usr/bin/c++
-- Check for working CXX compiler: /usr/bin/c++ -- works
-- Detecting CXX compiler ABI info
-- Detecting CXX compiler ABI info - done
-- Detecting CXX compile features
-- Detecting CXX compile features - done
lrelease: could not find a Qt installation of ''
CMake Warning at CMakeLists.txt:59 (message):
  lrelease program not working, translation files not built


-- Configuring done
-- Generating done
-- Build files have been written to: /home/vagrant/slave/monero-static-ubuntu-i686/build/build/release/translations
[  2%] Performing build step for 'generate_translations_header'
make[4]: Entering directory '/home/vagrant/slave/monero-static-ubuntu-i686/build/build/release/translations'
make[5]: Entering directory '/home/vagrant/slave/monero-static-ubuntu-i686/build/build/release/translations'
make[6]: Entering directory '/home/vagrant/slave/monero-static-ubuntu-i686/build/build/release/translations'
Scanning dependencies of target generate_translations_header
make[6]: Leaving directory '/home/vagrant/slave/monero-static-ubuntu-i686/build/build/release/translations'
make[6]: Entering directory '/home/vagrant/slave/monero-static-ubuntu-i686/build/build/release/translations'
[ 50%] Building C object CMakeFiles/generate_translations_header.dir/generate_translations_header.c.o
[100%] Linking C executable generate_translations_header
Generating embedded translations header
make[6]: Leaving directory '/home/vagrant/slave/monero-static-ubuntu-i686/build/build/release/translations'
[100%] Built target generate_translations_header
make[5]: Leaving directory '/home/vagrant/slave/monero-static-ubuntu-i686/build/build/release/translations'
make[4]: Leaving directory '/home/vagrant/slave/monero-static-ubuntu-i686/build/build/release/translations'
[  3%] Performing install step for 'generate_translations_header'

[  3%] Completed 'generate_translations_header'
make[3]: Leaving directory '/home/vagrant/slave/monero-static-ubuntu-i686/build/build/release'
[  3%] Built target generate_translations_header
make[3]: Entering directory '/home/vagrant/slave/monero-static-ubuntu-i686/build/build/release'
Scanning dependencies of target libminiupnpc-static
make[3]: Leaving directory '/home/vagrant/slave/monero-static-ubuntu-i686/build/build/release'
make[3]: Entering directory '/home/vagrant/slave/monero-static-ubuntu-i686/build/build/release'
[  3%] Building C object external/miniupnp/miniupnpc/CMakeFiles/libminiupnpc-static.dir/igd_desc_parse.c.o
[  4%] Building C object external/miniupnp/miniupnpc/CMakeFiles/libminiupnpc-static.dir/miniupnpc.c.o
[  4%] Building C object external/miniupnp/miniupnpc/CMakeFiles/libminiupnpc-static.dir/minixml.c.o
[  4%] Building C object external/miniupnp/miniupnpc/CMakeFiles/libminiupnpc-static.dir/minisoap.c.o
[  5%] Building C object external/miniupnp/miniupnpc/CMakeFiles/libminiupnpc-static.dir/minissdpc.c.o
[  5%] Building C object external/miniupnp/miniupnpc/CMakeFiles/libminiupnpc-static.dir/miniwget.c.o
[  5%] Building C object external/miniupnp/miniupnpc/CMakeFiles/libminiupnpc-static.dir/upnpcommands.c.o
[  5%] Building C object external/miniupnp/miniupnpc/CMakeFiles/libminiupnpc-static.dir/upnpdev.c.o
[  6%] Building C object external/miniupnp/miniupnpc/CMakeFiles/libminiupnpc-static.dir/upnpreplyparse.c.o
[  6%] Building C object external/miniupnp/miniupnpc/CMakeFiles/libminiupnpc-static.dir/upnperrors.c.o
[  6%] Building C object external/miniupnp/miniupnpc/CMakeFiles/libminiupnpc-static.dir/connecthostport.c.o
[  7%] Building C object external/miniupnp/miniupnpc/CMakeFiles/libminiupnpc-static.dir/portlistingparse.c.o
[  7%] Building C object external/miniupnp/miniupnpc/CMakeFiles/libminiupnpc-static.dir/receivedata.c.o
[  7%] Linking C static library libminiupnpc.a
make[3]: Leaving directory '/home/vagrant/slave/monero-static-ubuntu-i686/build/build/release'
[  7%] Built target libminiupnpc-static
make[3]: Entering directory '/home/vagrant/slave/monero-static-ubuntu-i686/build/build/release'
Scanning dependencies of target unbound
make[3]: Leaving directory '/home/vagrant/slave/monero-static-ubuntu-i686/build/build/release'
make[3]: Entering directory '/home/vagrant/slave/monero-static-ubuntu-i686/build/build/release'
[  7%] Building C object external/unbound/CMakeFiles/unbound.dir/services/authzone.c.o
[  7%] Building C object external/unbound/CMakeFiles/unbound.dir/services/cache/dns.c.o
[  7%] Building C object external/unbound/CMakeFiles/unbound.dir/services/cache/infra.c.o
[  8%] Building C object external/unbound/CMakeFiles/unbound.dir/services/cache/rrset.c.o
[  8%] Building C object external/unbound/CMakeFiles/unbound.dir/util/data/dname.c.o
[  8%] Building C object external/unbound/CMakeFiles/unbound.dir/util/data/msgencode.c.o
[  9%] Building C object external/unbound/CMakeFiles/unbound.dir/util/data/msgparse.c.o
[  9%] Building C object external/unbound/CMakeFiles/unbound.dir/util/data/msgreply.c.o
[  9%] Building C object external/unbound/CMakeFiles/unbound.dir/util/data/packed_rrset.c.o
[ 10%] Building C object external/unbound/CMakeFiles/unbound.dir/iterator/iterator.c.o
[ 10%] Building C object external/unbound/CMakeFiles/unbound.dir/iterator/iter_delegpt.c.o
[ 10%] Building C object external/unbound/CMakeFiles/unbound.dir/iterator/iter_donotq.c.o
[ 11%] Building C object external/unbound/CMakeFiles/unbound.dir/iterator/iter_fwd.c.o
[ 11%] Building C object external/unbound/CMakeFiles/unbound.dir/iterator/iter_hints.c.o
[ 11%] Building C object external/unbound/CMakeFiles/unbound.dir/iterator/iter_priv.c.o
[ 12%] Building C object external/unbound/CMakeFiles/unbound.dir/iterator/iter_resptype.c.o
[ 12%] Building C object external/unbound/CMakeFiles/unbound.dir/iterator/iter_scrub.c.o
[ 12%] Building C object external/unbound/CMakeFiles/unbound.dir/iterator/iter_utils.c.o
[ 13%] Building C object external/unbound/CMakeFiles/unbound.dir/respip/respip.c.o
[ 13%] Building C object external/unbound/CMakeFiles/unbound.dir/services/listen_dnsport.c.o
[ 13%] Building C object external/unbound/CMakeFiles/unbound.dir/services/localzone.c.o
[ 14%] Building C object external/unbound/CMakeFiles/unbound.dir/services/mesh.c.o
[ 14%] Building C object external/unbound/CMakeFiles/unbound.dir/services/modstack.c.o
[ 14%] Building C object external/unbound/CMakeFiles/unbound.dir/services/outbound_list.c.o
[ 15%] Building C object external/unbound/CMakeFiles/unbound.dir/services/outside_network.c.o
[ 15%] Building C object external/unbound/CMakeFiles/unbound.dir/services/view.c.o
[ 15%] Building C object external/unbound/CMakeFiles/unbound.dir/util/alloc.c.o
[ 16%] Building C object external/unbound/CMakeFiles/unbound.dir/util/as112.c.o
[ 16%] Building C object external/unbound/CMakeFiles/unbound.dir/util/config_file.c.o
[ 16%] Building C object external/unbound/CMakeFiles/unbound.dir/util/configlexer.c.o
[ 16%] Building C object external/unbound/CMakeFiles/unbound.dir/util/configparser.c.o
[ 17%] Building C object external/unbound/CMakeFiles/unbound.dir/util/fptr_wlist.c.o
[ 17%] Building C object external/unbound/CMakeFiles/unbound.dir/util/locks.c.o
[ 17%] Building C object external/unbound/CMakeFiles/unbound.dir/util/log.c.o
[ 18%] Building C object external/unbound/CMakeFiles/unbound.dir/util/mini_event.c.o
[ 18%] Building C object external/unbound/CMakeFiles/unbound.dir/util/module.c.o
[ 18%] Building C object external/unbound/CMakeFiles/unbound.dir/util/netevent.c.o
[ 19%] Building C object external/unbound/CMakeFiles/unbound.dir/util/net_help.c.o
[ 19%] Building C object external/unbound/CMakeFiles/unbound.dir/util/random.c.o
[ 19%] Building C object external/unbound/CMakeFiles/unbound.dir/util/rbtree.c.o
[ 20%] Building C object external/unbound/CMakeFiles/unbound.dir/util/regional.c.o
[ 20%] Building C object external/unbound/CMakeFiles/unbound.dir/util/rtt.c.o
[ 20%] Building C object external/unbound/CMakeFiles/unbound.dir/util/storage/dnstree.c.o
[ 21%] Building C object external/unbound/CMakeFiles/unbound.dir/util/storage/lookup3.c.o
[ 21%] Building C object external/unbound/CMakeFiles/unbound.dir/util/storage/lruhash.c.o
[ 21%] Building C object external/unbound/CMakeFiles/unbound.dir/util/storage/slabhash.c.o
[ 22%] Building C object external/unbound/CMakeFiles/unbound.dir/util/timehist.c.o
[ 22%] Building C object external/unbound/CMakeFiles/unbound.dir/util/tube.c.o
[ 22%] Building C object external/unbound/CMakeFiles/unbound.dir/util/ub_event.c.o
[ 23%] Building C object external/unbound/CMakeFiles/unbound.dir/util/winsock_event.c.o
[ 23%] Building C object external/unbound/CMakeFiles/unbound.dir/validator/autotrust.c.o
[ 23%] Building C object external/unbound/CMakeFiles/unbound.dir/validator/val_anchor.c.o
[ 25%] Building C object external/unbound/CMakeFiles/unbound.dir/validator/validator.c.o
[ 25%] Building C object external/unbound/CMakeFiles/unbound.dir/validator/val_kcache.c.o
[ 25%] Building C object external/unbound/CMakeFiles/unbound.dir/validator/val_kentry.c.o
[ 26%] Building C object external/unbound/CMakeFiles/unbound.dir/validator/val_neg.c.o
[ 26%] Building C object external/unbound/CMakeFiles/unbound.dir/validator/val_nsec3.c.o
[ 26%] Building C object external/unbound/CMakeFiles/unbound.dir/validator/val_nsec.c.o
[ 26%] Building C object external/unbound/CMakeFiles/unbound.dir/validator/val_secalgo.c.o
[ 27%] Building C object external/unbound/CMakeFiles/unbound.dir/validator/val_sigcrypt.c.o
[ 27%] Building C object external/unbound/CMakeFiles/unbound.dir/validator/val_utils.c.o
[ 27%] Building C object external/unbound/CMakeFiles/unbound.dir/dns64/dns64.c.o
[ 28%] Building C object external/unbound/CMakeFiles/unbound.dir/testcode/checklocks.c.o
[ 28%] Building C object external/unbound/CMakeFiles/unbound.dir/sldns/keyraw.c.o
[ 28%] Building C object external/unbound/CMakeFiles/unbound.dir/sldns/sbuffer.c.o
[ 29%] Building C object external/unbound/CMakeFiles/unbound.dir/sldns/wire2str.c.o
[ 29%] Building C object external/unbound/CMakeFiles/unbound.dir/sldns/parse.c.o
[ 29%] Building C object external/unbound/CMakeFiles/unbound.dir/sldns/parseutil.c.o
[ 30%] Building C object external/unbound/CMakeFiles/unbound.dir/sldns/rrdef.c.o
[ 30%] Building C object external/unbound/CMakeFiles/unbound.dir/sldns/str2wire.c.o
[ 30%] Building C object external/unbound/CMakeFiles/unbound.dir/compat/strlcat.c.o
[ 31%] Building C object external/unbound/CMakeFiles/unbound.dir/compat/strlcpy.c.o
[ 31%] Building C object external/unbound/CMakeFiles/unbound.dir/compat/explicit_bzero.c.o
[ 31%] Building C object external/unbound/CMakeFiles/unbound.dir/compat/arc4random.c.o
[ 32%] Building C object external/unbound/CMakeFiles/unbound.dir/compat/arc4random_uniform.c.o
[ 32%] Building C object external/unbound/CMakeFiles/unbound.dir/compat/reallocarray.c.o
[ 32%] Building C object external/unbound/CMakeFiles/unbound.dir/compat/arc4_lock.c.o
[ 33%] Building C object external/unbound/CMakeFiles/unbound.dir/compat/getentropy_linux.c.o
[ 33%] Building C object external/unbound/CMakeFiles/unbound.dir/libunbound/context.c.o
[ 33%] Building C object external/unbound/CMakeFiles/unbound.dir/libunbound/libunbound.c.o
[ 34%] Building C object external/unbound/CMakeFiles/unbound.dir/libunbound/libworker.c.o
[ 34%] Linking C static library libunbound.a
make[3]: Leaving directory '/home/vagrant/slave/monero-static-ubuntu-i686/build/build/release'
[ 34%] Built target unbound
make[3]: Entering directory '/home/vagrant/slave/monero-static-ubuntu-i686/build/build/release'
Scanning dependencies of target lmdb
make[3]: Leaving directory '/home/vagrant/slave/monero-static-ubuntu-i686/build/build/release'
make[3]: Entering directory '/home/vagrant/slave/monero-static-ubuntu-i686/build/build/release'
[ 35%] Building C object external/db_drivers/liblmdb/CMakeFiles/lmdb.dir/mdb.c.o
[ 35%] Building C object external/db_drivers/liblmdb/CMakeFiles/lmdb.dir/midl.c.o
[ 35%] Linking C static library liblmdb.a
make[3]: Leaving directory '/home/vagrant/slave/monero-static-ubuntu-i686/build/build/release'
[ 35%] Built target lmdb
make[3]: Entering directory '/home/vagrant/slave/monero-static-ubuntu-i686/build/build/release'
Scanning dependencies of target easylogging
make[3]: Leaving directory '/home/vagrant/slave/monero-static-ubuntu-i686/build/build/release'
make[3]: Entering directory '/home/vagrant/slave/monero-static-ubuntu-i686/build/build/release'
[ 35%] Building CXX object external/easylogging++/CMakeFiles/easylogging.dir/easylogging++.cc.o
[ 35%] Linking CXX static library libeasylogging.a
make[3]: Leaving directory '/home/vagrant/slave/monero-static-ubuntu-i686/build/build/release'
[ 35%] Built target easylogging
make[3]: Entering directory '/home/vagrant/slave/monero-static-ubuntu-i686/build/build/release'
Scanning dependencies of target epee
make[3]: Leaving directory '/home/vagrant/slave/monero-static-ubuntu-i686/build/build/release'
make[3]: Entering directory '/home/vagrant/slave/monero-static-ubuntu-i686/build/build/release'
[ 36%] Building CXX object contrib/epee/src/CMakeFiles/epee.dir/hex.cpp.o
[ 36%] Building CXX object contrib/epee/src/CMakeFiles/epee.dir/http_auth.cpp.o
[ 36%] Building CXX object contrib/epee/src/CMakeFiles/epee.dir/mlog.cpp.o
[ 37%] Building CXX object contrib/epee/src/CMakeFiles/epee.dir/net_utils_base.cpp.o
[ 37%] Building CXX object contrib/epee/src/CMakeFiles/epee.dir/string_tools.cpp.o
[ 37%] Building CXX object contrib/epee/src/CMakeFiles/epee.dir/wipeable_string.cpp.o
[ 37%] Building C object contrib/epee/src/CMakeFiles/epee.dir/memwipe.c.o
[ 38%] Building CXX object contrib/epee/src/CMakeFiles/epee.dir/connection_basic.cpp.o
[ 38%] Building CXX object contrib/epee/src/CMakeFiles/epee.dir/network_throttle.cpp.o
[ 38%] Building CXX object contrib/epee/src/CMakeFiles/epee.dir/network_throttle-detail.cpp.o
[ 39%] Building CXX object contrib/epee/src/CMakeFiles/epee.dir/mlocker.cpp.o
[ 39%] Building CXX object contrib/epee/src/CMakeFiles/epee.dir/buffer.cpp.o
[ 39%] Building CXX object contrib/epee/src/CMakeFiles/epee.dir/net_ssl.cpp.o
[ 40%] Linking CXX static library libepee.a
make[3]: Leaving directory '/home/vagrant/slave/monero-static-ubuntu-i686/build/build/release'
[ 40%] Built target epee
make[3]: Entering directory '/home/vagrant/slave/monero-static-ubuntu-i686/build/build/release'
Scanning dependencies of target epee_readline
make[3]: Leaving directory '/home/vagrant/slave/monero-static-ubuntu-i686/build/build/release'
make[3]: Entering directory '/home/vagrant/slave/monero-static-ubuntu-i686/build/build/release'
[ 40%] Building CXX object contrib/epee/src/CMakeFiles/epee_readline.dir/readline_buffer.cpp.o
[ 40%] Linking CXX static library libepee_readline.a
make[3]: Leaving directory '/home/vagrant/slave/monero-static-ubuntu-i686/build/build/release'
[ 40%] Built target epee_readline
make[3]: Entering directory '/home/vagrant/slave/monero-static-ubuntu-i686/build/build/release'
Scanning dependencies of target genversion
make[3]: Leaving directory '/home/vagrant/slave/monero-static-ubuntu-i686/build/build/release'
make[3]: Entering directory '/home/vagrant/slave/monero-static-ubuntu-i686/build/build/release'
[ 40%] Generating ../version.cpp
-- You are currently on commit 023f2c7
-- The most recent tag was at 6cadbdc
-- You are ahead of or behind a tagged release
make[3]: Leaving directory '/home/vagrant/slave/monero-static-ubuntu-i686/build/build/release'
[ 40%] Built target genversion
make[3]: Entering directory '/home/vagrant/slave/monero-static-ubuntu-i686/build/build/release'
Scanning dependencies of target obj_version
make[3]: Leaving directory '/home/vagrant/slave/monero-static-ubuntu-i686/build/build/release'
make[3]: Entering directory '/home/vagrant/slave/monero-static-ubuntu-i686/build/build/release'
[ 41%] Building CXX object src/CMakeFiles/obj_version.dir/__/version.cpp.o
make[3]: Leaving directory '/home/vagrant/slave/monero-static-ubuntu-i686/build/build/release'
[ 41%] Built target obj_version
make[3]: Entering directory '/home/vagrant/slave/monero-static-ubuntu-i686/build/build/release'
Scanning dependencies of target version
make[3]: Leaving directory '/home/vagrant/slave/monero-static-ubuntu-i686/build/build/release'
make[3]: Entering directory '/home/vagrant/slave/monero-static-ubuntu-i686/build/build/release'
[ 41%] Linking CXX static library libversion.a
make[3]: Leaving directory '/home/vagrant/slave/monero-static-ubuntu-i686/build/build/release'
[ 41%] Built target version
make[3]: Entering directory '/home/vagrant/slave/monero-static-ubuntu-i686/build/build/release'
Scanning dependencies of target obj_common
make[3]: Leaving directory '/home/vagrant/slave/monero-static-ubuntu-i686/build/build/release'
make[3]: Entering directory '/home/vagrant/slave/monero-static-ubuntu-i686/build/build/release'
[ 42%] Building CXX object src/common/CMakeFiles/obj_common.dir/base58.cpp.o
[ 42%] Building CXX object src/common/CMakeFiles/obj_common.dir/command_line.cpp.o
[ 42%] Building CXX object src/common/CMakeFiles/obj_common.dir/dns_utils.cpp.o
[ 43%] Building CXX object src/common/CMakeFiles/obj_common.dir/download.cpp.o
[ 43%] Building CXX object src/common/CMakeFiles/obj_common.dir/error.cpp.o
[ 43%] Building CXX object src/common/CMakeFiles/obj_common.dir/expect.cpp.o
[ 44%] Building CXX object src/common/CMakeFiles/obj_common.dir/util.cpp.o
[ 44%] Building CXX object src/common/CMakeFiles/obj_common.dir/i18n.cpp.o
[ 44%] Building CXX object src/common/CMakeFiles/obj_common.dir/notify.cpp.o
[ 45%] Building CXX object src/common/CMakeFiles/obj_common.dir/password.cpp.o
[ 45%] Building CXX object src/common/CMakeFiles/obj_common.dir/perf_timer.cpp.o
[ 45%] Building CXX object src/common/CMakeFiles/obj_common.dir/pruning.cpp.o
[ 46%] Building CXX object src/common/CMakeFiles/obj_common.dir/spawn.cpp.o
[ 46%] Building CXX object src/common/CMakeFiles/obj_common.dir/threadpool.cpp.o
[ 46%] Building CXX object src/common/CMakeFiles/obj_common.dir/updates.cpp.o
[ 47%] Building C object src/common/CMakeFiles/obj_common.dir/aligned.c.o
[ 47%] Building CXX object src/common/CMakeFiles/obj_common.dir/timings.cc.o
[ 47%] Building CXX object src/common/CMakeFiles/obj_common.dir/combinator.cpp.o
[ 47%] Building CXX object src/common/CMakeFiles/obj_common.dir/stack_trace.cpp.o
make[3]: Leaving directory '/home/vagrant/slave/monero-static-ubuntu-i686/build/build/release'
[ 47%] Built target obj_common
make[3]: Entering directory '/home/vagrant/slave/monero-static-ubuntu-i686/build/build/release'
Scanning dependencies of target obj_cncrypto
make[3]: Leaving directory '/home/vagrant/slave/monero-static-ubuntu-i686/build/build/release'
make[3]: Entering directory '/home/vagrant/slave/monero-static-ubuntu-i686/build/build/release'
[ 47%] Building C object src/crypto/CMakeFiles/obj_cncrypto.dir/aesb.c.o
[ 47%] Building C object src/crypto/CMakeFiles/obj_cncrypto.dir/blake256.c.o
[ 48%] Building C object src/crypto/CMakeFiles/obj_cncrypto.dir/chacha.c.o
[ 48%] Building C object src/crypto/CMakeFiles/obj_cncrypto.dir/crypto-ops-data.c.o
[ 48%] Building C object src/crypto/CMakeFiles/obj_cncrypto.dir/crypto-ops.c.o
[ 50%] Building CXX object src/crypto/CMakeFiles/obj_cncrypto.dir/crypto.cpp.o
[ 50%] Building C object src/crypto/CMakeFiles/obj_cncrypto.dir/groestl.c.o
[ 50%] Building C object src/crypto/CMakeFiles/obj_cncrypto.dir/hash-extra-blake.c.o
[ 51%] Building C object src/crypto/CMakeFiles/obj_cncrypto.dir/hash-extra-groestl.c.o
[ 51%] Building C object src/crypto/CMakeFiles/obj_cncrypto.dir/hash-extra-jh.c.o
[ 51%] Building C object src/crypto/CMakeFiles/obj_cncrypto.dir/hash-extra-skein.c.o
[ 51%] Building C object src/crypto/CMakeFiles/obj_cncrypto.dir/hash.c.o
[ 52%] Building C object src/crypto/CMakeFiles/obj_cncrypto.dir/hmac-keccak.c.o
[ 52%] Building C object src/crypto/CMakeFiles/obj_cncrypto.dir/jh.c.o
[ 52%] Building C object src/crypto/CMakeFiles/obj_cncrypto.dir/keccak.c.o
[ 53%] Building C object src/crypto/CMakeFiles/obj_cncrypto.dir/oaes_lib.c.o
[ 53%] Building C object src/crypto/CMakeFiles/obj_cncrypto.dir/random.c.o
[ 53%] Building C object src/crypto/CMakeFiles/obj_cncrypto.dir/skein.c.o
[ 54%] Building C object src/crypto/CMakeFiles/obj_cncrypto.dir/slow-hash.c.o
[ 54%] Building C object src/crypto/CMakeFiles/obj_cncrypto.dir/CryptonightR_JIT.c.o
[ 54%] Building C object src/crypto/CMakeFiles/obj_cncrypto.dir/tree-hash.c.o
/home/vagrant/slave/monero-static-ubuntu-i686/build/src/crypto/tree-hash.c: In function 'tree_hash':
/home/vagrant/slave/monero-static-ubuntu-i686/build/src/crypto/tree-hash.c:85:5: warning: ISO C90 forbids variable length array 'ints' [-Wvla]
     char ints[cnt][HASH_SIZE];
     ^
make[3]: Leaving directory '/home/vagrant/slave/monero-static-ubuntu-i686/build/build/release'
[ 54%] Built target obj_cncrypto
make[3]: Entering directory '/home/vagrant/slave/monero-static-ubuntu-i686/build/build/release'
Scanning dependencies of target cncrypto
make[3]: Leaving directory '/home/vagrant/slave/monero-static-ubuntu-i686/build/build/release'
make[3]: Entering directory '/home/vagrant/slave/monero-static-ubuntu-i686/build/build/release'
[ 54%] Linking CXX static library libcncrypto.a
make[3]: Leaving directory '/home/vagrant/slave/monero-static-ubuntu-i686/build/build/release'
[ 54%] Built target cncrypto
make[3]: Entering directory '/home/vagrant/slave/monero-static-ubuntu-i686/build/build/release'
Scanning dependencies of target common
make[3]: Leaving directory '/home/vagrant/slave/monero-static-ubuntu-i686/build/build/release'
make[3]: Entering directory '/home/vagrant/slave/monero-static-ubuntu-i686/build/build/release'
[ 54%] Linking CXX static library libcommon.a
make[3]: Leaving directory '/home/vagrant/slave/monero-static-ubuntu-i686/build/build/release'
[ 54%] Built target common
make[3]: Entering directory '/home/vagrant/slave/monero-static-ubuntu-i686/build/build/release'
Scanning dependencies of target obj_ringct
make[3]: Leaving directory '/home/vagrant/slave/monero-static-ubuntu-i686/build/build/release'
make[3]: Entering directory '/home/vagrant/slave/monero-static-ubuntu-i686/build/build/release'
[ 54%] Building CXX object src/ringct/CMakeFiles/obj_ringct.dir/rctSigs.cpp.o
make[3]: Leaving directory '/home/vagrant/slave/monero-static-ubuntu-i686/build/build/release'
[ 54%] Built target obj_ringct
make[3]: Entering directory '/home/vagrant/slave/monero-static-ubuntu-i686/build/build/release'
Scanning dependencies of target obj_ringct_basic
make[3]: Leaving directory '/home/vagrant/slave/monero-static-ubuntu-i686/build/build/release'
make[3]: Entering directory '/home/vagrant/slave/monero-static-ubuntu-i686/build/build/release'
[ 54%] Building CXX object src/ringct/CMakeFiles/obj_ringct_basic.dir/rctOps.cpp.o
[ 55%] Building CXX object src/ringct/CMakeFiles/obj_ringct_basic.dir/rctTypes.cpp.o
[ 55%] Building C object src/ringct/CMakeFiles/obj_ringct_basic.dir/rctCryptoOps.c.o
[ 55%] Building CXX object src/ringct/CMakeFiles/obj_ringct_basic.dir/multiexp.cc.o
[ 56%] Building CXX object src/ringct/CMakeFiles/obj_ringct_basic.dir/bulletproofs.cc.o
make[3]: Leaving directory '/home/vagrant/slave/monero-static-ubuntu-i686/build/build/release'
[ 56%] Built target obj_ringct_basic
make[3]: Entering directory '/home/vagrant/slave/monero-static-ubuntu-i686/build/build/release'
Scanning dependencies of target ringct_basic
make[3]: Leaving directory '/home/vagrant/slave/monero-static-ubuntu-i686/build/build/release'
make[3]: Entering directory '/home/vagrant/slave/monero-static-ubuntu-i686/build/build/release'
[ 56%] Linking CXX static library libringct_basic.a
make[3]: Leaving directory '/home/vagrant/slave/monero-static-ubuntu-i686/build/build/release'
[ 56%] Built target ringct_basic
make[3]: Entering directory '/home/vagrant/slave/monero-static-ubuntu-i686/build/build/release'
Scanning dependencies of target obj_device
make[3]: Leaving directory '/home/vagrant/slave/monero-static-ubuntu-i686/build/build/release'
make[3]: Entering directory '/home/vagrant/slave/monero-static-ubuntu-i686/build/build/release'
[ 56%] Building CXX object src/device/CMakeFiles/obj_device.dir/device.cpp.o
[ 57%] Building CXX object src/device/CMakeFiles/obj_device.dir/device_default.cpp.o
[ 57%] Building CXX object src/device/CMakeFiles/obj_device.dir/log.cpp.o
[ 57%] Building CXX object src/device/CMakeFiles/obj_device.dir/device_ledger.cpp.o
[ 58%] Building CXX object src/device/CMakeFiles/obj_device.dir/device_io_hid.cpp.o
make[3]: Leaving directory '/home/vagrant/slave/monero-static-ubuntu-i686/build/build/release'
[ 58%] Built target obj_device
make[3]: Entering directory '/home/vagrant/slave/monero-static-ubuntu-i686/build/build/release'
Scanning dependencies of target device
make[3]: Leaving directory '/home/vagrant/slave/monero-static-ubuntu-i686/build/build/release'
make[3]: Entering directory '/home/vagrant/slave/monero-static-ubuntu-i686/build/build/release'
[ 58%] Linking CXX static library libdevice.a
make[3]: Leaving directory '/home/vagrant/slave/monero-static-ubuntu-i686/build/build/release'
[ 58%] Built target device
make[3]: Entering directory '/home/vagrant/slave/monero-static-ubuntu-i686/build/build/release'
Scanning dependencies of target obj_checkpoints
make[3]: Leaving directory '/home/vagrant/slave/monero-static-ubuntu-i686/build/build/release'
make[3]: Entering directory '/home/vagrant/slave/monero-static-ubuntu-i686/build/build/release'
[ 59%] Building CXX object src/checkpoints/CMakeFiles/obj_checkpoints.dir/checkpoints.cpp.o
make[3]: Leaving directory '/home/vagrant/slave/monero-static-ubuntu-i686/build/build/release'
[ 59%] Built target obj_checkpoints
make[3]: Entering directory '/home/vagrant/slave/monero-static-ubuntu-i686/build/build/release'
Scanning dependencies of target checkpoints
make[3]: Leaving directory '/home/vagrant/slave/monero-static-ubuntu-i686/build/build/release'
make[3]: Entering directory '/home/vagrant/slave/monero-static-ubuntu-i686/build/build/release'
[ 60%] Linking CXX static library libcheckpoints.a
make[3]: Leaving directory '/home/vagrant/slave/monero-static-ubuntu-i686/build/build/release'
[ 60%] Built target checkpoints
make[3]: Entering directory '/home/vagrant/slave/monero-static-ubuntu-i686/build/build/release'
Scanning dependencies of target obj_cryptonote_basic
make[3]: Leaving directory '/home/vagrant/slave/monero-static-ubuntu-i686/build/build/release'
make[3]: Entering directory '/home/vagrant/slave/monero-static-ubuntu-i686/build/build/release'
[ 61%] Building CXX object src/cryptonote_basic/CMakeFiles/obj_cryptonote_basic.dir/account.cpp.o
[ 61%] Building CXX object src/cryptonote_basic/CMakeFiles/obj_cryptonote_basic.dir/cryptonote_basic_impl.cpp.o
[ 61%] Building CXX object src/cryptonote_basic/CMakeFiles/obj_cryptonote_basic.dir/cryptonote_format_utils.cpp.o
[ 62%] Building CXX object src/cryptonote_basic/CMakeFiles/obj_cryptonote_basic.dir/difficulty.cpp.o
[ 62%] Building CXX object src/cryptonote_basic/CMakeFiles/obj_cryptonote_basic.dir/hardfork.cpp.o
[ 62%] Building CXX object src/cryptonote_basic/CMakeFiles/obj_cryptonote_basic.dir/miner.cpp.o
make[3]: Leaving directory '/home/vagrant/slave/monero-static-ubuntu-i686/build/build/release'
[ 62%] Built target obj_cryptonote_basic
make[3]: Entering directory '/home/vagrant/slave/monero-static-ubuntu-i686/build/build/release'
Scanning dependencies of target cryptonote_basic
make[3]: Leaving directory '/home/vagrant/slave/monero-static-ubuntu-i686/build/build/release'
make[3]: Entering directory '/home/vagrant/slave/monero-static-ubuntu-i686/build/build/release'
[ 63%] Linking CXX static library libcryptonote_basic.a
make[3]: Leaving directory '/home/vagrant/slave/monero-static-ubuntu-i686/build/build/release'
[ 63%] Built target cryptonote_basic
make[3]: Entering directory '/home/vagrant/slave/monero-static-ubuntu-i686/build/build/release'
Scanning dependencies of target ringct
make[3]: Leaving directory '/home/vagrant/slave/monero-static-ubuntu-i686/build/build/release'
make[3]: Entering directory '/home/vagrant/slave/monero-static-ubuntu-i686/build/build/release'
[ 64%] Linking CXX static library libringct.a
make[3]: Leaving directory '/home/vagrant/slave/monero-static-ubuntu-i686/build/build/release'
[ 64%] Built target ringct
make[3]: Entering directory '/home/vagrant/slave/monero-static-ubuntu-i686/build/build/release'
Scanning dependencies of target obj_cryptonote_core
make[3]: Leaving directory '/home/vagrant/slave/monero-static-ubuntu-i686/build/build/release'
make[3]: Entering directory '/home/vagrant/slave/monero-static-ubuntu-i686/build/build/release'
[ 65%] Building CXX object src/cryptonote_core/CMakeFiles/obj_cryptonote_core.dir/blockchain.cpp.o
[ 65%] Building CXX object src/cryptonote_core/CMakeFiles/obj_cryptonote_core.dir/cryptonote_core.cpp.o
[ 65%] Building CXX object src/cryptonote_core/CMakeFiles/obj_cryptonote_core.dir/tx_pool.cpp.o
[ 66%] Building CXX object src/cryptonote_core/CMakeFiles/obj_cryptonote_core.dir/cryptonote_tx_utils.cpp.o
make[3]: Leaving directory '/home/vagrant/slave/monero-static-ubuntu-i686/build/build/release'
[ 66%] Built target obj_cryptonote_core
make[3]: Entering directory '/home/vagrant/slave/monero-static-ubuntu-i686/build/build/release'
Scanning dependencies of target obj_multisig
make[3]: Leaving directory '/home/vagrant/slave/monero-static-ubuntu-i686/build/build/release'
make[3]: Entering directory '/home/vagrant/slave/monero-static-ubuntu-i686/build/build/release'
[ 66%] Building CXX object src/multisig/CMakeFiles/obj_multisig.dir/multisig.cpp.o
make[3]: Leaving directory '/home/vagrant/slave/monero-static-ubuntu-i686/build/build/release'
[ 66%] Built target obj_multisig
make[3]: Entering directory '/home/vagrant/slave/monero-static-ubuntu-i686/build/build/release'
Scanning dependencies of target multisig
make[3]: Leaving directory '/home/vagrant/slave/monero-static-ubuntu-i686/build/build/release'
make[3]: Entering directory '/home/vagrant/slave/monero-static-ubuntu-i686/build/build/release'
[ 66%] Linking CXX static library libmultisig.a
make[3]: Leaving directory '/home/vagrant/slave/monero-static-ubuntu-i686/build/build/release'
[ 66%] Built target multisig
make[3]: Entering directory '/home/vagrant/slave/monero-static-ubuntu-i686/build/build/release'
Scanning dependencies of target obj_blockchain_db
make[3]: Leaving directory '/home/vagrant/slave/monero-static-ubuntu-i686/build/build/release'
make[3]: Entering directory '/home/vagrant/slave/monero-static-ubuntu-i686/build/build/release'
[ 66%] Building CXX object src/blockchain_db/CMakeFiles/obj_blockchain_db.dir/blockchain_db.cpp.o
[ 66%] Building CXX object src/blockchain_db/CMakeFiles/obj_blockchain_db.dir/lmdb/db_lmdb.cpp.o
make[3]: Leaving directory '/home/vagrant/slave/monero-static-ubuntu-i686/build/build/release'
[ 66%] Built target obj_blockchain_db
make[3]: Entering directory '/home/vagrant/slave/monero-static-ubuntu-i686/build/build/release'
Scanning dependencies of target blockchain_db
make[3]: Leaving directory '/home/vagrant/slave/monero-static-ubuntu-i686/build/build/release'
make[3]: Entering directory '/home/vagrant/slave/monero-static-ubuntu-i686/build/build/release'
[ 66%] Linking CXX static library libblockchain_db.a
make[3]: Leaving directory '/home/vagrant/slave/monero-static-ubuntu-i686/build/build/release'
[ 66%] Built target blockchain_db
make[3]: Entering directory '/home/vagrant/slave/monero-static-ubuntu-i686/build/build/release'
Scanning dependencies of target cryptonote_core
make[3]: Leaving directory '/home/vagrant/slave/monero-static-ubuntu-i686/build/build/release'
make[3]: Entering directory '/home/vagrant/slave/monero-static-ubuntu-i686/build/build/release'
[ 66%] Linking CXX static library libcryptonote_core.a
make[3]: Leaving directory '/home/vagrant/slave/monero-static-ubuntu-i686/build/build/release'
[ 66%] Built target cryptonote_core
make[3]: Entering directory '/home/vagrant/slave/monero-static-ubuntu-i686/build/build/release'
Scanning dependencies of target obj_lmdb_lib
make[3]: Leaving directory '/home/vagrant/slave/monero-static-ubuntu-i686/build/build/release'
make[3]: Entering directory '/home/vagrant/slave/monero-static-ubuntu-i686/build/build/release'
[ 67%] Building CXX object src/lmdb/CMakeFiles/obj_lmdb_lib.dir/database.cpp.o
/home/vagrant/slave/monero-static-ubuntu-i686/build/src/lmdb/database.cpp: In member function 'expect<void> lmdb::database::resize()':
/home/vagrant/slave/monero-static-ubuntu-i686/build/src/lmdb/database.cpp:139:72: error: no matching function for call to 'min(mdb_size_t&, const size_t&)'
         const std::size_t resize = std::min(info.me_mapsize, max_resize);
                                                                        ^
In file included from /usr/include/c++/5/memory:62:0,
                 from /home/vagrant/slave/monero-static-ubuntu-i686/build/src/lmdb/database.h:32,
                 from /home/vagrant/slave/monero-static-ubuntu-i686/build/src/lmdb/database.cpp:27:
/usr/include/c++/5/bits/stl_algobase.h:195:5: note: candidate: template<class _Tp> const _Tp& std::min(const _Tp&, const _Tp&)
     min(const _Tp& __a, const _Tp& __b)
     ^
/usr/include/c++/5/bits/stl_algobase.h:195:5: note:   template argument deduction/substitution failed:
/home/vagrant/slave/monero-static-ubuntu-i686/build/src/lmdb/database.cpp:139:72: note:   deduced conflicting types for parameter 'const _Tp' ('long long unsigned int' and 'std::size_t {aka unsigned int}')
         const std::size_t resize = std::min(info.me_mapsize, max_resize);
                                                                        ^
In file included from /usr/include/c++/5/memory:62:0,
                 from /home/vagrant/slave/monero-static-ubuntu-i686/build/src/lmdb/database.h:32,
                 from /home/vagrant/slave/monero-static-ubuntu-i686/build/src/lmdb/database.cpp:27:
/usr/include/c++/5/bits/stl_algobase.h:243:5: note: candidate: template<class _Tp, class _Compare> const _Tp& std::min(const _Tp&, const _Tp&, _Compare)
     min(const _Tp& __a, const _Tp& __b, _Compare __comp)
     ^
/usr/include/c++/5/bits/stl_algobase.h:243:5: note:   template argument deduction/substitution failed:
/home/vagrant/slave/monero-static-ubuntu-i686/build/src/lmdb/database.cpp:139:72: note:   deduced conflicting types for parameter 'const _Tp' ('long long unsigned int' and 'std::size_t {aka unsigned int}')
         const std::size_t resize = std::min(info.me_mapsize, max_resize);
                                                                        ^
In file included from /usr/include/c++/5/algorithm:62:0,
                 from /home/vagrant/slave/monero-static-ubuntu-i686/build/contrib/epee/include/span.h:31,
                 from /home/vagrant/slave/monero-static-ubuntu-i686/build/src/lmdb/util.h:35,
                 from /home/vagrant/slave/monero-static-ubuntu-i686/build/src/lmdb/database.cpp:29:
/usr/include/c++/5/bits/stl_algo.h:3445:5: note: candidate: template<class _Tp> _Tp std::min(std::initializer_list<_Tp>)
     min(initializer_list<_Tp> __l)
     ^
/usr/include/c++/5/bits/stl_algo.h:3445:5: note:   template argument deduction/substitution failed:
/home/vagrant/slave/monero-static-ubuntu-i686/build/src/lmdb/database.cpp:139:72: note:   mismatched types 'std::initializer_list<_Tp>' and 'long long unsigned int'
         const std::size_t resize = std::min(info.me_mapsize, max_resize);
                                                                        ^
In file included from /usr/include/c++/5/algorithm:62:0,
                 from /home/vagrant/slave/monero-static-ubuntu-i686/build/contrib/epee/include/span.h:31,
                 from /home/vagrant/slave/monero-static-ubuntu-i686/build/src/lmdb/util.h:35,
                 from /home/vagrant/slave/monero-static-ubuntu-i686/build/src/lmdb/database.cpp:29:
/usr/include/c++/5/bits/stl_algo.h:3451:5: note: candidate: template<class _Tp, class _Compare> _Tp std::min(std::initializer_list<_Tp>, _Compare)
     min(initializer_list<_Tp> __l, _Compare __comp)
     ^
/usr/include/c++/5/bits/stl_algo.h:3451:5: note:   template argument deduction/substitution failed:
/home/vagrant/slave/monero-static-ubuntu-i686/build/src/lmdb/database.cpp:139:72: note:   mismatched types 'std::initializer_list<_Tp>' and 'long long unsigned int'
         const std::size_t resize = std::min(info.me_mapsize, max_resize);
                                                                        ^
/home/vagrant/slave/monero-static-ubuntu-i686/build/src/lmdb/database.cpp:143:37: error: could not convert '{<expression error>}' from '<brace-enclosed initializer list>' to 'expect<void>'
             return {lmdb::error(err)};
                                     ^
src/lmdb/CMakeFiles/obj_lmdb_lib.dir/build.make:62: recipe for target 'src/lmdb/CMakeFiles/obj_lmdb_lib.dir/database.cpp.o' failed
make[3]: Leaving directory '/home/vagrant/slave/monero-static-ubuntu-i686/build/build/release'
make[3]: *** [src/lmdb/CMakeFiles/obj_lmdb_lib.dir/database.cpp.o] Error 1
CMakeFiles/Makefile2:1444: recipe for target 'src/lmdb/CMakeFiles/obj_lmdb_lib.dir/all' failed
make[2]: Leaving directory '/home/vagrant/slave/monero-static-ubuntu-i686/build/build/release'
Makefile:138: recipe for target 'all' failed
make[1]: Leaving directory '/home/vagrant/slave/monero-static-ubuntu-i686/build/build/release'
Makefile:146: recipe for target 'release-static-linux-i686' failed
make[2]: *** [src/lmdb/CMakeFiles/obj_lmdb_lib.dir/all] Error 2
make[1]: *** [all] Error 2
make: *** [release-static-linux-i686] Error 2
program finished with exit code 2
elapsedTime=285.330535