(view as text)
Determining if the pthread_create exist failed with the following output:
Change Dir: /home/vagrant/slave/monero-static-ubuntu-amd64/build/build/release/CMakeFiles/CMakeTmp

Run Build Command:"/usr/bin/make" "cmTC_5e35d/fast"
make[1]: Entering directory '/home/vagrant/slave/monero-static-ubuntu-amd64/build/build/release/CMakeFiles/CMakeTmp'
/usr/bin/make -f CMakeFiles/cmTC_5e35d.dir/build.make CMakeFiles/cmTC_5e35d.dir/build
make[2]: Entering directory '/home/vagrant/slave/monero-static-ubuntu-amd64/build/build/release/CMakeFiles/CMakeTmp'
Building C object CMakeFiles/cmTC_5e35d.dir/CheckSymbolExists.c.o
/usr/bin/cc     -o CMakeFiles/cmTC_5e35d.dir/CheckSymbolExists.c.o   -c /home/vagrant/slave/monero-static-ubuntu-amd64/build/build/release/CMakeFiles/CMakeTmp/CheckSymbolExists.c
Linking C executable cmTC_5e35d
/usr/bin/cmake -E cmake_link_script CMakeFiles/cmTC_5e35d.dir/link.txt --verbose=1
/usr/bin/cc       CMakeFiles/cmTC_5e35d.dir/CheckSymbolExists.c.o  -o cmTC_5e35d -rdynamic 
CMakeFiles/cmTC_5e35d.dir/CheckSymbolExists.c.o: In function `main':
CheckSymbolExists.c:(.text+0x16): undefined reference to `pthread_create'
collect2: error: ld returned 1 exit status
CMakeFiles/cmTC_5e35d.dir/build.make:97: recipe for target 'cmTC_5e35d' failed
make[2]: *** [cmTC_5e35d] Error 1
make[2]: Leaving directory '/home/vagrant/slave/monero-static-ubuntu-amd64/build/build/release/CMakeFiles/CMakeTmp'
Makefile:126: recipe for target 'cmTC_5e35d/fast' failed
make[1]: *** [cmTC_5e35d/fast] Error 2
make[1]: Leaving directory '/home/vagrant/slave/monero-static-ubuntu-amd64/build/build/release/CMakeFiles/CMakeTmp'

File /home/vagrant/slave/monero-static-ubuntu-amd64/build/build/release/CMakeFiles/CMakeTmp/CheckSymbolExists.c:
/* */
#include <pthread.h>

int main(int argc, char** argv)
{
  (void)argv;
#ifndef pthread_create
  return ((int*)(&pthread_create))[argc];
#else
  (void)argc;
  return 0;
#endif
}

Determining if the function memset_s exists in the c failed with the following output:
Change Dir: /home/vagrant/slave/monero-static-ubuntu-amd64/build/build/release/CMakeFiles/CMakeTmp

Run Build Command:"/usr/bin/make" "cmTC_73c7f/fast"
make[1]: Entering directory '/home/vagrant/slave/monero-static-ubuntu-amd64/build/build/release/CMakeFiles/CMakeTmp'
/usr/bin/make -f CMakeFiles/cmTC_73c7f.dir/build.make CMakeFiles/cmTC_73c7f.dir/build
make[2]: Entering directory '/home/vagrant/slave/monero-static-ubuntu-amd64/build/build/release/CMakeFiles/CMakeTmp'
Building C object CMakeFiles/cmTC_73c7f.dir/CheckFunctionExists.c.o
/usr/bin/cc    -pthread -DCHECK_FUNCTION_EXISTS=memset_s   -o CMakeFiles/cmTC_73c7f.dir/CheckFunctionExists.c.o   -c /usr/share/cmake-3.5/Modules/CheckFunctionExists.c
Linking C executable cmTC_73c7f
/usr/bin/cmake -E cmake_link_script CMakeFiles/cmTC_73c7f.dir/link.txt --verbose=1
/usr/bin/cc   -pthread -DCHECK_FUNCTION_EXISTS=memset_s    CMakeFiles/cmTC_73c7f.dir/CheckFunctionExists.c.o  -o cmTC_73c7f  -L/home/vagrant/slave/monero-static-ubuntu-amd64/build/build/release/CMakeFiles/CMakeTmp/string.h -rdynamic -lc -Wl,-rpath,/home/vagrant/slave/monero-static-ubuntu-amd64/build/build/release/CMakeFiles/CMakeTmp/string.h 
CMakeFiles/cmTC_73c7f.dir/CheckFunctionExists.c.o: In function `main':
CheckFunctionExists.c:(.text+0x15): undefined reference to `memset_s'
collect2: error: ld returned 1 exit status
CMakeFiles/cmTC_73c7f.dir/build.make:97: recipe for target 'cmTC_73c7f' failed
make[2]: *** [cmTC_73c7f] Error 1
make[2]: Leaving directory '/home/vagrant/slave/monero-static-ubuntu-amd64/build/build/release/CMakeFiles/CMakeTmp'
Makefile:126: recipe for target 'cmTC_73c7f/fast' failed
make[1]: *** [cmTC_73c7f/fast] Error 2
make[1]: Leaving directory '/home/vagrant/slave/monero-static-ubuntu-amd64/build/build/release/CMakeFiles/CMakeTmp'


Determining if the function explicit_bzero exists in the c failed with the following output:
Change Dir: /home/vagrant/slave/monero-static-ubuntu-amd64/build/build/release/CMakeFiles/CMakeTmp

Run Build Command:"/usr/bin/make" "cmTC_8ea67/fast"
make[1]: Entering directory '/home/vagrant/slave/monero-static-ubuntu-amd64/build/build/release/CMakeFiles/CMakeTmp'
/usr/bin/make -f CMakeFiles/cmTC_8ea67.dir/build.make CMakeFiles/cmTC_8ea67.dir/build
make[2]: Entering directory '/home/vagrant/slave/monero-static-ubuntu-amd64/build/build/release/CMakeFiles/CMakeTmp'
Building C object CMakeFiles/cmTC_8ea67.dir/CheckFunctionExists.c.o
/usr/bin/cc    -pthread -DCHECK_FUNCTION_EXISTS=explicit_bzero   -o CMakeFiles/cmTC_8ea67.dir/CheckFunctionExists.c.o   -c /usr/share/cmake-3.5/Modules/CheckFunctionExists.c
Linking C executable cmTC_8ea67
/usr/bin/cmake -E cmake_link_script CMakeFiles/cmTC_8ea67.dir/link.txt --verbose=1
/usr/bin/cc   -pthread -DCHECK_FUNCTION_EXISTS=explicit_bzero    CMakeFiles/cmTC_8ea67.dir/CheckFunctionExists.c.o  -o cmTC_8ea67  -L/home/vagrant/slave/monero-static-ubuntu-amd64/build/build/release/CMakeFiles/CMakeTmp/strings.h -rdynamic -lc -Wl,-rpath,/home/vagrant/slave/monero-static-ubuntu-amd64/build/build/release/CMakeFiles/CMakeTmp/strings.h 
CMakeFiles/cmTC_8ea67.dir/CheckFunctionExists.c.o: In function `main':
CheckFunctionExists.c:(.text+0x15): undefined reference to `explicit_bzero'
collect2: error: ld returned 1 exit status
CMakeFiles/cmTC_8ea67.dir/build.make:97: recipe for target 'cmTC_8ea67' failed
make[2]: *** [cmTC_8ea67] Error 1
make[2]: Leaving directory '/home/vagrant/slave/monero-static-ubuntu-amd64/build/build/release/CMakeFiles/CMakeTmp'
Makefile:126: recipe for target 'cmTC_8ea67/fast' failed
make[1]: *** [cmTC_8ea67/fast] Error 2
make[1]: Leaving directory '/home/vagrant/slave/monero-static-ubuntu-amd64/build/build/release/CMakeFiles/CMakeTmp'


Determining if the include file iphlpapi.h exists failed with the following output:
Change Dir: /home/vagrant/slave/monero-static-ubuntu-amd64/build/build/release/CMakeFiles/CMakeTmp

Run Build Command:"/usr/bin/make" "cmTC_fa3a1/fast"
make[1]: Entering directory '/home/vagrant/slave/monero-static-ubuntu-amd64/build/build/release/CMakeFiles/CMakeTmp'
/usr/bin/make -f CMakeFiles/cmTC_fa3a1.dir/build.make CMakeFiles/cmTC_fa3a1.dir/build
make[2]: Entering directory '/home/vagrant/slave/monero-static-ubuntu-amd64/build/build/release/CMakeFiles/CMakeTmp'
Building C object CMakeFiles/cmTC_fa3a1.dir/CheckIncludeFile.c.o
/usr/bin/cc    -pthread    -o CMakeFiles/cmTC_fa3a1.dir/CheckIncludeFile.c.o   -c /home/vagrant/slave/monero-static-ubuntu-amd64/build/build/release/CMakeFiles/CMakeTmp/CheckIncludeFile.c
/home/vagrant/slave/monero-static-ubuntu-amd64/build/build/release/CMakeFiles/CMakeTmp/CheckIncludeFile.c:1:22: fatal error: iphlpapi.h: No such file or directory
compilation terminated.
CMakeFiles/cmTC_fa3a1.dir/build.make:65: recipe for target 'CMakeFiles/cmTC_fa3a1.dir/CheckIncludeFile.c.o' failed
make[2]: *** [CMakeFiles/cmTC_fa3a1.dir/CheckIncludeFile.c.o] Error 1
make[2]: Leaving directory '/home/vagrant/slave/monero-static-ubuntu-amd64/build/build/release/CMakeFiles/CMakeTmp'
Makefile:126: recipe for target 'cmTC_fa3a1/fast' failed
make[1]: *** [cmTC_fa3a1/fast] Error 2
make[1]: Leaving directory '/home/vagrant/slave/monero-static-ubuntu-amd64/build/build/release/CMakeFiles/CMakeTmp'


Determining if the include file login_cap.h exists failed with the following output:
Change Dir: /home/vagrant/slave/monero-static-ubuntu-amd64/build/build/release/CMakeFiles/CMakeTmp

Run Build Command:"/usr/bin/make" "cmTC_f02a5/fast"
make[1]: Entering directory '/home/vagrant/slave/monero-static-ubuntu-amd64/build/build/release/CMakeFiles/CMakeTmp'
/usr/bin/make -f CMakeFiles/cmTC_f02a5.dir/build.make CMakeFiles/cmTC_f02a5.dir/build
make[2]: Entering directory '/home/vagrant/slave/monero-static-ubuntu-amd64/build/build/release/CMakeFiles/CMakeTmp'
Building C object CMakeFiles/cmTC_f02a5.dir/CheckIncludeFile.c.o
/usr/bin/cc    -pthread    -o CMakeFiles/cmTC_f02a5.dir/CheckIncludeFile.c.o   -c /home/vagrant/slave/monero-static-ubuntu-amd64/build/build/release/CMakeFiles/CMakeTmp/CheckIncludeFile.c
/home/vagrant/slave/monero-static-ubuntu-amd64/build/build/release/CMakeFiles/CMakeTmp/CheckIncludeFile.c:1:23: fatal error: login_cap.h: No such file or directory
compilation terminated.
CMakeFiles/cmTC_f02a5.dir/build.make:65: recipe for target 'CMakeFiles/cmTC_f02a5.dir/CheckIncludeFile.c.o' failed
make[2]: *** [CMakeFiles/cmTC_f02a5.dir/CheckIncludeFile.c.o] Error 1
make[2]: Leaving directory '/home/vagrant/slave/monero-static-ubuntu-amd64/build/build/release/CMakeFiles/CMakeTmp'
Makefile:126: recipe for target 'cmTC_f02a5/fast' failed
make[1]: *** [cmTC_f02a5/fast] Error 2
make[1]: Leaving directory '/home/vagrant/slave/monero-static-ubuntu-amd64/build/build/release/CMakeFiles/CMakeTmp'


Determining if the include file sys/sha2.h exists failed with the following output:
Change Dir: /home/vagrant/slave/monero-static-ubuntu-amd64/build/build/release/CMakeFiles/CMakeTmp

Run Build Command:"/usr/bin/make" "cmTC_09b4e/fast"
make[1]: Entering directory '/home/vagrant/slave/monero-static-ubuntu-amd64/build/build/release/CMakeFiles/CMakeTmp'
/usr/bin/make -f CMakeFiles/cmTC_09b4e.dir/build.make CMakeFiles/cmTC_09b4e.dir/build
make[2]: Entering directory '/home/vagrant/slave/monero-static-ubuntu-amd64/build/build/release/CMakeFiles/CMakeTmp'
Building C object CMakeFiles/cmTC_09b4e.dir/CheckIncludeFile.c.o
/usr/bin/cc    -pthread    -o CMakeFiles/cmTC_09b4e.dir/CheckIncludeFile.c.o   -c /home/vagrant/slave/monero-static-ubuntu-amd64/build/build/release/CMakeFiles/CMakeTmp/CheckIncludeFile.c
/home/vagrant/slave/monero-static-ubuntu-amd64/build/build/release/CMakeFiles/CMakeTmp/CheckIncludeFile.c:1:22: fatal error: sys/sha2.h: No such file or directory
compilation terminated.
CMakeFiles/cmTC_09b4e.dir/build.make:65: recipe for target 'CMakeFiles/cmTC_09b4e.dir/CheckIncludeFile.c.o' failed
make[2]: *** [CMakeFiles/cmTC_09b4e.dir/CheckIncludeFile.c.o] Error 1
make[2]: Leaving directory '/home/vagrant/slave/monero-static-ubuntu-amd64/build/build/release/CMakeFiles/CMakeTmp'
Makefile:126: recipe for target 'cmTC_09b4e/fast' failed
make[1]: *** [cmTC_09b4e/fast] Error 2
make[1]: Leaving directory '/home/vagrant/slave/monero-static-ubuntu-amd64/build/build/release/CMakeFiles/CMakeTmp'


Determining if the include file vfork.h exists failed with the following output:
Change Dir: /home/vagrant/slave/monero-static-ubuntu-amd64/build/build/release/CMakeFiles/CMakeTmp

Run Build Command:"/usr/bin/make" "cmTC_bed3f/fast"
make[1]: Entering directory '/home/vagrant/slave/monero-static-ubuntu-amd64/build/build/release/CMakeFiles/CMakeTmp'
/usr/bin/make -f CMakeFiles/cmTC_bed3f.dir/build.make CMakeFiles/cmTC_bed3f.dir/build
make[2]: Entering directory '/home/vagrant/slave/monero-static-ubuntu-amd64/build/build/release/CMakeFiles/CMakeTmp'
Building C object CMakeFiles/cmTC_bed3f.dir/CheckIncludeFile.c.o
/usr/bin/cc    -pthread    -o CMakeFiles/cmTC_bed3f.dir/CheckIncludeFile.c.o   -c /home/vagrant/slave/monero-static-ubuntu-amd64/build/build/release/CMakeFiles/CMakeTmp/CheckIncludeFile.c
/home/vagrant/slave/monero-static-ubuntu-amd64/build/build/release/CMakeFiles/CMakeTmp/CheckIncludeFile.c:1:19: fatal error: vfork.h: No such file or directory
compilation terminated.
CMakeFiles/cmTC_bed3f.dir/build.make:65: recipe for target 'CMakeFiles/cmTC_bed3f.dir/CheckIncludeFile.c.o' failed
make[2]: *** [CMakeFiles/cmTC_bed3f.dir/CheckIncludeFile.c.o] Error 1
make[2]: Leaving directory '/home/vagrant/slave/monero-static-ubuntu-amd64/build/build/release/CMakeFiles/CMakeTmp'
Makefile:126: recipe for target 'cmTC_bed3f/fast' failed
make[1]: *** [cmTC_bed3f/fast] Error 2
make[1]: Leaving directory '/home/vagrant/slave/monero-static-ubuntu-amd64/build/build/release/CMakeFiles/CMakeTmp'


Determining if the include file windows.h exists failed with the following output:
Change Dir: /home/vagrant/slave/monero-static-ubuntu-amd64/build/build/release/CMakeFiles/CMakeTmp

Run Build Command:"/usr/bin/make" "cmTC_87a57/fast"
make[1]: Entering directory '/home/vagrant/slave/monero-static-ubuntu-amd64/build/build/release/CMakeFiles/CMakeTmp'
/usr/bin/make -f CMakeFiles/cmTC_87a57.dir/build.make CMakeFiles/cmTC_87a57.dir/build
make[2]: Entering directory '/home/vagrant/slave/monero-static-ubuntu-amd64/build/build/release/CMakeFiles/CMakeTmp'
Building C object CMakeFiles/cmTC_87a57.dir/CheckIncludeFile.c.o
/usr/bin/cc    -pthread    -o CMakeFiles/cmTC_87a57.dir/CheckIncludeFile.c.o   -c /home/vagrant/slave/monero-static-ubuntu-amd64/build/build/release/CMakeFiles/CMakeTmp/CheckIncludeFile.c
/home/vagrant/slave/monero-static-ubuntu-amd64/build/build/release/CMakeFiles/CMakeTmp/CheckIncludeFile.c:1:21: fatal error: windows.h: No such file or directory
compilation terminated.
CMakeFiles/cmTC_87a57.dir/build.make:65: recipe for target 'CMakeFiles/cmTC_87a57.dir/CheckIncludeFile.c.o' failed
make[2]: *** [CMakeFiles/cmTC_87a57.dir/CheckIncludeFile.c.o] Error 1
make[2]: Leaving directory '/home/vagrant/slave/monero-static-ubuntu-amd64/build/build/release/CMakeFiles/CMakeTmp'
Makefile:126: recipe for target 'cmTC_87a57/fast' failed
make[1]: *** [cmTC_87a57/fast] Error 2
make[1]: Leaving directory '/home/vagrant/slave/monero-static-ubuntu-amd64/build/build/release/CMakeFiles/CMakeTmp'


Determining if the include file winsock2.h exists failed with the following output:
Change Dir: /home/vagrant/slave/monero-static-ubuntu-amd64/build/build/release/CMakeFiles/CMakeTmp

Run Build Command:"/usr/bin/make" "cmTC_6bc92/fast"
make[1]: Entering directory '/home/vagrant/slave/monero-static-ubuntu-amd64/build/build/release/CMakeFiles/CMakeTmp'
/usr/bin/make -f CMakeFiles/cmTC_6bc92.dir/build.make CMakeFiles/cmTC_6bc92.dir/build
make[2]: Entering directory '/home/vagrant/slave/monero-static-ubuntu-amd64/build/build/release/CMakeFiles/CMakeTmp'
Building C object CMakeFiles/cmTC_6bc92.dir/CheckIncludeFile.c.o
/usr/bin/cc    -pthread    -o CMakeFiles/cmTC_6bc92.dir/CheckIncludeFile.c.o   -c /home/vagrant/slave/monero-static-ubuntu-amd64/build/build/release/CMakeFiles/CMakeTmp/CheckIncludeFile.c
/home/vagrant/slave/monero-static-ubuntu-amd64/build/build/release/CMakeFiles/CMakeTmp/CheckIncludeFile.c:1:22: fatal error: winsock2.h: No such file or directory
compilation terminated.
CMakeFiles/cmTC_6bc92.dir/build.make:65: recipe for target 'CMakeFiles/cmTC_6bc92.dir/CheckIncludeFile.c.o' failed
make[2]: *** [CMakeFiles/cmTC_6bc92.dir/CheckIncludeFile.c.o] Error 1
make[2]: Leaving directory '/home/vagrant/slave/monero-static-ubuntu-amd64/build/build/release/CMakeFiles/CMakeTmp'
Makefile:126: recipe for target 'cmTC_6bc92/fast' failed
make[1]: *** [cmTC_6bc92/fast] Error 2
make[1]: Leaving directory '/home/vagrant/slave/monero-static-ubuntu-amd64/build/build/release/CMakeFiles/CMakeTmp'


Determining if the include file ws2tcpip.h exists failed with the following output:
Change Dir: /home/vagrant/slave/monero-static-ubuntu-amd64/build/build/release/CMakeFiles/CMakeTmp

Run Build Command:"/usr/bin/make" "cmTC_b3366/fast"
make[1]: Entering directory '/home/vagrant/slave/monero-static-ubuntu-amd64/build/build/release/CMakeFiles/CMakeTmp'
/usr/bin/make -f CMakeFiles/cmTC_b3366.dir/build.make CMakeFiles/cmTC_b3366.dir/build
make[2]: Entering directory '/home/vagrant/slave/monero-static-ubuntu-amd64/build/build/release/CMakeFiles/CMakeTmp'
Building C object CMakeFiles/cmTC_b3366.dir/CheckIncludeFile.c.o
/usr/bin/cc    -pthread    -o CMakeFiles/cmTC_b3366.dir/CheckIncludeFile.c.o   -c /home/vagrant/slave/monero-static-ubuntu-amd64/build/build/release/CMakeFiles/CMakeTmp/CheckIncludeFile.c
/home/vagrant/slave/monero-static-ubuntu-amd64/build/build/release/CMakeFiles/CMakeTmp/CheckIncludeFile.c:1:22: fatal error: ws2tcpip.h: No such file or directory
compilation terminated.
CMakeFiles/cmTC_b3366.dir/build.make:65: recipe for target 'CMakeFiles/cmTC_b3366.dir/CheckIncludeFile.c.o' failed
make[2]: *** [CMakeFiles/cmTC_b3366.dir/CheckIncludeFile.c.o] Error 1
make[2]: Leaving directory '/home/vagrant/slave/monero-static-ubuntu-amd64/build/build/release/CMakeFiles/CMakeTmp'
Makefile:126: recipe for target 'cmTC_b3366/fast' failed
make[1]: *** [cmTC_b3366/fast] Error 2
make[1]: Leaving directory '/home/vagrant/slave/monero-static-ubuntu-amd64/build/build/release/CMakeFiles/CMakeTmp'


Determining if the function _beginthreadex exists failed with the following output:
Change Dir: /home/vagrant/slave/monero-static-ubuntu-amd64/build/build/release/CMakeFiles/CMakeTmp

Run Build Command:"/usr/bin/make" "cmTC_8f980/fast"
make[1]: Entering directory '/home/vagrant/slave/monero-static-ubuntu-amd64/build/build/release/CMakeFiles/CMakeTmp'
/usr/bin/make -f CMakeFiles/cmTC_8f980.dir/build.make CMakeFiles/cmTC_8f980.dir/build
make[2]: Entering directory '/home/vagrant/slave/monero-static-ubuntu-amd64/build/build/release/CMakeFiles/CMakeTmp'
Building C object CMakeFiles/cmTC_8f980.dir/CheckFunctionExists.c.o
/usr/bin/cc    -pthread -DCHECK_FUNCTION_EXISTS=_beginthreadex   -o CMakeFiles/cmTC_8f980.dir/CheckFunctionExists.c.o   -c /usr/share/cmake-3.5/Modules/CheckFunctionExists.c
Linking C executable cmTC_8f980
/usr/bin/cmake -E cmake_link_script CMakeFiles/cmTC_8f980.dir/link.txt --verbose=1
/usr/bin/cc   -pthread -DCHECK_FUNCTION_EXISTS=_beginthreadex    CMakeFiles/cmTC_8f980.dir/CheckFunctionExists.c.o  -o cmTC_8f980 -rdynamic 
CMakeFiles/cmTC_8f980.dir/CheckFunctionExists.c.o: In function `main':
CheckFunctionExists.c:(.text+0x15): undefined reference to `_beginthreadex'
collect2: error: ld returned 1 exit status
CMakeFiles/cmTC_8f980.dir/build.make:97: recipe for target 'cmTC_8f980' failed
make[2]: *** [cmTC_8f980] Error 1
make[2]: Leaving directory '/home/vagrant/slave/monero-static-ubuntu-amd64/build/build/release/CMakeFiles/CMakeTmp'
Makefile:126: recipe for target 'cmTC_8f980/fast' failed
make[1]: *** [cmTC_8f980/fast] Error 2
make[1]: Leaving directory '/home/vagrant/slave/monero-static-ubuntu-amd64/build/build/release/CMakeFiles/CMakeTmp'


Determining if the function arc4random exists failed with the following output:
Change Dir: /home/vagrant/slave/monero-static-ubuntu-amd64/build/build/release/CMakeFiles/CMakeTmp

Run Build Command:"/usr/bin/make" "cmTC_550cb/fast"
make[1]: Entering directory '/home/vagrant/slave/monero-static-ubuntu-amd64/build/build/release/CMakeFiles/CMakeTmp'
/usr/bin/make -f CMakeFiles/cmTC_550cb.dir/build.make CMakeFiles/cmTC_550cb.dir/build
make[2]: Entering directory '/home/vagrant/slave/monero-static-ubuntu-amd64/build/build/release/CMakeFiles/CMakeTmp'
Building C object CMakeFiles/cmTC_550cb.dir/CheckFunctionExists.c.o
/usr/bin/cc    -pthread -DCHECK_FUNCTION_EXISTS=arc4random   -o CMakeFiles/cmTC_550cb.dir/CheckFunctionExists.c.o   -c /usr/share/cmake-3.5/Modules/CheckFunctionExists.c
Linking C executable cmTC_550cb
/usr/bin/cmake -E cmake_link_script CMakeFiles/cmTC_550cb.dir/link.txt --verbose=1
/usr/bin/cc   -pthread -DCHECK_FUNCTION_EXISTS=arc4random    CMakeFiles/cmTC_550cb.dir/CheckFunctionExists.c.o  -o cmTC_550cb -rdynamic 
CMakeFiles/cmTC_550cb.dir/CheckFunctionExists.c.o: In function `main':
CheckFunctionExists.c:(.text+0x15): undefined reference to `arc4random'
collect2: error: ld returned 1 exit status
CMakeFiles/cmTC_550cb.dir/build.make:97: recipe for target 'cmTC_550cb' failed
make[2]: *** [cmTC_550cb] Error 1
make[2]: Leaving directory '/home/vagrant/slave/monero-static-ubuntu-amd64/build/build/release/CMakeFiles/CMakeTmp'
Makefile:126: recipe for target 'cmTC_550cb/fast' failed
make[1]: *** [cmTC_550cb/fast] Error 2
make[1]: Leaving directory '/home/vagrant/slave/monero-static-ubuntu-amd64/build/build/release/CMakeFiles/CMakeTmp'


Determining if the function arc4random_uniform exists failed with the following output:
Change Dir: /home/vagrant/slave/monero-static-ubuntu-amd64/build/build/release/CMakeFiles/CMakeTmp

Run Build Command:"/usr/bin/make" "cmTC_12f02/fast"
make[1]: Entering directory '/home/vagrant/slave/monero-static-ubuntu-amd64/build/build/release/CMakeFiles/CMakeTmp'
/usr/bin/make -f CMakeFiles/cmTC_12f02.dir/build.make CMakeFiles/cmTC_12f02.dir/build
make[2]: Entering directory '/home/vagrant/slave/monero-static-ubuntu-amd64/build/build/release/CMakeFiles/CMakeTmp'
Building C object CMakeFiles/cmTC_12f02.dir/CheckFunctionExists.c.o
/usr/bin/cc    -pthread -DCHECK_FUNCTION_EXISTS=arc4random_uniform   -o CMakeFiles/cmTC_12f02.dir/CheckFunctionExists.c.o   -c /usr/share/cmake-3.5/Modules/CheckFunctionExists.c
Linking C executable cmTC_12f02
/usr/bin/cmake -E cmake_link_script CMakeFiles/cmTC_12f02.dir/link.txt --verbose=1
/usr/bin/cc   -pthread -DCHECK_FUNCTION_EXISTS=arc4random_uniform    CMakeFiles/cmTC_12f02.dir/CheckFunctionExists.c.o  -o cmTC_12f02 -rdynamic 
CMakeFiles/cmTC_12f02.dir/CheckFunctionExists.c.o: In function `main':
CheckFunctionExists.c:(.text+0x15): undefined reference to `arc4random_uniform'
collect2: error: ld returned 1 exit status
CMakeFiles/cmTC_12f02.dir/build.make:97: recipe for target 'cmTC_12f02' failed
make[2]: *** [cmTC_12f02] Error 1
make[2]: Leaving directory '/home/vagrant/slave/monero-static-ubuntu-amd64/build/build/release/CMakeFiles/CMakeTmp'
Makefile:126: recipe for target 'cmTC_12f02/fast' failed
make[1]: *** [cmTC_12f02/fast] Error 2
make[1]: Leaving directory '/home/vagrant/slave/monero-static-ubuntu-amd64/build/build/release/CMakeFiles/CMakeTmp'


Determining if the function getentropy exists failed with the following output:
Change Dir: /home/vagrant/slave/monero-static-ubuntu-amd64/build/build/release/CMakeFiles/CMakeTmp

Run Build Command:"/usr/bin/make" "cmTC_5eb38/fast"
make[1]: Entering directory '/home/vagrant/slave/monero-static-ubuntu-amd64/build/build/release/CMakeFiles/CMakeTmp'
/usr/bin/make -f CMakeFiles/cmTC_5eb38.dir/build.make CMakeFiles/cmTC_5eb38.dir/build
make[2]: Entering directory '/home/vagrant/slave/monero-static-ubuntu-amd64/build/build/release/CMakeFiles/CMakeTmp'
Building C object CMakeFiles/cmTC_5eb38.dir/CheckFunctionExists.c.o
/usr/bin/cc    -pthread -DCHECK_FUNCTION_EXISTS=getentropy   -o CMakeFiles/cmTC_5eb38.dir/CheckFunctionExists.c.o   -c /usr/share/cmake-3.5/Modules/CheckFunctionExists.c
Linking C executable cmTC_5eb38
/usr/bin/cmake -E cmake_link_script CMakeFiles/cmTC_5eb38.dir/link.txt --verbose=1
/usr/bin/cc   -pthread -DCHECK_FUNCTION_EXISTS=getentropy    CMakeFiles/cmTC_5eb38.dir/CheckFunctionExists.c.o  -o cmTC_5eb38 -rdynamic 
CMakeFiles/cmTC_5eb38.dir/CheckFunctionExists.c.o: In function `main':
CheckFunctionExists.c:(.text+0x15): undefined reference to `getentropy'
collect2: error: ld returned 1 exit status
CMakeFiles/cmTC_5eb38.dir/build.make:97: recipe for target 'cmTC_5eb38' failed
make[2]: *** [cmTC_5eb38] Error 1
make[2]: Leaving directory '/home/vagrant/slave/monero-static-ubuntu-amd64/build/build/release/CMakeFiles/CMakeTmp'
Makefile:126: recipe for target 'cmTC_5eb38/fast' failed
make[1]: *** [cmTC_5eb38/fast] Error 2
make[1]: Leaving directory '/home/vagrant/slave/monero-static-ubuntu-amd64/build/build/release/CMakeFiles/CMakeTmp'


Determining if the function ioctlsocket exists failed with the following output:
Change Dir: /home/vagrant/slave/monero-static-ubuntu-amd64/build/build/release/CMakeFiles/CMakeTmp

Run Build Command:"/usr/bin/make" "cmTC_72827/fast"
make[1]: Entering directory '/home/vagrant/slave/monero-static-ubuntu-amd64/build/build/release/CMakeFiles/CMakeTmp'
/usr/bin/make -f CMakeFiles/cmTC_72827.dir/build.make CMakeFiles/cmTC_72827.dir/build
make[2]: Entering directory '/home/vagrant/slave/monero-static-ubuntu-amd64/build/build/release/CMakeFiles/CMakeTmp'
Building C object CMakeFiles/cmTC_72827.dir/CheckFunctionExists.c.o
/usr/bin/cc    -pthread -DCHECK_FUNCTION_EXISTS=ioctlsocket   -o CMakeFiles/cmTC_72827.dir/CheckFunctionExists.c.o   -c /usr/share/cmake-3.5/Modules/CheckFunctionExists.c
Linking C executable cmTC_72827
/usr/bin/cmake -E cmake_link_script CMakeFiles/cmTC_72827.dir/link.txt --verbose=1
/usr/bin/cc   -pthread -DCHECK_FUNCTION_EXISTS=ioctlsocket    CMakeFiles/cmTC_72827.dir/CheckFunctionExists.c.o  -o cmTC_72827 -rdynamic 
CMakeFiles/cmTC_72827.dir/CheckFunctionExists.c.o: In function `main':
CheckFunctionExists.c:(.text+0x15): undefined reference to `ioctlsocket'
collect2: error: ld returned 1 exit status
CMakeFiles/cmTC_72827.dir/build.make:97: recipe for target 'cmTC_72827' failed
make[2]: *** [cmTC_72827] Error 1
make[2]: Leaving directory '/home/vagrant/slave/monero-static-ubuntu-amd64/build/build/release/CMakeFiles/CMakeTmp'
Makefile:126: recipe for target 'cmTC_72827/fast' failed
make[1]: *** [cmTC_72827/fast] Error 2
make[1]: Leaving directory '/home/vagrant/slave/monero-static-ubuntu-amd64/build/build/release/CMakeFiles/CMakeTmp'


Determining if the function reallocarray exists failed with the following output:
Change Dir: /home/vagrant/slave/monero-static-ubuntu-amd64/build/build/release/CMakeFiles/CMakeTmp

Run Build Command:"/usr/bin/make" "cmTC_f1dfc/fast"
make[1]: Entering directory '/home/vagrant/slave/monero-static-ubuntu-amd64/build/build/release/CMakeFiles/CMakeTmp'
/usr/bin/make -f CMakeFiles/cmTC_f1dfc.dir/build.make CMakeFiles/cmTC_f1dfc.dir/build
make[2]: Entering directory '/home/vagrant/slave/monero-static-ubuntu-amd64/build/build/release/CMakeFiles/CMakeTmp'
Building C object CMakeFiles/cmTC_f1dfc.dir/CheckFunctionExists.c.o
/usr/bin/cc    -pthread -DCHECK_FUNCTION_EXISTS=reallocarray   -o CMakeFiles/cmTC_f1dfc.dir/CheckFunctionExists.c.o   -c /usr/share/cmake-3.5/Modules/CheckFunctionExists.c
Linking C executable cmTC_f1dfc
/usr/bin/cmake -E cmake_link_script CMakeFiles/cmTC_f1dfc.dir/link.txt --verbose=1
/usr/bin/cc   -pthread -DCHECK_FUNCTION_EXISTS=reallocarray    CMakeFiles/cmTC_f1dfc.dir/CheckFunctionExists.c.o  -o cmTC_f1dfc -rdynamic 
CMakeFiles/cmTC_f1dfc.dir/CheckFunctionExists.c.o: In function `main':
CheckFunctionExists.c:(.text+0x15): undefined reference to `reallocarray'
collect2: error: ld returned 1 exit status
CMakeFiles/cmTC_f1dfc.dir/build.make:97: recipe for target 'cmTC_f1dfc' failed
make[2]: *** [cmTC_f1dfc] Error 1
make[2]: Leaving directory '/home/vagrant/slave/monero-static-ubuntu-amd64/build/build/release/CMakeFiles/CMakeTmp'
Makefile:126: recipe for target 'cmTC_f1dfc/fast' failed
make[1]: *** [cmTC_f1dfc/fast] Error 2
make[1]: Leaving directory '/home/vagrant/slave/monero-static-ubuntu-amd64/build/build/release/CMakeFiles/CMakeTmp'


Determining if the function setusercontent exists failed with the following output:
Change Dir: /home/vagrant/slave/monero-static-ubuntu-amd64/build/build/release/CMakeFiles/CMakeTmp

Run Build Command:"/usr/bin/make" "cmTC_bc1a9/fast"
make[1]: Entering directory '/home/vagrant/slave/monero-static-ubuntu-amd64/build/build/release/CMakeFiles/CMakeTmp'
/usr/bin/make -f CMakeFiles/cmTC_bc1a9.dir/build.make CMakeFiles/cmTC_bc1a9.dir/build
make[2]: Entering directory '/home/vagrant/slave/monero-static-ubuntu-amd64/build/build/release/CMakeFiles/CMakeTmp'
Building C object CMakeFiles/cmTC_bc1a9.dir/CheckFunctionExists.c.o
/usr/bin/cc    -pthread -DCHECK_FUNCTION_EXISTS=setusercontent   -o CMakeFiles/cmTC_bc1a9.dir/CheckFunctionExists.c.o   -c /usr/share/cmake-3.5/Modules/CheckFunctionExists.c
Linking C executable cmTC_bc1a9
/usr/bin/cmake -E cmake_link_script CMakeFiles/cmTC_bc1a9.dir/link.txt --verbose=1
/usr/bin/cc   -pthread -DCHECK_FUNCTION_EXISTS=setusercontent    CMakeFiles/cmTC_bc1a9.dir/CheckFunctionExists.c.o  -o cmTC_bc1a9 -rdynamic 
CMakeFiles/cmTC_bc1a9.dir/CheckFunctionExists.c.o: In function `main':
CheckFunctionExists.c:(.text+0x15): undefined reference to `setusercontent'
collect2: error: ld returned 1 exit status
CMakeFiles/cmTC_bc1a9.dir/build.make:97: recipe for target 'cmTC_bc1a9' failed
make[2]: *** [cmTC_bc1a9] Error 1
make[2]: Leaving directory '/home/vagrant/slave/monero-static-ubuntu-amd64/build/build/release/CMakeFiles/CMakeTmp'
Makefile:126: recipe for target 'cmTC_bc1a9/fast' failed
make[1]: *** [cmTC_bc1a9/fast] Error 2
make[1]: Leaving directory '/home/vagrant/slave/monero-static-ubuntu-amd64/build/build/release/CMakeFiles/CMakeTmp'


Determining if the function strlcat exists failed with the following output:
Change Dir: /home/vagrant/slave/monero-static-ubuntu-amd64/build/build/release/CMakeFiles/CMakeTmp

Run Build Command:"/usr/bin/make" "cmTC_07835/fast"
make[1]: Entering directory '/home/vagrant/slave/monero-static-ubuntu-amd64/build/build/release/CMakeFiles/CMakeTmp'
/usr/bin/make -f CMakeFiles/cmTC_07835.dir/build.make CMakeFiles/cmTC_07835.dir/build
make[2]: Entering directory '/home/vagrant/slave/monero-static-ubuntu-amd64/build/build/release/CMakeFiles/CMakeTmp'
Building C object CMakeFiles/cmTC_07835.dir/CheckFunctionExists.c.o
/usr/bin/cc    -pthread -DCHECK_FUNCTION_EXISTS=strlcat   -o CMakeFiles/cmTC_07835.dir/CheckFunctionExists.c.o   -c /usr/share/cmake-3.5/Modules/CheckFunctionExists.c
Linking C executable cmTC_07835
/usr/bin/cmake -E cmake_link_script CMakeFiles/cmTC_07835.dir/link.txt --verbose=1
/usr/bin/cc   -pthread -DCHECK_FUNCTION_EXISTS=strlcat    CMakeFiles/cmTC_07835.dir/CheckFunctionExists.c.o  -o cmTC_07835 -rdynamic 
CMakeFiles/cmTC_07835.dir/CheckFunctionExists.c.o: In function `main':
CheckFunctionExists.c:(.text+0x15): undefined reference to `strlcat'
collect2: error: ld returned 1 exit status
CMakeFiles/cmTC_07835.dir/build.make:97: recipe for target 'cmTC_07835' failed
make[2]: *** [cmTC_07835] Error 1
make[2]: Leaving directory '/home/vagrant/slave/monero-static-ubuntu-amd64/build/build/release/CMakeFiles/CMakeTmp'
Makefile:126: recipe for target 'cmTC_07835/fast' failed
make[1]: *** [cmTC_07835/fast] Error 2
make[1]: Leaving directory '/home/vagrant/slave/monero-static-ubuntu-amd64/build/build/release/CMakeFiles/CMakeTmp'


Determining if the function strlcpy exists failed with the following output:
Change Dir: /home/vagrant/slave/monero-static-ubuntu-amd64/build/build/release/CMakeFiles/CMakeTmp

Run Build Command:"/usr/bin/make" "cmTC_af62c/fast"
make[1]: Entering directory '/home/vagrant/slave/monero-static-ubuntu-amd64/build/build/release/CMakeFiles/CMakeTmp'
/usr/bin/make -f CMakeFiles/cmTC_af62c.dir/build.make CMakeFiles/cmTC_af62c.dir/build
make[2]: Entering directory '/home/vagrant/slave/monero-static-ubuntu-amd64/build/build/release/CMakeFiles/CMakeTmp'
Building C object CMakeFiles/cmTC_af62c.dir/CheckFunctionExists.c.o
/usr/bin/cc    -pthread -DCHECK_FUNCTION_EXISTS=strlcpy   -o CMakeFiles/cmTC_af62c.dir/CheckFunctionExists.c.o   -c /usr/share/cmake-3.5/Modules/CheckFunctionExists.c
Linking C executable cmTC_af62c
/usr/bin/cmake -E cmake_link_script CMakeFiles/cmTC_af62c.dir/link.txt --verbose=1
/usr/bin/cc   -pthread -DCHECK_FUNCTION_EXISTS=strlcpy    CMakeFiles/cmTC_af62c.dir/CheckFunctionExists.c.o  -o cmTC_af62c -rdynamic 
CMakeFiles/cmTC_af62c.dir/CheckFunctionExists.c.o: In function `main':
CheckFunctionExists.c:(.text+0x15): undefined reference to `strlcpy'
collect2: error: ld returned 1 exit status
CMakeFiles/cmTC_af62c.dir/build.make:97: recipe for target 'cmTC_af62c' failed
make[2]: *** [cmTC_af62c] Error 1
make[2]: Leaving directory '/home/vagrant/slave/monero-static-ubuntu-amd64/build/build/release/CMakeFiles/CMakeTmp'
Makefile:126: recipe for target 'cmTC_af62c/fast' failed
make[1]: *** [cmTC_af62c/fast] Error 2
make[1]: Leaving directory '/home/vagrant/slave/monero-static-ubuntu-amd64/build/build/release/CMakeFiles/CMakeTmp'


Determining if the PTHREAD_PRIO_INHERIT exist failed with the following output:
Change Dir: /home/vagrant/slave/monero-static-ubuntu-amd64/build/build/release/CMakeFiles/CMakeTmp

Run Build Command:"/usr/bin/make" "cmTC_b7bea/fast"
make[1]: Entering directory '/home/vagrant/slave/monero-static-ubuntu-amd64/build/build/release/CMakeFiles/CMakeTmp'
/usr/bin/make -f CMakeFiles/cmTC_b7bea.dir/build.make CMakeFiles/cmTC_b7bea.dir/build
make[2]: Entering directory '/home/vagrant/slave/monero-static-ubuntu-amd64/build/build/release/CMakeFiles/CMakeTmp'
Building C object CMakeFiles/cmTC_b7bea.dir/CheckSymbolExists.c.o
/usr/bin/cc    -pthread    -o CMakeFiles/cmTC_b7bea.dir/CheckSymbolExists.c.o   -c /home/vagrant/slave/monero-static-ubuntu-amd64/build/build/release/CMakeFiles/CMakeTmp/CheckSymbolExists.c
/home/vagrant/slave/monero-static-ubuntu-amd64/build/build/release/CMakeFiles/CMakeTmp/CheckSymbolExists.c: In function 'main':
/home/vagrant/slave/monero-static-ubuntu-amd64/build/build/release/CMakeFiles/CMakeTmp/CheckSymbolExists.c:8:18: error: lvalue required as unary '&' operand
   return ((int*)(&PTHREAD_PRIO_INHERIT))[argc];
                  ^
CMakeFiles/cmTC_b7bea.dir/build.make:65: recipe for target 'CMakeFiles/cmTC_b7bea.dir/CheckSymbolExists.c.o' failed
make[2]: *** [CMakeFiles/cmTC_b7bea.dir/CheckSymbolExists.c.o] Error 1
make[2]: Leaving directory '/home/vagrant/slave/monero-static-ubuntu-amd64/build/build/release/CMakeFiles/CMakeTmp'
Makefile:126: recipe for target 'cmTC_b7bea/fast' failed
make[1]: *** [cmTC_b7bea/fast] Error 2
make[1]: Leaving directory '/home/vagrant/slave/monero-static-ubuntu-amd64/build/build/release/CMakeFiles/CMakeTmp'

File /home/vagrant/slave/monero-static-ubuntu-amd64/build/build/release/CMakeFiles/CMakeTmp/CheckSymbolExists.c:
/* */
#include <pthread.h>

int main(int argc, char** argv)
{
  (void)argv;
#ifndef PTHREAD_PRIO_INHERIT
  return ((int*)(&PTHREAD_PRIO_INHERIT))[argc];
#else
  (void)argc;
  return 0;
#endif
}

Determining if the pthread_rwlock_t exist failed with the following output:
Change Dir: /home/vagrant/slave/monero-static-ubuntu-amd64/build/build/release/CMakeFiles/CMakeTmp

Run Build Command:"/usr/bin/make" "cmTC_cadf9/fast"
make[1]: Entering directory '/home/vagrant/slave/monero-static-ubuntu-amd64/build/build/release/CMakeFiles/CMakeTmp'
/usr/bin/make -f CMakeFiles/cmTC_cadf9.dir/build.make CMakeFiles/cmTC_cadf9.dir/build
make[2]: Entering directory '/home/vagrant/slave/monero-static-ubuntu-amd64/build/build/release/CMakeFiles/CMakeTmp'
Building C object CMakeFiles/cmTC_cadf9.dir/CheckSymbolExists.c.o
/usr/bin/cc    -pthread    -o CMakeFiles/cmTC_cadf9.dir/CheckSymbolExists.c.o   -c /home/vagrant/slave/monero-static-ubuntu-amd64/build/build/release/CMakeFiles/CMakeTmp/CheckSymbolExists.c
/home/vagrant/slave/monero-static-ubuntu-amd64/build/build/release/CMakeFiles/CMakeTmp/CheckSymbolExists.c: In function 'main':
/home/vagrant/slave/monero-static-ubuntu-amd64/build/build/release/CMakeFiles/CMakeTmp/CheckSymbolExists.c:8:19: error: expected expression before 'pthread_rwlock_t'
   return ((int*)(&pthread_rwlock_t))[argc];
                   ^
CMakeFiles/cmTC_cadf9.dir/build.make:65: recipe for target 'CMakeFiles/cmTC_cadf9.dir/CheckSymbolExists.c.o' failed
make[2]: *** [CMakeFiles/cmTC_cadf9.dir/CheckSymbolExists.c.o] Error 1
make[2]: Leaving directory '/home/vagrant/slave/monero-static-ubuntu-amd64/build/build/release/CMakeFiles/CMakeTmp'
Makefile:126: recipe for target 'cmTC_cadf9/fast' failed
make[1]: *** [cmTC_cadf9/fast] Error 2
make[1]: Leaving directory '/home/vagrant/slave/monero-static-ubuntu-amd64/build/build/release/CMakeFiles/CMakeTmp'

File /home/vagrant/slave/monero-static-ubuntu-amd64/build/build/release/CMakeFiles/CMakeTmp/CheckSymbolExists.c:
/* */
#include <pthread.h>

int main(int argc, char** argv)
{
  (void)argv;
#ifndef pthread_rwlock_t
  return ((int*)(&pthread_rwlock_t))[argc];
#else
  (void)argc;
  return 0;
#endif
}

Determining if the pthread_spinlock_t exist failed with the following output:
Change Dir: /home/vagrant/slave/monero-static-ubuntu-amd64/build/build/release/CMakeFiles/CMakeTmp

Run Build Command:"/usr/bin/make" "cmTC_564d7/fast"
make[1]: Entering directory '/home/vagrant/slave/monero-static-ubuntu-amd64/build/build/release/CMakeFiles/CMakeTmp'
/usr/bin/make -f CMakeFiles/cmTC_564d7.dir/build.make CMakeFiles/cmTC_564d7.dir/build
make[2]: Entering directory '/home/vagrant/slave/monero-static-ubuntu-amd64/build/build/release/CMakeFiles/CMakeTmp'
Building C object CMakeFiles/cmTC_564d7.dir/CheckSymbolExists.c.o
/usr/bin/cc    -pthread    -o CMakeFiles/cmTC_564d7.dir/CheckSymbolExists.c.o   -c /home/vagrant/slave/monero-static-ubuntu-amd64/build/build/release/CMakeFiles/CMakeTmp/CheckSymbolExists.c
/home/vagrant/slave/monero-static-ubuntu-amd64/build/build/release/CMakeFiles/CMakeTmp/CheckSymbolExists.c: In function 'main':
/home/vagrant/slave/monero-static-ubuntu-amd64/build/build/release/CMakeFiles/CMakeTmp/CheckSymbolExists.c:8:19: error: expected expression before 'pthread_spinlock_t'
   return ((int*)(&pthread_spinlock_t))[argc];
                   ^
CMakeFiles/cmTC_564d7.dir/build.make:65: recipe for target 'CMakeFiles/cmTC_564d7.dir/CheckSymbolExists.c.o' failed
make[2]: *** [CMakeFiles/cmTC_564d7.dir/CheckSymbolExists.c.o] Error 1
make[2]: Leaving directory '/home/vagrant/slave/monero-static-ubuntu-amd64/build/build/release/CMakeFiles/CMakeTmp'
Makefile:126: recipe for target 'cmTC_564d7/fast' failed
make[1]: *** [cmTC_564d7/fast] Error 2
make[1]: Leaving directory '/home/vagrant/slave/monero-static-ubuntu-amd64/build/build/release/CMakeFiles/CMakeTmp'

File /home/vagrant/slave/monero-static-ubuntu-amd64/build/build/release/CMakeFiles/CMakeTmp/CheckSymbolExists.c:
/* */
#include <pthread.h>

int main(int argc, char** argv)
{
  (void)argv;
#ifndef pthread_spinlock_t
  return ((int*)(&pthread_spinlock_t))[argc];
#else
  (void)argc;
  return 0;
#endif
}

Determining if the function EVP_MD_CTX_new exists failed with the following output:
Change Dir: /home/vagrant/slave/monero-static-ubuntu-amd64/build/build/release/CMakeFiles/CMakeTmp

Run Build Command:"/usr/bin/make" "cmTC_3e3c3/fast"
make[1]: Entering directory '/home/vagrant/slave/monero-static-ubuntu-amd64/build/build/release/CMakeFiles/CMakeTmp'
/usr/bin/make -f CMakeFiles/cmTC_3e3c3.dir/build.make CMakeFiles/cmTC_3e3c3.dir/build
make[2]: Entering directory '/home/vagrant/slave/monero-static-ubuntu-amd64/build/build/release/CMakeFiles/CMakeTmp'
Building C object CMakeFiles/cmTC_3e3c3.dir/CheckFunctionExists.c.o
/usr/bin/cc    -pthread -DCHECK_FUNCTION_EXISTS=EVP_MD_CTX_new   -o CMakeFiles/cmTC_3e3c3.dir/CheckFunctionExists.c.o   -c /usr/share/cmake-3.5/Modules/CheckFunctionExists.c
Linking C executable cmTC_3e3c3
/usr/bin/cmake -E cmake_link_script CMakeFiles/cmTC_3e3c3.dir/link.txt --verbose=1
/usr/bin/cc   -pthread -DCHECK_FUNCTION_EXISTS=EVP_MD_CTX_new    CMakeFiles/cmTC_3e3c3.dir/CheckFunctionExists.c.o  -o cmTC_3e3c3 -rdynamic /usr/lib/x86_64-linux-gnu/libssl.a /usr/lib/x86_64-linux-gnu/libcrypto.a -ldl -pthread 
CMakeFiles/cmTC_3e3c3.dir/CheckFunctionExists.c.o: In function `main':
CheckFunctionExists.c:(.text+0x15): undefined reference to `EVP_MD_CTX_new'
collect2: error: ld returned 1 exit status
CMakeFiles/cmTC_3e3c3.dir/build.make:99: recipe for target 'cmTC_3e3c3' failed
make[2]: *** [cmTC_3e3c3] Error 1
make[2]: Leaving directory '/home/vagrant/slave/monero-static-ubuntu-amd64/build/build/release/CMakeFiles/CMakeTmp'
Makefile:126: recipe for target 'cmTC_3e3c3/fast' failed
make[1]: *** [cmTC_3e3c3/fast] Error 2
make[1]: Leaving directory '/home/vagrant/slave/monero-static-ubuntu-amd64/build/build/release/CMakeFiles/CMakeTmp'


Determining if the LIBRESSL_VERSION_TEXT exist failed with the following output:
Change Dir: /home/vagrant/slave/monero-static-ubuntu-amd64/build/build/release/CMakeFiles/CMakeTmp

Run Build Command:"/usr/bin/make" "cmTC_6ccd6/fast"
make[1]: Entering directory '/home/vagrant/slave/monero-static-ubuntu-amd64/build/build/release/CMakeFiles/CMakeTmp'
/usr/bin/make -f CMakeFiles/cmTC_6ccd6.dir/build.make CMakeFiles/cmTC_6ccd6.dir/build
make[2]: Entering directory '/home/vagrant/slave/monero-static-ubuntu-amd64/build/build/release/CMakeFiles/CMakeTmp'
Building C object CMakeFiles/cmTC_6ccd6.dir/CheckSymbolExists.c.o
/usr/bin/cc    -pthread    -o CMakeFiles/cmTC_6ccd6.dir/CheckSymbolExists.c.o   -c /home/vagrant/slave/monero-static-ubuntu-amd64/build/build/release/CMakeFiles/CMakeTmp/CheckSymbolExists.c
/home/vagrant/slave/monero-static-ubuntu-amd64/build/build/release/CMakeFiles/CMakeTmp/CheckSymbolExists.c: In function 'main':
/home/vagrant/slave/monero-static-ubuntu-amd64/build/build/release/CMakeFiles/CMakeTmp/CheckSymbolExists.c:8:19: error: 'LIBRESSL_VERSION_TEXT' undeclared (first use in this function)
   return ((int*)(&LIBRESSL_VERSION_TEXT))[argc];
                   ^
/home/vagrant/slave/monero-static-ubuntu-amd64/build/build/release/CMakeFiles/CMakeTmp/CheckSymbolExists.c:8:19: note: each undeclared identifier is reported only once for each function it appears in
CMakeFiles/cmTC_6ccd6.dir/build.make:65: recipe for target 'CMakeFiles/cmTC_6ccd6.dir/CheckSymbolExists.c.o' failed
make[2]: *** [CMakeFiles/cmTC_6ccd6.dir/CheckSymbolExists.c.o] Error 1
make[2]: Leaving directory '/home/vagrant/slave/monero-static-ubuntu-amd64/build/build/release/CMakeFiles/CMakeTmp'
Makefile:126: recipe for target 'cmTC_6ccd6/fast' failed
make[1]: *** [cmTC_6ccd6/fast] Error 2
make[1]: Leaving directory '/home/vagrant/slave/monero-static-ubuntu-amd64/build/build/release/CMakeFiles/CMakeTmp'

File /home/vagrant/slave/monero-static-ubuntu-amd64/build/build/release/CMakeFiles/CMakeTmp/CheckSymbolExists.c:
/* */
#include <openssl/opensslv.h>

int main(int argc, char** argv)
{
  (void)argv;
#ifndef LIBRESSL_VERSION_TEXT
  return ((int*)(&LIBRESSL_VERSION_TEXT))[argc];
#else
  (void)argc;
  return 0;
#endif
}

Performing C++ SOURCE FILE Test HAVE_CXX_ATOMICS failed with the following output:
Change Dir: /home/vagrant/slave/monero-static-ubuntu-amd64/build/build/release/CMakeFiles/CMakeTmp

Run Build Command:"/usr/bin/make" "cmTC_6c4c2/fast"
make[1]: Entering directory '/home/vagrant/slave/monero-static-ubuntu-amd64/build/build/release/CMakeFiles/CMakeTmp'
/usr/bin/make -f CMakeFiles/cmTC_6c4c2.dir/build.make CMakeFiles/cmTC_6c4c2.dir/build
make[2]: Entering directory '/home/vagrant/slave/monero-static-ubuntu-amd64/build/build/release/CMakeFiles/CMakeTmp'
Building CXX object CMakeFiles/cmTC_6c4c2.dir/src.cxx.o
/usr/bin/c++     -DZMQ_STATIC -pthread -maes -DHAVE_CXX_ATOMICS   -o CMakeFiles/cmTC_6c4c2.dir/src.cxx.o -c /home/vagrant/slave/monero-static-ubuntu-amd64/build/build/release/CMakeFiles/CMakeTmp/src.cxx
In file included from /usr/include/c++/5/cstdint:35:0,
                 from /home/vagrant/slave/monero-static-ubuntu-amd64/build/build/release/CMakeFiles/CMakeTmp/src.cxx:2:
/usr/include/c++/5/bits/c++0x_warning.h:32:2: error: #error This file requires compiler and library support for the ISO C++ 2011 standard. This support must be enabled with the -std=c++11 or -std=gnu++11 compiler options.
 #error This file requires compiler and library support \
  ^
/home/vagrant/slave/monero-static-ubuntu-amd64/build/build/release/CMakeFiles/CMakeTmp/src.cxx: In function 'int main()':
/home/vagrant/slave/monero-static-ubuntu-amd64/build/build/release/CMakeFiles/CMakeTmp/src.cxx:5:3: error: 'atomic' is not a member of 'std'
   std::atomic<uint64_t> a;
   ^
/home/vagrant/slave/monero-static-ubuntu-amd64/build/build/release/CMakeFiles/CMakeTmp/src.cxx:5:15: error: 'uint64_t' was not declared in this scope
   std::atomic<uint64_t> a;
               ^
/home/vagrant/slave/monero-static-ubuntu-amd64/build/build/release/CMakeFiles/CMakeTmp/src.cxx:5:25: error: 'a' was not declared in this scope
   std::atomic<uint64_t> a;
                         ^
CMakeFiles/cmTC_6c4c2.dir/build.make:65: recipe for target 'CMakeFiles/cmTC_6c4c2.dir/src.cxx.o' failed
make[2]: *** [CMakeFiles/cmTC_6c4c2.dir/src.cxx.o] Error 1
make[2]: Leaving directory '/home/vagrant/slave/monero-static-ubuntu-amd64/build/build/release/CMakeFiles/CMakeTmp'
Makefile:126: recipe for target 'cmTC_6c4c2/fast' failed
make[1]: *** [cmTC_6c4c2/fast] Error 2
make[1]: Leaving directory '/home/vagrant/slave/monero-static-ubuntu-amd64/build/build/release/CMakeFiles/CMakeTmp'

Source file was:

#include <cstdint>
#include <atomic>
int main() {
  std::atomic<uint64_t> a;
  a.is_lock_free();
}
Performing C SOURCE FILE Test _fcf_protection=full_c failed with the following output:
Change Dir: /home/vagrant/slave/monero-static-ubuntu-amd64/build/build/release/CMakeFiles/CMakeTmp

Run Build Command:"/usr/bin/make" "cmTC_eb481/fast"
make[1]: Entering directory '/home/vagrant/slave/monero-static-ubuntu-amd64/build/build/release/CMakeFiles/CMakeTmp'
/usr/bin/make -f CMakeFiles/cmTC_eb481.dir/build.make CMakeFiles/cmTC_eb481.dir/build
make[2]: Entering directory '/home/vagrant/slave/monero-static-ubuntu-amd64/build/build/release/CMakeFiles/CMakeTmp'
Building C object CMakeFiles/cmTC_eb481.dir/src.c.o
/usr/bin/cc   -I/usr/local/include/libusb-1.0  -pthread -maes -march=x86-64 -fno-strict-aliasing -D_fcf_protection=full_c   -fcf-protection=full -o CMakeFiles/cmTC_eb481.dir/src.c.o   -c /home/vagrant/slave/monero-static-ubuntu-amd64/build/build/release/CMakeFiles/CMakeTmp/src.c
cc: error: unrecognized command line option '-fcf-protection=full'
CMakeFiles/cmTC_eb481.dir/build.make:65: recipe for target 'CMakeFiles/cmTC_eb481.dir/src.c.o' failed
make[2]: *** [CMakeFiles/cmTC_eb481.dir/src.c.o] Error 1
make[2]: Leaving directory '/home/vagrant/slave/monero-static-ubuntu-amd64/build/build/release/CMakeFiles/CMakeTmp'
Makefile:126: recipe for target 'cmTC_eb481/fast' failed
make[1]: *** [cmTC_eb481/fast] Error 2
make[1]: Leaving directory '/home/vagrant/slave/monero-static-ubuntu-amd64/build/build/release/CMakeFiles/CMakeTmp'

Source file was:
int main(void) { return 0; }
Performing C++ SOURCE FILE Test _fcf_protection=full_cxx failed with the following output:
Change Dir: /home/vagrant/slave/monero-static-ubuntu-amd64/build/build/release/CMakeFiles/CMakeTmp

Run Build Command:"/usr/bin/make" "cmTC_a39a5/fast"
make[1]: Entering directory '/home/vagrant/slave/monero-static-ubuntu-amd64/build/build/release/CMakeFiles/CMakeTmp'
/usr/bin/make -f CMakeFiles/cmTC_a39a5.dir/build.make CMakeFiles/cmTC_a39a5.dir/build
make[2]: Entering directory '/home/vagrant/slave/monero-static-ubuntu-amd64/build/build/release/CMakeFiles/CMakeTmp'
Building CXX object CMakeFiles/cmTC_a39a5.dir/src.cxx.o
/usr/bin/c++    -I/usr/local/include/libusb-1.0  -DZMQ_STATIC -pthread -maes -march=x86-64 -fno-strict-aliasing -D_fcf_protection=full_cxx   -fcf-protection=full -o CMakeFiles/cmTC_a39a5.dir/src.cxx.o -c /home/vagrant/slave/monero-static-ubuntu-amd64/build/build/release/CMakeFiles/CMakeTmp/src.cxx
c++: error: unrecognized command line option '-fcf-protection=full'
CMakeFiles/cmTC_a39a5.dir/build.make:65: recipe for target 'CMakeFiles/cmTC_a39a5.dir/src.cxx.o' failed
make[2]: *** [CMakeFiles/cmTC_a39a5.dir/src.cxx.o] Error 1
make[2]: Leaving directory '/home/vagrant/slave/monero-static-ubuntu-amd64/build/build/release/CMakeFiles/CMakeTmp'
Makefile:126: recipe for target 'cmTC_a39a5/fast' failed
make[1]: *** [cmTC_a39a5/fast] Error 2
make[1]: Leaving directory '/home/vagrant/slave/monero-static-ubuntu-amd64/build/build/release/CMakeFiles/CMakeTmp'

Source file was:
int main() { return 0; }
Performing C SOURCE FILE Test _fstack_clash_protection_c failed with the following output:
Change Dir: /home/vagrant/slave/monero-static-ubuntu-amd64/build/build/release/CMakeFiles/CMakeTmp

Run Build Command:"/usr/bin/make" "cmTC_1767d/fast"
make[1]: Entering directory '/home/vagrant/slave/monero-static-ubuntu-amd64/build/build/release/CMakeFiles/CMakeTmp'
/usr/bin/make -f CMakeFiles/cmTC_1767d.dir/build.make CMakeFiles/cmTC_1767d.dir/build
make[2]: Entering directory '/home/vagrant/slave/monero-static-ubuntu-amd64/build/build/release/CMakeFiles/CMakeTmp'
Building C object CMakeFiles/cmTC_1767d.dir/src.c.o
/usr/bin/cc   -I/usr/local/include/libusb-1.0  -pthread -maes -march=x86-64 -fno-strict-aliasing -D_fstack_clash_protection_c   -fstack-clash-protection -o CMakeFiles/cmTC_1767d.dir/src.c.o   -c /home/vagrant/slave/monero-static-ubuntu-amd64/build/build/release/CMakeFiles/CMakeTmp/src.c
cc: error: unrecognized command line option '-fstack-clash-protection'
CMakeFiles/cmTC_1767d.dir/build.make:65: recipe for target 'CMakeFiles/cmTC_1767d.dir/src.c.o' failed
make[2]: *** [CMakeFiles/cmTC_1767d.dir/src.c.o] Error 1
make[2]: Leaving directory '/home/vagrant/slave/monero-static-ubuntu-amd64/build/build/release/CMakeFiles/CMakeTmp'
Makefile:126: recipe for target 'cmTC_1767d/fast' failed
make[1]: *** [cmTC_1767d/fast] Error 2
make[1]: Leaving directory '/home/vagrant/slave/monero-static-ubuntu-amd64/build/build/release/CMakeFiles/CMakeTmp'

Source file was:
int main(void) { return 0; }
Performing C++ SOURCE FILE Test _fstack_clash_protection_cxx failed with the following output:
Change Dir: /home/vagrant/slave/monero-static-ubuntu-amd64/build/build/release/CMakeFiles/CMakeTmp

Run Build Command:"/usr/bin/make" "cmTC_13b99/fast"
make[1]: Entering directory '/home/vagrant/slave/monero-static-ubuntu-amd64/build/build/release/CMakeFiles/CMakeTmp'
/usr/bin/make -f CMakeFiles/cmTC_13b99.dir/build.make CMakeFiles/cmTC_13b99.dir/build
make[2]: Entering directory '/home/vagrant/slave/monero-static-ubuntu-amd64/build/build/release/CMakeFiles/CMakeTmp'
Building CXX object CMakeFiles/cmTC_13b99.dir/src.cxx.o
/usr/bin/c++    -I/usr/local/include/libusb-1.0  -DZMQ_STATIC -pthread -maes -march=x86-64 -fno-strict-aliasing -D_fstack_clash_protection_cxx   -fstack-clash-protection -o CMakeFiles/cmTC_13b99.dir/src.cxx.o -c /home/vagrant/slave/monero-static-ubuntu-amd64/build/build/release/CMakeFiles/CMakeTmp/src.cxx
c++: error: unrecognized command line option '-fstack-clash-protection'
CMakeFiles/cmTC_13b99.dir/build.make:65: recipe for target 'CMakeFiles/cmTC_13b99.dir/src.cxx.o' failed
make[2]: *** [CMakeFiles/cmTC_13b99.dir/src.cxx.o] Error 1
make[2]: Leaving directory '/home/vagrant/slave/monero-static-ubuntu-amd64/build/build/release/CMakeFiles/CMakeTmp'
Makefile:126: recipe for target 'cmTC_13b99/fast' failed
make[1]: *** [cmTC_13b99/fast] Error 2
make[1]: Leaving directory '/home/vagrant/slave/monero-static-ubuntu-amd64/build/build/release/CMakeFiles/CMakeTmp'

Source file was:
int main() { return 0; }
Performing C SOURCE FILE Test _mmitigate_rop_c failed with the following output:
Change Dir: /home/vagrant/slave/monero-static-ubuntu-amd64/build/build/release/CMakeFiles/CMakeTmp

Run Build Command:"/usr/bin/make" "cmTC_27f04/fast"
make[1]: Entering directory '/home/vagrant/slave/monero-static-ubuntu-amd64/build/build/release/CMakeFiles/CMakeTmp'
/usr/bin/make -f CMakeFiles/cmTC_27f04.dir/build.make CMakeFiles/cmTC_27f04.dir/build
make[2]: Entering directory '/home/vagrant/slave/monero-static-ubuntu-amd64/build/build/release/CMakeFiles/CMakeTmp'
Building C object CMakeFiles/cmTC_27f04.dir/src.c.o
/usr/bin/cc   -I/usr/local/include/libusb-1.0  -pthread -maes -march=x86-64 -fno-strict-aliasing -D_mmitigate_rop_c   -mmitigate-rop -o CMakeFiles/cmTC_27f04.dir/src.c.o   -c /home/vagrant/slave/monero-static-ubuntu-amd64/build/build/release/CMakeFiles/CMakeTmp/src.c
cc: error: unrecognized command line option '-mmitigate-rop'
CMakeFiles/cmTC_27f04.dir/build.make:65: recipe for target 'CMakeFiles/cmTC_27f04.dir/src.c.o' failed
make[2]: *** [CMakeFiles/cmTC_27f04.dir/src.c.o] Error 1
make[2]: Leaving directory '/home/vagrant/slave/monero-static-ubuntu-amd64/build/build/release/CMakeFiles/CMakeTmp'
Makefile:126: recipe for target 'cmTC_27f04/fast' failed
make[1]: *** [cmTC_27f04/fast] Error 2
make[1]: Leaving directory '/home/vagrant/slave/monero-static-ubuntu-amd64/build/build/release/CMakeFiles/CMakeTmp'

Source file was:
int main(void) { return 0; }
Performing C++ SOURCE FILE Test _mmitigate_rop_cxx failed with the following output:
Change Dir: /home/vagrant/slave/monero-static-ubuntu-amd64/build/build/release/CMakeFiles/CMakeTmp

Run Build Command:"/usr/bin/make" "cmTC_588b4/fast"
make[1]: Entering directory '/home/vagrant/slave/monero-static-ubuntu-amd64/build/build/release/CMakeFiles/CMakeTmp'
/usr/bin/make -f CMakeFiles/cmTC_588b4.dir/build.make CMakeFiles/cmTC_588b4.dir/build
make[2]: Entering directory '/home/vagrant/slave/monero-static-ubuntu-amd64/build/build/release/CMakeFiles/CMakeTmp'
Building CXX object CMakeFiles/cmTC_588b4.dir/src.cxx.o
/usr/bin/c++    -I/usr/local/include/libusb-1.0  -DZMQ_STATIC -pthread -maes -march=x86-64 -fno-strict-aliasing -D_mmitigate_rop_cxx   -mmitigate-rop -o CMakeFiles/cmTC_588b4.dir/src.cxx.o -c /home/vagrant/slave/monero-static-ubuntu-amd64/build/build/release/CMakeFiles/CMakeTmp/src.cxx
c++: error: unrecognized command line option '-mmitigate-rop'
CMakeFiles/cmTC_588b4.dir/build.make:65: recipe for target 'CMakeFiles/cmTC_588b4.dir/src.cxx.o' failed
make[2]: *** [CMakeFiles/cmTC_588b4.dir/src.cxx.o] Error 1
make[2]: Leaving directory '/home/vagrant/slave/monero-static-ubuntu-amd64/build/build/release/CMakeFiles/CMakeTmp'
Makefile:126: recipe for target 'cmTC_588b4/fast' failed
make[1]: *** [cmTC_588b4/fast] Error 2
make[1]: Leaving directory '/home/vagrant/slave/monero-static-ubuntu-amd64/build/build/release/CMakeFiles/CMakeTmp'

Source file was:
int main() { return 0; }
Determining if the -Wl,-z,noexecheap linker flag is supported failed with the following output:
Change Dir: /home/vagrant/slave/monero-static-ubuntu-amd64/build/build/release/CMakeFiles/CMakeTmp

Run Build Command:"/usr/bin/make" "cmTC_8b2a8/fast"
make[1]: Entering directory '/home/vagrant/slave/monero-static-ubuntu-amd64/build/build/release/CMakeFiles/CMakeTmp'
/usr/bin/make -f CMakeFiles/cmTC_8b2a8.dir/build.make CMakeFiles/cmTC_8b2a8.dir/build
make[2]: Entering directory '/home/vagrant/slave/monero-static-ubuntu-amd64/build/build/release/CMakeFiles/CMakeTmp'
Building C object CMakeFiles/cmTC_8b2a8.dir/CheckLinkerFlag.c.o
/usr/bin/cc    -Wl,-z,noexecheap    -Wl,-z,noexecheap -o CMakeFiles/cmTC_8b2a8.dir/CheckLinkerFlag.c.o   -c /home/vagrant/slave/monero-static-ubuntu-amd64/build/cmake/CheckLinkerFlag.c
Linking C executable cmTC_8b2a8
/usr/bin/cmake -E cmake_link_script CMakeFiles/cmTC_8b2a8.dir/link.txt --verbose=1
/usr/bin/cc  -Wl,-z,noexecheap     CMakeFiles/cmTC_8b2a8.dir/CheckLinkerFlag.c.o  -o cmTC_8b2a8 -rdynamic 
/usr/bin/ld: warning: -z noexecheap ignored.
make[2]: Leaving directory '/home/vagrant/slave/monero-static-ubuntu-amd64/build/build/release/CMakeFiles/CMakeTmp'
make[1]: Leaving directory '/home/vagrant/slave/monero-static-ubuntu-amd64/build/build/release/CMakeFiles/CMakeTmp'


Determining if the function rl_copy_text exists failed with the following output:
Change Dir: /home/vagrant/slave/monero-static-ubuntu-amd64/build/build/release/CMakeFiles/CMakeTmp

Run Build Command:"/usr/bin/make" "cmTC_8fd24/fast"
make[1]: Entering directory '/home/vagrant/slave/monero-static-ubuntu-amd64/build/build/release/CMakeFiles/CMakeTmp'
/usr/bin/make -f CMakeFiles/cmTC_8fd24.dir/build.make CMakeFiles/cmTC_8fd24.dir/build
make[2]: Entering directory '/home/vagrant/slave/monero-static-ubuntu-amd64/build/build/release/CMakeFiles/CMakeTmp'
Building C object CMakeFiles/cmTC_8fd24.dir/CheckFunctionExists.c.o
/usr/bin/cc    -pthread -maes -march=x86-64 -fno-strict-aliasing -std=c11 -D_GNU_SOURCE   -Wall -Wextra -Wpointer-arith -Wundef -Wvla -Wwrite-strings -Wno-error=extra -Wno-error=deprecated-declarations -Wno-unused-parameter -Wno-unused-variable -Wno-error=unused-variable -Wno-error=undef -Wno-error=uninitialized -Wlogical-op -Wno-error=maybe-uninitialized -Wno-error=cpp -Waggregate-return -Wnested-externs -Wold-style-definition -Wstrict-prototypes  -fPIC  -Wformat -Wformat-security -fstack-protector -fstack-protector-strong -fno-strict-aliasing -DCHECK_FUNCTION_EXISTS=rl_copy_text   -o CMakeFiles/cmTC_8fd24.dir/CheckFunctionExists.c.o   -c /usr/share/cmake-3.5/Modules/CheckFunctionExists.c
/usr/share/cmake-3.5/Modules/CheckFunctionExists.c:6:1: warning: function declaration isn't a prototype [-Wstrict-prototypes]
 char CHECK_FUNCTION_EXISTS();
 ^
Linking C executable cmTC_8fd24
/usr/bin/cmake -E cmake_link_script CMakeFiles/cmTC_8fd24.dir/link.txt --verbose=1
/usr/bin/cc   -pthread -maes -march=x86-64 -fno-strict-aliasing -std=c11 -D_GNU_SOURCE   -Wall -Wextra -Wpointer-arith -Wundef -Wvla -Wwrite-strings -Wno-error=extra -Wno-error=deprecated-declarations -Wno-unused-parameter -Wno-unused-variable -Wno-error=unused-variable -Wno-error=undef -Wno-error=uninitialized -Wlogical-op -Wno-error=maybe-uninitialized -Wno-error=cpp -Waggregate-return -Wnested-externs -Wold-style-definition -Wstrict-prototypes  -fPIC  -Wformat -Wformat-security -fstack-protector -fstack-protector-strong -fno-strict-aliasing -DCHECK_FUNCTION_EXISTS=rl_copy_text    CMakeFiles/cmTC_8fd24.dir/CheckFunctionExists.c.o  -o cmTC_8fd24 -rdynamic /usr/lib/x86_64-linux-gnu/libreadline.a 
/usr/lib/x86_64-linux-gnu/libreadline.a(terminal.o): In function `_rl_get_screen_size':
(.text+0x283): undefined reference to `tgetnum'
/usr/lib/x86_64-linux-gnu/libreadline.a(terminal.o): In function `_rl_get_screen_size':
(.text+0x303): undefined reference to `tgetnum'
/usr/lib/x86_64-linux-gnu/libreadline.a(terminal.o): In function `_rl_init_terminal_io':
(.text+0x6fa): undefined reference to `PC'
/usr/lib/x86_64-linux-gnu/libreadline.a(terminal.o): In function `_rl_init_terminal_io':
(.text+0x70e): undefined reference to `BC'
/usr/lib/x86_64-linux-gnu/libreadline.a(terminal.o): In function `_rl_init_terminal_io':
(.text+0x718): undefined reference to `UP'
/usr/lib/x86_64-linux-gnu/libreadline.a(terminal.o): In function `_rl_init_terminal_io':
(.text+0x7a8): undefined reference to `tgetent'
/usr/lib/x86_64-linux-gnu/libreadline.a(terminal.o): In function `_rl_init_terminal_io':
(.text+0x7e7): undefined reference to `tgetstr'
/usr/lib/x86_64-linux-gnu/libreadline.a(terminal.o): In function `_rl_init_terminal_io':
(.text+0x817): undefined reference to `PC'
/usr/lib/x86_64-linux-gnu/libreadline.a(terminal.o): In function `_rl_init_terminal_io':
(.text+0x82e): undefined reference to `BC'
/usr/lib/x86_64-linux-gnu/libreadline.a(terminal.o): In function `_rl_init_terminal_io':
(.text+0x842): undefined reference to `UP'
/usr/lib/x86_64-linux-gnu/libreadline.a(terminal.o): In function `_rl_init_terminal_io':
(.text+0x857): undefined reference to `tgetflag'
/usr/lib/x86_64-linux-gnu/libreadline.a(terminal.o): In function `_rl_init_terminal_io':
(.text+0x8b1): undefined reference to `tgetflag'
/usr/lib/x86_64-linux-gnu/libreadline.a(terminal.o): In function `_rl_init_terminal_io':
(.text+0x91f): undefined reference to `tgetflag'
/usr/lib/x86_64-linux-gnu/libreadline.a(terminal.o): In function `_rl_init_terminal_io':
(.text+0x9fb): undefined reference to `tgetent'
/usr/lib/x86_64-linux-gnu/libreadline.a(terminal.o): In function `_rl_backspace':
(.text+0xc00): undefined reference to `tputs'
/usr/lib/x86_64-linux-gnu/libreadline.a(terminal.o): In function `rl_ding':
(.text+0xcaa): undefined reference to `tputs'
/usr/lib/x86_64-linux-gnu/libreadline.a(terminal.o): In function `_rl_enable_meta_key':
(.text+0xd17): undefined reference to `tputs'
/usr/lib/x86_64-linux-gnu/libreadline.a(terminal.o): In function `_rl_disable_meta_key':
(.text+0xd69): undefined reference to `tputs'
/usr/lib/x86_64-linux-gnu/libreadline.a(terminal.o): In function `_rl_control_keypad':
(.text+0xd9d): undefined reference to `tputs'
/usr/lib/x86_64-linux-gnu/libreadline.a(terminal.o):(.text+0xdf0): more undefined references to `tputs' follow
/usr/lib/x86_64-linux-gnu/libreadline.a(display.o): In function `update_line':
(.text+0x238e): undefined reference to `tgoto'
/usr/lib/x86_64-linux-gnu/libreadline.a(display.o): In function `update_line':
(.text+0x23a2): undefined reference to `tputs'
/usr/lib/x86_64-linux-gnu/libreadline.a(display.o): In function `update_line':
(.text+0x2520): undefined reference to `tputs'
/usr/lib/x86_64-linux-gnu/libreadline.a(display.o): In function `update_line':
(.text+0x2d49): undefined reference to `tputs'
/usr/lib/x86_64-linux-gnu/libreadline.a(display.o): In function `update_line':
(.text+0x2e7a): undefined reference to `tgoto'
/usr/lib/x86_64-linux-gnu/libreadline.a(display.o): In function `update_line':
(.text+0x2e8c): undefined reference to `tputs'
/usr/lib/x86_64-linux-gnu/libreadline.a(display.o): In function `update_line':
(.text+0x3056): undefined reference to `tputs'
/usr/lib/x86_64-linux-gnu/libreadline.a(display.o): In function `update_line':
(.text+0x309f): undefined reference to `tputs'
/usr/lib/x86_64-linux-gnu/libreadline.a(display.o): In function `update_line':
(.text+0x30d1): undefined reference to `tputs'
/usr/lib/x86_64-linux-gnu/libreadline.a(display.o): In function `rl_redisplay':
(.text+0x4813): undefined reference to `tputs'
/usr/lib/x86_64-linux-gnu/libreadline.a(display.o):(.text+0x4b2a): more undefined references to `tputs' follow
collect2: error: ld returned 1 exit status
CMakeFiles/cmTC_8fd24.dir/build.make:98: recipe for target 'cmTC_8fd24' failed
make[2]: *** [cmTC_8fd24] Error 1
make[2]: Leaving directory '/home/vagrant/slave/monero-static-ubuntu-amd64/build/build/release/CMakeFiles/CMakeTmp'
Makefile:126: recipe for target 'cmTC_8fd24/fast' failed
make[1]: *** [cmTC_8fd24/fast] Error 2
make[1]: Leaving directory '/home/vagrant/slave/monero-static-ubuntu-amd64/build/build/release/CMakeFiles/CMakeTmp'


Determining if the function rl_filename_completion_function exists failed with the following output:
Change Dir: /home/vagrant/slave/monero-static-ubuntu-amd64/build/build/release/CMakeFiles/CMakeTmp

Run Build Command:"/usr/bin/make" "cmTC_980fc/fast"
make[1]: Entering directory '/home/vagrant/slave/monero-static-ubuntu-amd64/build/build/release/CMakeFiles/CMakeTmp'
/usr/bin/make -f CMakeFiles/cmTC_980fc.dir/build.make CMakeFiles/cmTC_980fc.dir/build
make[2]: Entering directory '/home/vagrant/slave/monero-static-ubuntu-amd64/build/build/release/CMakeFiles/CMakeTmp'
Building C object CMakeFiles/cmTC_980fc.dir/CheckFunctionExists.c.o
/usr/bin/cc    -pthread -maes -march=x86-64 -fno-strict-aliasing -std=c11 -D_GNU_SOURCE   -Wall -Wextra -Wpointer-arith -Wundef -Wvla -Wwrite-strings -Wno-error=extra -Wno-error=deprecated-declarations -Wno-unused-parameter -Wno-unused-variable -Wno-error=unused-variable -Wno-error=undef -Wno-error=uninitialized -Wlogical-op -Wno-error=maybe-uninitialized -Wno-error=cpp -Waggregate-return -Wnested-externs -Wold-style-definition -Wstrict-prototypes  -fPIC  -Wformat -Wformat-security -fstack-protector -fstack-protector-strong -fno-strict-aliasing -DCHECK_FUNCTION_EXISTS=rl_filename_completion_function   -o CMakeFiles/cmTC_980fc.dir/CheckFunctionExists.c.o   -c /usr/share/cmake-3.5/Modules/CheckFunctionExists.c
/usr/share/cmake-3.5/Modules/CheckFunctionExists.c:6:1: warning: function declaration isn't a prototype [-Wstrict-prototypes]
 char CHECK_FUNCTION_EXISTS();
 ^
Linking C executable cmTC_980fc
/usr/bin/cmake -E cmake_link_script CMakeFiles/cmTC_980fc.dir/link.txt --verbose=1
/usr/bin/cc   -pthread -maes -march=x86-64 -fno-strict-aliasing -std=c11 -D_GNU_SOURCE   -Wall -Wextra -Wpointer-arith -Wundef -Wvla -Wwrite-strings -Wno-error=extra -Wno-error=deprecated-declarations -Wno-unused-parameter -Wno-unused-variable -Wno-error=unused-variable -Wno-error=undef -Wno-error=uninitialized -Wlogical-op -Wno-error=maybe-uninitialized -Wno-error=cpp -Waggregate-return -Wnested-externs -Wold-style-definition -Wstrict-prototypes  -fPIC  -Wformat -Wformat-security -fstack-protector -fstack-protector-strong -fno-strict-aliasing -DCHECK_FUNCTION_EXISTS=rl_filename_completion_function    CMakeFiles/cmTC_980fc.dir/CheckFunctionExists.c.o  -o cmTC_980fc -rdynamic /usr/lib/x86_64-linux-gnu/libreadline.a 
/usr/lib/x86_64-linux-gnu/libreadline.a(display.o): In function `_rl_move_cursor_relative':
(.text+0xecc): undefined reference to `tputs'
/usr/lib/x86_64-linux-gnu/libreadline.a(display.o): In function `_rl_move_cursor_relative':
(.text+0xf2e): undefined reference to `tputs'
/usr/lib/x86_64-linux-gnu/libreadline.a(display.o): In function `_rl_move_cursor_relative':
(.text+0x1021): undefined reference to `tputs'
/usr/lib/x86_64-linux-gnu/libreadline.a(display.o): In function `_rl_move_vert':
(.text+0x10cc): undefined reference to `tputs'
/usr/lib/x86_64-linux-gnu/libreadline.a(display.o): In function `_rl_move_vert':
(.text+0x1128): undefined reference to `tputs'
/usr/lib/x86_64-linux-gnu/libreadline.a(display.o): In function `update_line':
(.text+0x238e): undefined reference to `tgoto'
/usr/lib/x86_64-linux-gnu/libreadline.a(display.o): In function `update_line':
(.text+0x23a2): undefined reference to `tputs'
/usr/lib/x86_64-linux-gnu/libreadline.a(display.o): In function `update_line':
(.text+0x2520): undefined reference to `tputs'
/usr/lib/x86_64-linux-gnu/libreadline.a(display.o): In function `update_line':
(.text+0x2d49): undefined reference to `tputs'
/usr/lib/x86_64-linux-gnu/libreadline.a(display.o): In function `update_line':
(.text+0x2e7a): undefined reference to `tgoto'
/usr/lib/x86_64-linux-gnu/libreadline.a(display.o): In function `update_line':
(.text+0x2e8c): undefined reference to `tputs'
/usr/lib/x86_64-linux-gnu/libreadline.a(display.o): In function `update_line':
(.text+0x3056): undefined reference to `tputs'
/usr/lib/x86_64-linux-gnu/libreadline.a(display.o): In function `update_line':
(.text+0x309f): undefined reference to `tputs'
/usr/lib/x86_64-linux-gnu/libreadline.a(display.o): In function `update_line':
(.text+0x30d1): undefined reference to `tputs'
/usr/lib/x86_64-linux-gnu/libreadline.a(display.o): In function `rl_redisplay':
(.text+0x4813): undefined reference to `tputs'
/usr/lib/x86_64-linux-gnu/libreadline.a(display.o):(.text+0x4b2a): more undefined references to `tputs' follow
/usr/lib/x86_64-linux-gnu/libreadline.a(terminal.o): In function `_rl_get_screen_size':
(.text+0x283): undefined reference to `tgetnum'
/usr/lib/x86_64-linux-gnu/libreadline.a(terminal.o): In function `_rl_get_screen_size':
(.text+0x303): undefined reference to `tgetnum'
/usr/lib/x86_64-linux-gnu/libreadline.a(terminal.o): In function `_rl_init_terminal_io':
(.text+0x6fa): undefined reference to `PC'
/usr/lib/x86_64-linux-gnu/libreadline.a(terminal.o): In function `_rl_init_terminal_io':
(.text+0x70e): undefined reference to `BC'
/usr/lib/x86_64-linux-gnu/libreadline.a(terminal.o): In function `_rl_init_terminal_io':
(.text+0x718): undefined reference to `UP'
/usr/lib/x86_64-linux-gnu/libreadline.a(terminal.o): In function `_rl_init_terminal_io':
(.text+0x7a8): undefined reference to `tgetent'
/usr/lib/x86_64-linux-gnu/libreadline.a(terminal.o): In function `_rl_init_terminal_io':
(.text+0x7e7): undefined reference to `tgetstr'
/usr/lib/x86_64-linux-gnu/libreadline.a(terminal.o): In function `_rl_init_terminal_io':
(.text+0x817): undefined reference to `PC'
/usr/lib/x86_64-linux-gnu/libreadline.a(terminal.o): In function `_rl_init_terminal_io':
(.text+0x82e): undefined reference to `BC'
/usr/lib/x86_64-linux-gnu/libreadline.a(terminal.o): In function `_rl_init_terminal_io':
(.text+0x842): undefined reference to `UP'
/usr/lib/x86_64-linux-gnu/libreadline.a(terminal.o): In function `_rl_init_terminal_io':
(.text+0x857): undefined reference to `tgetflag'
/usr/lib/x86_64-linux-gnu/libreadline.a(terminal.o): In function `_rl_init_terminal_io':
(.text+0x8b1): undefined reference to `tgetflag'
/usr/lib/x86_64-linux-gnu/libreadline.a(terminal.o): In function `_rl_init_terminal_io':
(.text+0x91f): undefined reference to `tgetflag'
/usr/lib/x86_64-linux-gnu/libreadline.a(terminal.o): In function `_rl_init_terminal_io':
(.text+0x9fb): undefined reference to `tgetent'
/usr/lib/x86_64-linux-gnu/libreadline.a(terminal.o): In function `_rl_backspace':
(.text+0xc00): undefined reference to `tputs'
/usr/lib/x86_64-linux-gnu/libreadline.a(terminal.o): In function `rl_ding':
(.text+0xcaa): undefined reference to `tputs'
/usr/lib/x86_64-linux-gnu/libreadline.a(terminal.o): In function `_rl_enable_meta_key':
(.text+0xd17): undefined reference to `tputs'
/usr/lib/x86_64-linux-gnu/libreadline.a(terminal.o): In function `_rl_disable_meta_key':
(.text+0xd69): undefined reference to `tputs'
/usr/lib/x86_64-linux-gnu/libreadline.a(terminal.o): In function `_rl_control_keypad':
(.text+0xd9d): undefined reference to `tputs'
/usr/lib/x86_64-linux-gnu/libreadline.a(terminal.o):(.text+0xdf0): more undefined references to `tputs' follow
collect2: error: ld returned 1 exit status
CMakeFiles/cmTC_980fc.dir/build.make:98: recipe for target 'cmTC_980fc' failed
make[2]: *** [cmTC_980fc] Error 1
make[2]: Leaving directory '/home/vagrant/slave/monero-static-ubuntu-amd64/build/build/release/CMakeFiles/CMakeTmp'
Makefile:126: recipe for target 'cmTC_980fc/fast' failed
make[1]: *** [cmTC_980fc/fast] Error 2
make[1]: Leaving directory '/home/vagrant/slave/monero-static-ubuntu-amd64/build/build/release/CMakeFiles/CMakeTmp'