(view as text)
Determining if the pthread_create exist failed with the following output:
Change Dir: /home/vagrant/slave/monero-static-ubuntu-amd64/build/build/release/CMakeFiles/CMakeTmp

Run Build Command:"/usr/bin/make" "cmTC_b7f55/fast"
make[1]: Entering directory '/home/vagrant/slave/monero-static-ubuntu-amd64/build/build/release/CMakeFiles/CMakeTmp'
/usr/bin/make -f CMakeFiles/cmTC_b7f55.dir/build.make CMakeFiles/cmTC_b7f55.dir/build
make[2]: Entering directory '/home/vagrant/slave/monero-static-ubuntu-amd64/build/build/release/CMakeFiles/CMakeTmp'
Building C object CMakeFiles/cmTC_b7f55.dir/CheckSymbolExists.c.o
/usr/bin/cc     -o CMakeFiles/cmTC_b7f55.dir/CheckSymbolExists.c.o   -c /home/vagrant/slave/monero-static-ubuntu-amd64/build/build/release/CMakeFiles/CMakeTmp/CheckSymbolExists.c
Linking C executable cmTC_b7f55
/usr/bin/cmake -E cmake_link_script CMakeFiles/cmTC_b7f55.dir/link.txt --verbose=1
/usr/bin/cc       CMakeFiles/cmTC_b7f55.dir/CheckSymbolExists.c.o  -o cmTC_b7f55 -rdynamic 
CMakeFiles/cmTC_b7f55.dir/CheckSymbolExists.c.o: In function `main':
CheckSymbolExists.c:(.text+0x16): undefined reference to `pthread_create'
collect2: error: ld returned 1 exit status
CMakeFiles/cmTC_b7f55.dir/build.make:97: recipe for target 'cmTC_b7f55' failed
make[2]: *** [cmTC_b7f55] Error 1
make[2]: Leaving directory '/home/vagrant/slave/monero-static-ubuntu-amd64/build/build/release/CMakeFiles/CMakeTmp'
Makefile:126: recipe for target 'cmTC_b7f55/fast' failed
make[1]: *** [cmTC_b7f55/fast] Error 2
make[1]: Leaving directory '/home/vagrant/slave/monero-static-ubuntu-amd64/build/build/release/CMakeFiles/CMakeTmp'

File /home/vagrant/slave/monero-static-ubuntu-amd64/build/build/release/CMakeFiles/CMakeTmp/CheckSymbolExists.c:
/* */
#include <pthread.h>

int main(int argc, char** argv)
{
  (void)argv;
#ifndef pthread_create
  return ((int*)(&pthread_create))[argc];
#else
  (void)argc;
  return 0;
#endif
}

Determining if the function memset_s exists in the c failed with the following output:
Change Dir: /home/vagrant/slave/monero-static-ubuntu-amd64/build/build/release/CMakeFiles/CMakeTmp

Run Build Command:"/usr/bin/make" "cmTC_0e2a6/fast"
make[1]: Entering directory '/home/vagrant/slave/monero-static-ubuntu-amd64/build/build/release/CMakeFiles/CMakeTmp'
/usr/bin/make -f CMakeFiles/cmTC_0e2a6.dir/build.make CMakeFiles/cmTC_0e2a6.dir/build
make[2]: Entering directory '/home/vagrant/slave/monero-static-ubuntu-amd64/build/build/release/CMakeFiles/CMakeTmp'
Building C object CMakeFiles/cmTC_0e2a6.dir/CheckFunctionExists.c.o
/usr/bin/cc    -pthread -DCHECK_FUNCTION_EXISTS=memset_s   -o CMakeFiles/cmTC_0e2a6.dir/CheckFunctionExists.c.o   -c /usr/share/cmake-3.5/Modules/CheckFunctionExists.c
Linking C executable cmTC_0e2a6
/usr/bin/cmake -E cmake_link_script CMakeFiles/cmTC_0e2a6.dir/link.txt --verbose=1
/usr/bin/cc   -pthread -DCHECK_FUNCTION_EXISTS=memset_s    CMakeFiles/cmTC_0e2a6.dir/CheckFunctionExists.c.o  -o cmTC_0e2a6  -L/home/vagrant/slave/monero-static-ubuntu-amd64/build/build/release/CMakeFiles/CMakeTmp/string.h -rdynamic -lc -Wl,-rpath,/home/vagrant/slave/monero-static-ubuntu-amd64/build/build/release/CMakeFiles/CMakeTmp/string.h 
CMakeFiles/cmTC_0e2a6.dir/CheckFunctionExists.c.o: In function `main':
CheckFunctionExists.c:(.text+0x15): undefined reference to `memset_s'
collect2: error: ld returned 1 exit status
CMakeFiles/cmTC_0e2a6.dir/build.make:97: recipe for target 'cmTC_0e2a6' failed
make[2]: *** [cmTC_0e2a6] Error 1
make[2]: Leaving directory '/home/vagrant/slave/monero-static-ubuntu-amd64/build/build/release/CMakeFiles/CMakeTmp'
Makefile:126: recipe for target 'cmTC_0e2a6/fast' failed
make[1]: *** [cmTC_0e2a6/fast] Error 2
make[1]: Leaving directory '/home/vagrant/slave/monero-static-ubuntu-amd64/build/build/release/CMakeFiles/CMakeTmp'


Determining if the function explicit_bzero exists in the c failed with the following output:
Change Dir: /home/vagrant/slave/monero-static-ubuntu-amd64/build/build/release/CMakeFiles/CMakeTmp

Run Build Command:"/usr/bin/make" "cmTC_dbea3/fast"
make[1]: Entering directory '/home/vagrant/slave/monero-static-ubuntu-amd64/build/build/release/CMakeFiles/CMakeTmp'
/usr/bin/make -f CMakeFiles/cmTC_dbea3.dir/build.make CMakeFiles/cmTC_dbea3.dir/build
make[2]: Entering directory '/home/vagrant/slave/monero-static-ubuntu-amd64/build/build/release/CMakeFiles/CMakeTmp'
Building C object CMakeFiles/cmTC_dbea3.dir/CheckFunctionExists.c.o
/usr/bin/cc    -pthread -DCHECK_FUNCTION_EXISTS=explicit_bzero   -o CMakeFiles/cmTC_dbea3.dir/CheckFunctionExists.c.o   -c /usr/share/cmake-3.5/Modules/CheckFunctionExists.c
Linking C executable cmTC_dbea3
/usr/bin/cmake -E cmake_link_script CMakeFiles/cmTC_dbea3.dir/link.txt --verbose=1
/usr/bin/cc   -pthread -DCHECK_FUNCTION_EXISTS=explicit_bzero    CMakeFiles/cmTC_dbea3.dir/CheckFunctionExists.c.o  -o cmTC_dbea3  -L/home/vagrant/slave/monero-static-ubuntu-amd64/build/build/release/CMakeFiles/CMakeTmp/strings.h -rdynamic -lc -Wl,-rpath,/home/vagrant/slave/monero-static-ubuntu-amd64/build/build/release/CMakeFiles/CMakeTmp/strings.h 
CMakeFiles/cmTC_dbea3.dir/CheckFunctionExists.c.o: In function `main':
CheckFunctionExists.c:(.text+0x15): undefined reference to `explicit_bzero'
collect2: error: ld returned 1 exit status
CMakeFiles/cmTC_dbea3.dir/build.make:97: recipe for target 'cmTC_dbea3' failed
make[2]: *** [cmTC_dbea3] Error 1
make[2]: Leaving directory '/home/vagrant/slave/monero-static-ubuntu-amd64/build/build/release/CMakeFiles/CMakeTmp'
Makefile:126: recipe for target 'cmTC_dbea3/fast' failed
make[1]: *** [cmTC_dbea3/fast] Error 2
make[1]: Leaving directory '/home/vagrant/slave/monero-static-ubuntu-amd64/build/build/release/CMakeFiles/CMakeTmp'


Determining if the include file iphlpapi.h exists failed with the following output:
Change Dir: /home/vagrant/slave/monero-static-ubuntu-amd64/build/build/release/CMakeFiles/CMakeTmp

Run Build Command:"/usr/bin/make" "cmTC_c0c6c/fast"
make[1]: Entering directory '/home/vagrant/slave/monero-static-ubuntu-amd64/build/build/release/CMakeFiles/CMakeTmp'
/usr/bin/make -f CMakeFiles/cmTC_c0c6c.dir/build.make CMakeFiles/cmTC_c0c6c.dir/build
make[2]: Entering directory '/home/vagrant/slave/monero-static-ubuntu-amd64/build/build/release/CMakeFiles/CMakeTmp'
Building C object CMakeFiles/cmTC_c0c6c.dir/CheckIncludeFile.c.o
/usr/bin/cc    -pthread    -o CMakeFiles/cmTC_c0c6c.dir/CheckIncludeFile.c.o   -c /home/vagrant/slave/monero-static-ubuntu-amd64/build/build/release/CMakeFiles/CMakeTmp/CheckIncludeFile.c
/home/vagrant/slave/monero-static-ubuntu-amd64/build/build/release/CMakeFiles/CMakeTmp/CheckIncludeFile.c:1:22: fatal error: iphlpapi.h: No such file or directory
compilation terminated.
CMakeFiles/cmTC_c0c6c.dir/build.make:65: recipe for target 'CMakeFiles/cmTC_c0c6c.dir/CheckIncludeFile.c.o' failed
make[2]: *** [CMakeFiles/cmTC_c0c6c.dir/CheckIncludeFile.c.o] Error 1
make[2]: Leaving directory '/home/vagrant/slave/monero-static-ubuntu-amd64/build/build/release/CMakeFiles/CMakeTmp'
Makefile:126: recipe for target 'cmTC_c0c6c/fast' failed
make[1]: *** [cmTC_c0c6c/fast] Error 2
make[1]: Leaving directory '/home/vagrant/slave/monero-static-ubuntu-amd64/build/build/release/CMakeFiles/CMakeTmp'


Determining if the include file login_cap.h exists failed with the following output:
Change Dir: /home/vagrant/slave/monero-static-ubuntu-amd64/build/build/release/CMakeFiles/CMakeTmp

Run Build Command:"/usr/bin/make" "cmTC_cc0a6/fast"
make[1]: Entering directory '/home/vagrant/slave/monero-static-ubuntu-amd64/build/build/release/CMakeFiles/CMakeTmp'
/usr/bin/make -f CMakeFiles/cmTC_cc0a6.dir/build.make CMakeFiles/cmTC_cc0a6.dir/build
make[2]: Entering directory '/home/vagrant/slave/monero-static-ubuntu-amd64/build/build/release/CMakeFiles/CMakeTmp'
Building C object CMakeFiles/cmTC_cc0a6.dir/CheckIncludeFile.c.o
/usr/bin/cc    -pthread    -o CMakeFiles/cmTC_cc0a6.dir/CheckIncludeFile.c.o   -c /home/vagrant/slave/monero-static-ubuntu-amd64/build/build/release/CMakeFiles/CMakeTmp/CheckIncludeFile.c
/home/vagrant/slave/monero-static-ubuntu-amd64/build/build/release/CMakeFiles/CMakeTmp/CheckIncludeFile.c:1:23: fatal error: login_cap.h: No such file or directory
compilation terminated.
CMakeFiles/cmTC_cc0a6.dir/build.make:65: recipe for target 'CMakeFiles/cmTC_cc0a6.dir/CheckIncludeFile.c.o' failed
make[2]: *** [CMakeFiles/cmTC_cc0a6.dir/CheckIncludeFile.c.o] Error 1
make[2]: Leaving directory '/home/vagrant/slave/monero-static-ubuntu-amd64/build/build/release/CMakeFiles/CMakeTmp'
Makefile:126: recipe for target 'cmTC_cc0a6/fast' failed
make[1]: *** [cmTC_cc0a6/fast] Error 2
make[1]: Leaving directory '/home/vagrant/slave/monero-static-ubuntu-amd64/build/build/release/CMakeFiles/CMakeTmp'


Determining if the include file sys/sha2.h exists failed with the following output:
Change Dir: /home/vagrant/slave/monero-static-ubuntu-amd64/build/build/release/CMakeFiles/CMakeTmp

Run Build Command:"/usr/bin/make" "cmTC_f9be8/fast"
make[1]: Entering directory '/home/vagrant/slave/monero-static-ubuntu-amd64/build/build/release/CMakeFiles/CMakeTmp'
/usr/bin/make -f CMakeFiles/cmTC_f9be8.dir/build.make CMakeFiles/cmTC_f9be8.dir/build
make[2]: Entering directory '/home/vagrant/slave/monero-static-ubuntu-amd64/build/build/release/CMakeFiles/CMakeTmp'
Building C object CMakeFiles/cmTC_f9be8.dir/CheckIncludeFile.c.o
/usr/bin/cc    -pthread    -o CMakeFiles/cmTC_f9be8.dir/CheckIncludeFile.c.o   -c /home/vagrant/slave/monero-static-ubuntu-amd64/build/build/release/CMakeFiles/CMakeTmp/CheckIncludeFile.c
/home/vagrant/slave/monero-static-ubuntu-amd64/build/build/release/CMakeFiles/CMakeTmp/CheckIncludeFile.c:1:22: fatal error: sys/sha2.h: No such file or directory
compilation terminated.
CMakeFiles/cmTC_f9be8.dir/build.make:65: recipe for target 'CMakeFiles/cmTC_f9be8.dir/CheckIncludeFile.c.o' failed
make[2]: *** [CMakeFiles/cmTC_f9be8.dir/CheckIncludeFile.c.o] Error 1
make[2]: Leaving directory '/home/vagrant/slave/monero-static-ubuntu-amd64/build/build/release/CMakeFiles/CMakeTmp'
Makefile:126: recipe for target 'cmTC_f9be8/fast' failed
make[1]: *** [cmTC_f9be8/fast] Error 2
make[1]: Leaving directory '/home/vagrant/slave/monero-static-ubuntu-amd64/build/build/release/CMakeFiles/CMakeTmp'


Determining if the include file vfork.h exists failed with the following output:
Change Dir: /home/vagrant/slave/monero-static-ubuntu-amd64/build/build/release/CMakeFiles/CMakeTmp

Run Build Command:"/usr/bin/make" "cmTC_ca73f/fast"
make[1]: Entering directory '/home/vagrant/slave/monero-static-ubuntu-amd64/build/build/release/CMakeFiles/CMakeTmp'
/usr/bin/make -f CMakeFiles/cmTC_ca73f.dir/build.make CMakeFiles/cmTC_ca73f.dir/build
make[2]: Entering directory '/home/vagrant/slave/monero-static-ubuntu-amd64/build/build/release/CMakeFiles/CMakeTmp'
Building C object CMakeFiles/cmTC_ca73f.dir/CheckIncludeFile.c.o
/usr/bin/cc    -pthread    -o CMakeFiles/cmTC_ca73f.dir/CheckIncludeFile.c.o   -c /home/vagrant/slave/monero-static-ubuntu-amd64/build/build/release/CMakeFiles/CMakeTmp/CheckIncludeFile.c
/home/vagrant/slave/monero-static-ubuntu-amd64/build/build/release/CMakeFiles/CMakeTmp/CheckIncludeFile.c:1:19: fatal error: vfork.h: No such file or directory
compilation terminated.
CMakeFiles/cmTC_ca73f.dir/build.make:65: recipe for target 'CMakeFiles/cmTC_ca73f.dir/CheckIncludeFile.c.o' failed
make[2]: *** [CMakeFiles/cmTC_ca73f.dir/CheckIncludeFile.c.o] Error 1
make[2]: Leaving directory '/home/vagrant/slave/monero-static-ubuntu-amd64/build/build/release/CMakeFiles/CMakeTmp'
Makefile:126: recipe for target 'cmTC_ca73f/fast' failed
make[1]: *** [cmTC_ca73f/fast] Error 2
make[1]: Leaving directory '/home/vagrant/slave/monero-static-ubuntu-amd64/build/build/release/CMakeFiles/CMakeTmp'


Determining if the include file windows.h exists failed with the following output:
Change Dir: /home/vagrant/slave/monero-static-ubuntu-amd64/build/build/release/CMakeFiles/CMakeTmp

Run Build Command:"/usr/bin/make" "cmTC_56863/fast"
make[1]: Entering directory '/home/vagrant/slave/monero-static-ubuntu-amd64/build/build/release/CMakeFiles/CMakeTmp'
/usr/bin/make -f CMakeFiles/cmTC_56863.dir/build.make CMakeFiles/cmTC_56863.dir/build
make[2]: Entering directory '/home/vagrant/slave/monero-static-ubuntu-amd64/build/build/release/CMakeFiles/CMakeTmp'
Building C object CMakeFiles/cmTC_56863.dir/CheckIncludeFile.c.o
/usr/bin/cc    -pthread    -o CMakeFiles/cmTC_56863.dir/CheckIncludeFile.c.o   -c /home/vagrant/slave/monero-static-ubuntu-amd64/build/build/release/CMakeFiles/CMakeTmp/CheckIncludeFile.c
/home/vagrant/slave/monero-static-ubuntu-amd64/build/build/release/CMakeFiles/CMakeTmp/CheckIncludeFile.c:1:21: fatal error: windows.h: No such file or directory
compilation terminated.
CMakeFiles/cmTC_56863.dir/build.make:65: recipe for target 'CMakeFiles/cmTC_56863.dir/CheckIncludeFile.c.o' failed
make[2]: *** [CMakeFiles/cmTC_56863.dir/CheckIncludeFile.c.o] Error 1
make[2]: Leaving directory '/home/vagrant/slave/monero-static-ubuntu-amd64/build/build/release/CMakeFiles/CMakeTmp'
Makefile:126: recipe for target 'cmTC_56863/fast' failed
make[1]: *** [cmTC_56863/fast] Error 2
make[1]: Leaving directory '/home/vagrant/slave/monero-static-ubuntu-amd64/build/build/release/CMakeFiles/CMakeTmp'


Determining if the include file winsock2.h exists failed with the following output:
Change Dir: /home/vagrant/slave/monero-static-ubuntu-amd64/build/build/release/CMakeFiles/CMakeTmp

Run Build Command:"/usr/bin/make" "cmTC_b7ad2/fast"
make[1]: Entering directory '/home/vagrant/slave/monero-static-ubuntu-amd64/build/build/release/CMakeFiles/CMakeTmp'
/usr/bin/make -f CMakeFiles/cmTC_b7ad2.dir/build.make CMakeFiles/cmTC_b7ad2.dir/build
make[2]: Entering directory '/home/vagrant/slave/monero-static-ubuntu-amd64/build/build/release/CMakeFiles/CMakeTmp'
Building C object CMakeFiles/cmTC_b7ad2.dir/CheckIncludeFile.c.o
/usr/bin/cc    -pthread    -o CMakeFiles/cmTC_b7ad2.dir/CheckIncludeFile.c.o   -c /home/vagrant/slave/monero-static-ubuntu-amd64/build/build/release/CMakeFiles/CMakeTmp/CheckIncludeFile.c
/home/vagrant/slave/monero-static-ubuntu-amd64/build/build/release/CMakeFiles/CMakeTmp/CheckIncludeFile.c:1:22: fatal error: winsock2.h: No such file or directory
compilation terminated.
CMakeFiles/cmTC_b7ad2.dir/build.make:65: recipe for target 'CMakeFiles/cmTC_b7ad2.dir/CheckIncludeFile.c.o' failed
make[2]: *** [CMakeFiles/cmTC_b7ad2.dir/CheckIncludeFile.c.o] Error 1
make[2]: Leaving directory '/home/vagrant/slave/monero-static-ubuntu-amd64/build/build/release/CMakeFiles/CMakeTmp'
Makefile:126: recipe for target 'cmTC_b7ad2/fast' failed
make[1]: *** [cmTC_b7ad2/fast] Error 2
make[1]: Leaving directory '/home/vagrant/slave/monero-static-ubuntu-amd64/build/build/release/CMakeFiles/CMakeTmp'


Determining if the include file ws2tcpip.h exists failed with the following output:
Change Dir: /home/vagrant/slave/monero-static-ubuntu-amd64/build/build/release/CMakeFiles/CMakeTmp

Run Build Command:"/usr/bin/make" "cmTC_44df3/fast"
make[1]: Entering directory '/home/vagrant/slave/monero-static-ubuntu-amd64/build/build/release/CMakeFiles/CMakeTmp'
/usr/bin/make -f CMakeFiles/cmTC_44df3.dir/build.make CMakeFiles/cmTC_44df3.dir/build
make[2]: Entering directory '/home/vagrant/slave/monero-static-ubuntu-amd64/build/build/release/CMakeFiles/CMakeTmp'
Building C object CMakeFiles/cmTC_44df3.dir/CheckIncludeFile.c.o
/usr/bin/cc    -pthread    -o CMakeFiles/cmTC_44df3.dir/CheckIncludeFile.c.o   -c /home/vagrant/slave/monero-static-ubuntu-amd64/build/build/release/CMakeFiles/CMakeTmp/CheckIncludeFile.c
/home/vagrant/slave/monero-static-ubuntu-amd64/build/build/release/CMakeFiles/CMakeTmp/CheckIncludeFile.c:1:22: fatal error: ws2tcpip.h: No such file or directory
compilation terminated.
CMakeFiles/cmTC_44df3.dir/build.make:65: recipe for target 'CMakeFiles/cmTC_44df3.dir/CheckIncludeFile.c.o' failed
make[2]: *** [CMakeFiles/cmTC_44df3.dir/CheckIncludeFile.c.o] Error 1
make[2]: Leaving directory '/home/vagrant/slave/monero-static-ubuntu-amd64/build/build/release/CMakeFiles/CMakeTmp'
Makefile:126: recipe for target 'cmTC_44df3/fast' failed
make[1]: *** [cmTC_44df3/fast] Error 2
make[1]: Leaving directory '/home/vagrant/slave/monero-static-ubuntu-amd64/build/build/release/CMakeFiles/CMakeTmp'


Determining if the function _beginthreadex exists failed with the following output:
Change Dir: /home/vagrant/slave/monero-static-ubuntu-amd64/build/build/release/CMakeFiles/CMakeTmp

Run Build Command:"/usr/bin/make" "cmTC_e2cef/fast"
make[1]: Entering directory '/home/vagrant/slave/monero-static-ubuntu-amd64/build/build/release/CMakeFiles/CMakeTmp'
/usr/bin/make -f CMakeFiles/cmTC_e2cef.dir/build.make CMakeFiles/cmTC_e2cef.dir/build
make[2]: Entering directory '/home/vagrant/slave/monero-static-ubuntu-amd64/build/build/release/CMakeFiles/CMakeTmp'
Building C object CMakeFiles/cmTC_e2cef.dir/CheckFunctionExists.c.o
/usr/bin/cc    -pthread -DCHECK_FUNCTION_EXISTS=_beginthreadex   -o CMakeFiles/cmTC_e2cef.dir/CheckFunctionExists.c.o   -c /usr/share/cmake-3.5/Modules/CheckFunctionExists.c
Linking C executable cmTC_e2cef
/usr/bin/cmake -E cmake_link_script CMakeFiles/cmTC_e2cef.dir/link.txt --verbose=1
/usr/bin/cc   -pthread -DCHECK_FUNCTION_EXISTS=_beginthreadex    CMakeFiles/cmTC_e2cef.dir/CheckFunctionExists.c.o  -o cmTC_e2cef -rdynamic 
CMakeFiles/cmTC_e2cef.dir/CheckFunctionExists.c.o: In function `main':
CheckFunctionExists.c:(.text+0x15): undefined reference to `_beginthreadex'
collect2: error: ld returned 1 exit status
CMakeFiles/cmTC_e2cef.dir/build.make:97: recipe for target 'cmTC_e2cef' failed
make[2]: *** [cmTC_e2cef] Error 1
make[2]: Leaving directory '/home/vagrant/slave/monero-static-ubuntu-amd64/build/build/release/CMakeFiles/CMakeTmp'
Makefile:126: recipe for target 'cmTC_e2cef/fast' failed
make[1]: *** [cmTC_e2cef/fast] Error 2
make[1]: Leaving directory '/home/vagrant/slave/monero-static-ubuntu-amd64/build/build/release/CMakeFiles/CMakeTmp'


Determining if the function arc4random exists failed with the following output:
Change Dir: /home/vagrant/slave/monero-static-ubuntu-amd64/build/build/release/CMakeFiles/CMakeTmp

Run Build Command:"/usr/bin/make" "cmTC_4cb9c/fast"
make[1]: Entering directory '/home/vagrant/slave/monero-static-ubuntu-amd64/build/build/release/CMakeFiles/CMakeTmp'
/usr/bin/make -f CMakeFiles/cmTC_4cb9c.dir/build.make CMakeFiles/cmTC_4cb9c.dir/build
make[2]: Entering directory '/home/vagrant/slave/monero-static-ubuntu-amd64/build/build/release/CMakeFiles/CMakeTmp'
Building C object CMakeFiles/cmTC_4cb9c.dir/CheckFunctionExists.c.o
/usr/bin/cc    -pthread -DCHECK_FUNCTION_EXISTS=arc4random   -o CMakeFiles/cmTC_4cb9c.dir/CheckFunctionExists.c.o   -c /usr/share/cmake-3.5/Modules/CheckFunctionExists.c
Linking C executable cmTC_4cb9c
/usr/bin/cmake -E cmake_link_script CMakeFiles/cmTC_4cb9c.dir/link.txt --verbose=1
/usr/bin/cc   -pthread -DCHECK_FUNCTION_EXISTS=arc4random    CMakeFiles/cmTC_4cb9c.dir/CheckFunctionExists.c.o  -o cmTC_4cb9c -rdynamic 
CMakeFiles/cmTC_4cb9c.dir/CheckFunctionExists.c.o: In function `main':
CheckFunctionExists.c:(.text+0x15): undefined reference to `arc4random'
collect2: error: ld returned 1 exit status
CMakeFiles/cmTC_4cb9c.dir/build.make:97: recipe for target 'cmTC_4cb9c' failed
make[2]: *** [cmTC_4cb9c] Error 1
make[2]: Leaving directory '/home/vagrant/slave/monero-static-ubuntu-amd64/build/build/release/CMakeFiles/CMakeTmp'
Makefile:126: recipe for target 'cmTC_4cb9c/fast' failed
make[1]: *** [cmTC_4cb9c/fast] Error 2
make[1]: Leaving directory '/home/vagrant/slave/monero-static-ubuntu-amd64/build/build/release/CMakeFiles/CMakeTmp'


Determining if the function arc4random_uniform exists failed with the following output:
Change Dir: /home/vagrant/slave/monero-static-ubuntu-amd64/build/build/release/CMakeFiles/CMakeTmp

Run Build Command:"/usr/bin/make" "cmTC_576d7/fast"
make[1]: Entering directory '/home/vagrant/slave/monero-static-ubuntu-amd64/build/build/release/CMakeFiles/CMakeTmp'
/usr/bin/make -f CMakeFiles/cmTC_576d7.dir/build.make CMakeFiles/cmTC_576d7.dir/build
make[2]: Entering directory '/home/vagrant/slave/monero-static-ubuntu-amd64/build/build/release/CMakeFiles/CMakeTmp'
Building C object CMakeFiles/cmTC_576d7.dir/CheckFunctionExists.c.o
/usr/bin/cc    -pthread -DCHECK_FUNCTION_EXISTS=arc4random_uniform   -o CMakeFiles/cmTC_576d7.dir/CheckFunctionExists.c.o   -c /usr/share/cmake-3.5/Modules/CheckFunctionExists.c
Linking C executable cmTC_576d7
/usr/bin/cmake -E cmake_link_script CMakeFiles/cmTC_576d7.dir/link.txt --verbose=1
/usr/bin/cc   -pthread -DCHECK_FUNCTION_EXISTS=arc4random_uniform    CMakeFiles/cmTC_576d7.dir/CheckFunctionExists.c.o  -o cmTC_576d7 -rdynamic 
CMakeFiles/cmTC_576d7.dir/CheckFunctionExists.c.o: In function `main':
CheckFunctionExists.c:(.text+0x15): undefined reference to `arc4random_uniform'
collect2: error: ld returned 1 exit status
CMakeFiles/cmTC_576d7.dir/build.make:97: recipe for target 'cmTC_576d7' failed
make[2]: *** [cmTC_576d7] Error 1
make[2]: Leaving directory '/home/vagrant/slave/monero-static-ubuntu-amd64/build/build/release/CMakeFiles/CMakeTmp'
Makefile:126: recipe for target 'cmTC_576d7/fast' failed
make[1]: *** [cmTC_576d7/fast] Error 2
make[1]: Leaving directory '/home/vagrant/slave/monero-static-ubuntu-amd64/build/build/release/CMakeFiles/CMakeTmp'


Determining if the function getentropy exists failed with the following output:
Change Dir: /home/vagrant/slave/monero-static-ubuntu-amd64/build/build/release/CMakeFiles/CMakeTmp

Run Build Command:"/usr/bin/make" "cmTC_8d9f8/fast"
make[1]: Entering directory '/home/vagrant/slave/monero-static-ubuntu-amd64/build/build/release/CMakeFiles/CMakeTmp'
/usr/bin/make -f CMakeFiles/cmTC_8d9f8.dir/build.make CMakeFiles/cmTC_8d9f8.dir/build
make[2]: Entering directory '/home/vagrant/slave/monero-static-ubuntu-amd64/build/build/release/CMakeFiles/CMakeTmp'
Building C object CMakeFiles/cmTC_8d9f8.dir/CheckFunctionExists.c.o
/usr/bin/cc    -pthread -DCHECK_FUNCTION_EXISTS=getentropy   -o CMakeFiles/cmTC_8d9f8.dir/CheckFunctionExists.c.o   -c /usr/share/cmake-3.5/Modules/CheckFunctionExists.c
Linking C executable cmTC_8d9f8
/usr/bin/cmake -E cmake_link_script CMakeFiles/cmTC_8d9f8.dir/link.txt --verbose=1
/usr/bin/cc   -pthread -DCHECK_FUNCTION_EXISTS=getentropy    CMakeFiles/cmTC_8d9f8.dir/CheckFunctionExists.c.o  -o cmTC_8d9f8 -rdynamic 
CMakeFiles/cmTC_8d9f8.dir/CheckFunctionExists.c.o: In function `main':
CheckFunctionExists.c:(.text+0x15): undefined reference to `getentropy'
collect2: error: ld returned 1 exit status
CMakeFiles/cmTC_8d9f8.dir/build.make:97: recipe for target 'cmTC_8d9f8' failed
make[2]: *** [cmTC_8d9f8] Error 1
make[2]: Leaving directory '/home/vagrant/slave/monero-static-ubuntu-amd64/build/build/release/CMakeFiles/CMakeTmp'
Makefile:126: recipe for target 'cmTC_8d9f8/fast' failed
make[1]: *** [cmTC_8d9f8/fast] Error 2
make[1]: Leaving directory '/home/vagrant/slave/monero-static-ubuntu-amd64/build/build/release/CMakeFiles/CMakeTmp'


Determining if the function ioctlsocket exists failed with the following output:
Change Dir: /home/vagrant/slave/monero-static-ubuntu-amd64/build/build/release/CMakeFiles/CMakeTmp

Run Build Command:"/usr/bin/make" "cmTC_ecb53/fast"
make[1]: Entering directory '/home/vagrant/slave/monero-static-ubuntu-amd64/build/build/release/CMakeFiles/CMakeTmp'
/usr/bin/make -f CMakeFiles/cmTC_ecb53.dir/build.make CMakeFiles/cmTC_ecb53.dir/build
make[2]: Entering directory '/home/vagrant/slave/monero-static-ubuntu-amd64/build/build/release/CMakeFiles/CMakeTmp'
Building C object CMakeFiles/cmTC_ecb53.dir/CheckFunctionExists.c.o
/usr/bin/cc    -pthread -DCHECK_FUNCTION_EXISTS=ioctlsocket   -o CMakeFiles/cmTC_ecb53.dir/CheckFunctionExists.c.o   -c /usr/share/cmake-3.5/Modules/CheckFunctionExists.c
Linking C executable cmTC_ecb53
/usr/bin/cmake -E cmake_link_script CMakeFiles/cmTC_ecb53.dir/link.txt --verbose=1
/usr/bin/cc   -pthread -DCHECK_FUNCTION_EXISTS=ioctlsocket    CMakeFiles/cmTC_ecb53.dir/CheckFunctionExists.c.o  -o cmTC_ecb53 -rdynamic 
CMakeFiles/cmTC_ecb53.dir/CheckFunctionExists.c.o: In function `main':
CheckFunctionExists.c:(.text+0x15): undefined reference to `ioctlsocket'
collect2: error: ld returned 1 exit status
CMakeFiles/cmTC_ecb53.dir/build.make:97: recipe for target 'cmTC_ecb53' failed
make[2]: *** [cmTC_ecb53] Error 1
make[2]: Leaving directory '/home/vagrant/slave/monero-static-ubuntu-amd64/build/build/release/CMakeFiles/CMakeTmp'
Makefile:126: recipe for target 'cmTC_ecb53/fast' failed
make[1]: *** [cmTC_ecb53/fast] Error 2
make[1]: Leaving directory '/home/vagrant/slave/monero-static-ubuntu-amd64/build/build/release/CMakeFiles/CMakeTmp'


Determining if the function reallocarray exists failed with the following output:
Change Dir: /home/vagrant/slave/monero-static-ubuntu-amd64/build/build/release/CMakeFiles/CMakeTmp

Run Build Command:"/usr/bin/make" "cmTC_4290a/fast"
make[1]: Entering directory '/home/vagrant/slave/monero-static-ubuntu-amd64/build/build/release/CMakeFiles/CMakeTmp'
/usr/bin/make -f CMakeFiles/cmTC_4290a.dir/build.make CMakeFiles/cmTC_4290a.dir/build
make[2]: Entering directory '/home/vagrant/slave/monero-static-ubuntu-amd64/build/build/release/CMakeFiles/CMakeTmp'
Building C object CMakeFiles/cmTC_4290a.dir/CheckFunctionExists.c.o
/usr/bin/cc    -pthread -DCHECK_FUNCTION_EXISTS=reallocarray   -o CMakeFiles/cmTC_4290a.dir/CheckFunctionExists.c.o   -c /usr/share/cmake-3.5/Modules/CheckFunctionExists.c
Linking C executable cmTC_4290a
/usr/bin/cmake -E cmake_link_script CMakeFiles/cmTC_4290a.dir/link.txt --verbose=1
/usr/bin/cc   -pthread -DCHECK_FUNCTION_EXISTS=reallocarray    CMakeFiles/cmTC_4290a.dir/CheckFunctionExists.c.o  -o cmTC_4290a -rdynamic 
CMakeFiles/cmTC_4290a.dir/CheckFunctionExists.c.o: In function `main':
CheckFunctionExists.c:(.text+0x15): undefined reference to `reallocarray'
collect2: error: ld returned 1 exit status
CMakeFiles/cmTC_4290a.dir/build.make:97: recipe for target 'cmTC_4290a' failed
make[2]: *** [cmTC_4290a] Error 1
make[2]: Leaving directory '/home/vagrant/slave/monero-static-ubuntu-amd64/build/build/release/CMakeFiles/CMakeTmp'
Makefile:126: recipe for target 'cmTC_4290a/fast' failed
make[1]: *** [cmTC_4290a/fast] Error 2
make[1]: Leaving directory '/home/vagrant/slave/monero-static-ubuntu-amd64/build/build/release/CMakeFiles/CMakeTmp'


Determining if the function setusercontent exists failed with the following output:
Change Dir: /home/vagrant/slave/monero-static-ubuntu-amd64/build/build/release/CMakeFiles/CMakeTmp

Run Build Command:"/usr/bin/make" "cmTC_353c3/fast"
make[1]: Entering directory '/home/vagrant/slave/monero-static-ubuntu-amd64/build/build/release/CMakeFiles/CMakeTmp'
/usr/bin/make -f CMakeFiles/cmTC_353c3.dir/build.make CMakeFiles/cmTC_353c3.dir/build
make[2]: Entering directory '/home/vagrant/slave/monero-static-ubuntu-amd64/build/build/release/CMakeFiles/CMakeTmp'
Building C object CMakeFiles/cmTC_353c3.dir/CheckFunctionExists.c.o
/usr/bin/cc    -pthread -DCHECK_FUNCTION_EXISTS=setusercontent   -o CMakeFiles/cmTC_353c3.dir/CheckFunctionExists.c.o   -c /usr/share/cmake-3.5/Modules/CheckFunctionExists.c
Linking C executable cmTC_353c3
/usr/bin/cmake -E cmake_link_script CMakeFiles/cmTC_353c3.dir/link.txt --verbose=1
/usr/bin/cc   -pthread -DCHECK_FUNCTION_EXISTS=setusercontent    CMakeFiles/cmTC_353c3.dir/CheckFunctionExists.c.o  -o cmTC_353c3 -rdynamic 
CMakeFiles/cmTC_353c3.dir/CheckFunctionExists.c.o: In function `main':
CheckFunctionExists.c:(.text+0x15): undefined reference to `setusercontent'
collect2: error: ld returned 1 exit status
CMakeFiles/cmTC_353c3.dir/build.make:97: recipe for target 'cmTC_353c3' failed
make[2]: *** [cmTC_353c3] Error 1
make[2]: Leaving directory '/home/vagrant/slave/monero-static-ubuntu-amd64/build/build/release/CMakeFiles/CMakeTmp'
Makefile:126: recipe for target 'cmTC_353c3/fast' failed
make[1]: *** [cmTC_353c3/fast] Error 2
make[1]: Leaving directory '/home/vagrant/slave/monero-static-ubuntu-amd64/build/build/release/CMakeFiles/CMakeTmp'


Determining if the function strlcat exists failed with the following output:
Change Dir: /home/vagrant/slave/monero-static-ubuntu-amd64/build/build/release/CMakeFiles/CMakeTmp

Run Build Command:"/usr/bin/make" "cmTC_8ed3c/fast"
make[1]: Entering directory '/home/vagrant/slave/monero-static-ubuntu-amd64/build/build/release/CMakeFiles/CMakeTmp'
/usr/bin/make -f CMakeFiles/cmTC_8ed3c.dir/build.make CMakeFiles/cmTC_8ed3c.dir/build
make[2]: Entering directory '/home/vagrant/slave/monero-static-ubuntu-amd64/build/build/release/CMakeFiles/CMakeTmp'
Building C object CMakeFiles/cmTC_8ed3c.dir/CheckFunctionExists.c.o
/usr/bin/cc    -pthread -DCHECK_FUNCTION_EXISTS=strlcat   -o CMakeFiles/cmTC_8ed3c.dir/CheckFunctionExists.c.o   -c /usr/share/cmake-3.5/Modules/CheckFunctionExists.c
Linking C executable cmTC_8ed3c
/usr/bin/cmake -E cmake_link_script CMakeFiles/cmTC_8ed3c.dir/link.txt --verbose=1
/usr/bin/cc   -pthread -DCHECK_FUNCTION_EXISTS=strlcat    CMakeFiles/cmTC_8ed3c.dir/CheckFunctionExists.c.o  -o cmTC_8ed3c -rdynamic 
CMakeFiles/cmTC_8ed3c.dir/CheckFunctionExists.c.o: In function `main':
CheckFunctionExists.c:(.text+0x15): undefined reference to `strlcat'
collect2: error: ld returned 1 exit status
CMakeFiles/cmTC_8ed3c.dir/build.make:97: recipe for target 'cmTC_8ed3c' failed
make[2]: *** [cmTC_8ed3c] Error 1
make[2]: Leaving directory '/home/vagrant/slave/monero-static-ubuntu-amd64/build/build/release/CMakeFiles/CMakeTmp'
Makefile:126: recipe for target 'cmTC_8ed3c/fast' failed
make[1]: *** [cmTC_8ed3c/fast] Error 2
make[1]: Leaving directory '/home/vagrant/slave/monero-static-ubuntu-amd64/build/build/release/CMakeFiles/CMakeTmp'


Determining if the function strlcpy exists failed with the following output:
Change Dir: /home/vagrant/slave/monero-static-ubuntu-amd64/build/build/release/CMakeFiles/CMakeTmp

Run Build Command:"/usr/bin/make" "cmTC_0fee8/fast"
make[1]: Entering directory '/home/vagrant/slave/monero-static-ubuntu-amd64/build/build/release/CMakeFiles/CMakeTmp'
/usr/bin/make -f CMakeFiles/cmTC_0fee8.dir/build.make CMakeFiles/cmTC_0fee8.dir/build
make[2]: Entering directory '/home/vagrant/slave/monero-static-ubuntu-amd64/build/build/release/CMakeFiles/CMakeTmp'
Building C object CMakeFiles/cmTC_0fee8.dir/CheckFunctionExists.c.o
/usr/bin/cc    -pthread -DCHECK_FUNCTION_EXISTS=strlcpy   -o CMakeFiles/cmTC_0fee8.dir/CheckFunctionExists.c.o   -c /usr/share/cmake-3.5/Modules/CheckFunctionExists.c
Linking C executable cmTC_0fee8
/usr/bin/cmake -E cmake_link_script CMakeFiles/cmTC_0fee8.dir/link.txt --verbose=1
/usr/bin/cc   -pthread -DCHECK_FUNCTION_EXISTS=strlcpy    CMakeFiles/cmTC_0fee8.dir/CheckFunctionExists.c.o  -o cmTC_0fee8 -rdynamic 
CMakeFiles/cmTC_0fee8.dir/CheckFunctionExists.c.o: In function `main':
CheckFunctionExists.c:(.text+0x15): undefined reference to `strlcpy'
collect2: error: ld returned 1 exit status
CMakeFiles/cmTC_0fee8.dir/build.make:97: recipe for target 'cmTC_0fee8' failed
make[2]: *** [cmTC_0fee8] Error 1
make[2]: Leaving directory '/home/vagrant/slave/monero-static-ubuntu-amd64/build/build/release/CMakeFiles/CMakeTmp'
Makefile:126: recipe for target 'cmTC_0fee8/fast' failed
make[1]: *** [cmTC_0fee8/fast] Error 2
make[1]: Leaving directory '/home/vagrant/slave/monero-static-ubuntu-amd64/build/build/release/CMakeFiles/CMakeTmp'


Determining if the PTHREAD_PRIO_INHERIT exist failed with the following output:
Change Dir: /home/vagrant/slave/monero-static-ubuntu-amd64/build/build/release/CMakeFiles/CMakeTmp

Run Build Command:"/usr/bin/make" "cmTC_f277e/fast"
make[1]: Entering directory '/home/vagrant/slave/monero-static-ubuntu-amd64/build/build/release/CMakeFiles/CMakeTmp'
/usr/bin/make -f CMakeFiles/cmTC_f277e.dir/build.make CMakeFiles/cmTC_f277e.dir/build
make[2]: Entering directory '/home/vagrant/slave/monero-static-ubuntu-amd64/build/build/release/CMakeFiles/CMakeTmp'
Building C object CMakeFiles/cmTC_f277e.dir/CheckSymbolExists.c.o
/usr/bin/cc    -pthread    -o CMakeFiles/cmTC_f277e.dir/CheckSymbolExists.c.o   -c /home/vagrant/slave/monero-static-ubuntu-amd64/build/build/release/CMakeFiles/CMakeTmp/CheckSymbolExists.c
/home/vagrant/slave/monero-static-ubuntu-amd64/build/build/release/CMakeFiles/CMakeTmp/CheckSymbolExists.c: In function 'main':
/home/vagrant/slave/monero-static-ubuntu-amd64/build/build/release/CMakeFiles/CMakeTmp/CheckSymbolExists.c:8:18: error: lvalue required as unary '&' operand
   return ((int*)(&PTHREAD_PRIO_INHERIT))[argc];
                  ^
CMakeFiles/cmTC_f277e.dir/build.make:65: recipe for target 'CMakeFiles/cmTC_f277e.dir/CheckSymbolExists.c.o' failed
make[2]: *** [CMakeFiles/cmTC_f277e.dir/CheckSymbolExists.c.o] Error 1
make[2]: Leaving directory '/home/vagrant/slave/monero-static-ubuntu-amd64/build/build/release/CMakeFiles/CMakeTmp'
Makefile:126: recipe for target 'cmTC_f277e/fast' failed
make[1]: *** [cmTC_f277e/fast] Error 2
make[1]: Leaving directory '/home/vagrant/slave/monero-static-ubuntu-amd64/build/build/release/CMakeFiles/CMakeTmp'

File /home/vagrant/slave/monero-static-ubuntu-amd64/build/build/release/CMakeFiles/CMakeTmp/CheckSymbolExists.c:
/* */
#include <pthread.h>

int main(int argc, char** argv)
{
  (void)argv;
#ifndef PTHREAD_PRIO_INHERIT
  return ((int*)(&PTHREAD_PRIO_INHERIT))[argc];
#else
  (void)argc;
  return 0;
#endif
}

Determining if the pthread_rwlock_t exist failed with the following output:
Change Dir: /home/vagrant/slave/monero-static-ubuntu-amd64/build/build/release/CMakeFiles/CMakeTmp

Run Build Command:"/usr/bin/make" "cmTC_08a37/fast"
make[1]: Entering directory '/home/vagrant/slave/monero-static-ubuntu-amd64/build/build/release/CMakeFiles/CMakeTmp'
/usr/bin/make -f CMakeFiles/cmTC_08a37.dir/build.make CMakeFiles/cmTC_08a37.dir/build
make[2]: Entering directory '/home/vagrant/slave/monero-static-ubuntu-amd64/build/build/release/CMakeFiles/CMakeTmp'
Building C object CMakeFiles/cmTC_08a37.dir/CheckSymbolExists.c.o
/usr/bin/cc    -pthread    -o CMakeFiles/cmTC_08a37.dir/CheckSymbolExists.c.o   -c /home/vagrant/slave/monero-static-ubuntu-amd64/build/build/release/CMakeFiles/CMakeTmp/CheckSymbolExists.c
/home/vagrant/slave/monero-static-ubuntu-amd64/build/build/release/CMakeFiles/CMakeTmp/CheckSymbolExists.c: In function 'main':
/home/vagrant/slave/monero-static-ubuntu-amd64/build/build/release/CMakeFiles/CMakeTmp/CheckSymbolExists.c:8:19: error: expected expression before 'pthread_rwlock_t'
   return ((int*)(&pthread_rwlock_t))[argc];
                   ^
CMakeFiles/cmTC_08a37.dir/build.make:65: recipe for target 'CMakeFiles/cmTC_08a37.dir/CheckSymbolExists.c.o' failed
make[2]: *** [CMakeFiles/cmTC_08a37.dir/CheckSymbolExists.c.o] Error 1
make[2]: Leaving directory '/home/vagrant/slave/monero-static-ubuntu-amd64/build/build/release/CMakeFiles/CMakeTmp'
Makefile:126: recipe for target 'cmTC_08a37/fast' failed
make[1]: *** [cmTC_08a37/fast] Error 2
make[1]: Leaving directory '/home/vagrant/slave/monero-static-ubuntu-amd64/build/build/release/CMakeFiles/CMakeTmp'

File /home/vagrant/slave/monero-static-ubuntu-amd64/build/build/release/CMakeFiles/CMakeTmp/CheckSymbolExists.c:
/* */
#include <pthread.h>

int main(int argc, char** argv)
{
  (void)argv;
#ifndef pthread_rwlock_t
  return ((int*)(&pthread_rwlock_t))[argc];
#else
  (void)argc;
  return 0;
#endif
}

Determining if the pthread_spinlock_t exist failed with the following output:
Change Dir: /home/vagrant/slave/monero-static-ubuntu-amd64/build/build/release/CMakeFiles/CMakeTmp

Run Build Command:"/usr/bin/make" "cmTC_e9ccd/fast"
make[1]: Entering directory '/home/vagrant/slave/monero-static-ubuntu-amd64/build/build/release/CMakeFiles/CMakeTmp'
/usr/bin/make -f CMakeFiles/cmTC_e9ccd.dir/build.make CMakeFiles/cmTC_e9ccd.dir/build
make[2]: Entering directory '/home/vagrant/slave/monero-static-ubuntu-amd64/build/build/release/CMakeFiles/CMakeTmp'
Building C object CMakeFiles/cmTC_e9ccd.dir/CheckSymbolExists.c.o
/usr/bin/cc    -pthread    -o CMakeFiles/cmTC_e9ccd.dir/CheckSymbolExists.c.o   -c /home/vagrant/slave/monero-static-ubuntu-amd64/build/build/release/CMakeFiles/CMakeTmp/CheckSymbolExists.c
/home/vagrant/slave/monero-static-ubuntu-amd64/build/build/release/CMakeFiles/CMakeTmp/CheckSymbolExists.c: In function 'main':
/home/vagrant/slave/monero-static-ubuntu-amd64/build/build/release/CMakeFiles/CMakeTmp/CheckSymbolExists.c:8:19: error: expected expression before 'pthread_spinlock_t'
   return ((int*)(&pthread_spinlock_t))[argc];
                   ^
CMakeFiles/cmTC_e9ccd.dir/build.make:65: recipe for target 'CMakeFiles/cmTC_e9ccd.dir/CheckSymbolExists.c.o' failed
make[2]: *** [CMakeFiles/cmTC_e9ccd.dir/CheckSymbolExists.c.o] Error 1
make[2]: Leaving directory '/home/vagrant/slave/monero-static-ubuntu-amd64/build/build/release/CMakeFiles/CMakeTmp'
Makefile:126: recipe for target 'cmTC_e9ccd/fast' failed
make[1]: *** [cmTC_e9ccd/fast] Error 2
make[1]: Leaving directory '/home/vagrant/slave/monero-static-ubuntu-amd64/build/build/release/CMakeFiles/CMakeTmp'

File /home/vagrant/slave/monero-static-ubuntu-amd64/build/build/release/CMakeFiles/CMakeTmp/CheckSymbolExists.c:
/* */
#include <pthread.h>

int main(int argc, char** argv)
{
  (void)argv;
#ifndef pthread_spinlock_t
  return ((int*)(&pthread_spinlock_t))[argc];
#else
  (void)argc;
  return 0;
#endif
}

Determining if the function EVP_MD_CTX_new exists failed with the following output:
Change Dir: /home/vagrant/slave/monero-static-ubuntu-amd64/build/build/release/CMakeFiles/CMakeTmp

Run Build Command:"/usr/bin/make" "cmTC_1003b/fast"
make[1]: Entering directory '/home/vagrant/slave/monero-static-ubuntu-amd64/build/build/release/CMakeFiles/CMakeTmp'
/usr/bin/make -f CMakeFiles/cmTC_1003b.dir/build.make CMakeFiles/cmTC_1003b.dir/build
make[2]: Entering directory '/home/vagrant/slave/monero-static-ubuntu-amd64/build/build/release/CMakeFiles/CMakeTmp'
Building C object CMakeFiles/cmTC_1003b.dir/CheckFunctionExists.c.o
/usr/bin/cc    -pthread -DCHECK_FUNCTION_EXISTS=EVP_MD_CTX_new   -o CMakeFiles/cmTC_1003b.dir/CheckFunctionExists.c.o   -c /usr/share/cmake-3.5/Modules/CheckFunctionExists.c
Linking C executable cmTC_1003b
/usr/bin/cmake -E cmake_link_script CMakeFiles/cmTC_1003b.dir/link.txt --verbose=1
/usr/bin/cc   -pthread -DCHECK_FUNCTION_EXISTS=EVP_MD_CTX_new    CMakeFiles/cmTC_1003b.dir/CheckFunctionExists.c.o  -o cmTC_1003b -rdynamic /usr/lib/x86_64-linux-gnu/libssl.a /usr/lib/x86_64-linux-gnu/libcrypto.a -ldl -pthread 
CMakeFiles/cmTC_1003b.dir/CheckFunctionExists.c.o: In function `main':
CheckFunctionExists.c:(.text+0x15): undefined reference to `EVP_MD_CTX_new'
collect2: error: ld returned 1 exit status
CMakeFiles/cmTC_1003b.dir/build.make:99: recipe for target 'cmTC_1003b' failed
make[2]: *** [cmTC_1003b] Error 1
make[2]: Leaving directory '/home/vagrant/slave/monero-static-ubuntu-amd64/build/build/release/CMakeFiles/CMakeTmp'
Makefile:126: recipe for target 'cmTC_1003b/fast' failed
make[1]: *** [cmTC_1003b/fast] Error 2
make[1]: Leaving directory '/home/vagrant/slave/monero-static-ubuntu-amd64/build/build/release/CMakeFiles/CMakeTmp'


Determining if the LIBRESSL_VERSION_TEXT exist failed with the following output:
Change Dir: /home/vagrant/slave/monero-static-ubuntu-amd64/build/build/release/CMakeFiles/CMakeTmp

Run Build Command:"/usr/bin/make" "cmTC_62332/fast"
make[1]: Entering directory '/home/vagrant/slave/monero-static-ubuntu-amd64/build/build/release/CMakeFiles/CMakeTmp'
/usr/bin/make -f CMakeFiles/cmTC_62332.dir/build.make CMakeFiles/cmTC_62332.dir/build
make[2]: Entering directory '/home/vagrant/slave/monero-static-ubuntu-amd64/build/build/release/CMakeFiles/CMakeTmp'
Building C object CMakeFiles/cmTC_62332.dir/CheckSymbolExists.c.o
/usr/bin/cc    -pthread    -o CMakeFiles/cmTC_62332.dir/CheckSymbolExists.c.o   -c /home/vagrant/slave/monero-static-ubuntu-amd64/build/build/release/CMakeFiles/CMakeTmp/CheckSymbolExists.c
/home/vagrant/slave/monero-static-ubuntu-amd64/build/build/release/CMakeFiles/CMakeTmp/CheckSymbolExists.c: In function 'main':
/home/vagrant/slave/monero-static-ubuntu-amd64/build/build/release/CMakeFiles/CMakeTmp/CheckSymbolExists.c:8:19: error: 'LIBRESSL_VERSION_TEXT' undeclared (first use in this function)
   return ((int*)(&LIBRESSL_VERSION_TEXT))[argc];
                   ^
/home/vagrant/slave/monero-static-ubuntu-amd64/build/build/release/CMakeFiles/CMakeTmp/CheckSymbolExists.c:8:19: note: each undeclared identifier is reported only once for each function it appears in
CMakeFiles/cmTC_62332.dir/build.make:65: recipe for target 'CMakeFiles/cmTC_62332.dir/CheckSymbolExists.c.o' failed
make[2]: *** [CMakeFiles/cmTC_62332.dir/CheckSymbolExists.c.o] Error 1
make[2]: Leaving directory '/home/vagrant/slave/monero-static-ubuntu-amd64/build/build/release/CMakeFiles/CMakeTmp'
Makefile:126: recipe for target 'cmTC_62332/fast' failed
make[1]: *** [cmTC_62332/fast] Error 2
make[1]: Leaving directory '/home/vagrant/slave/monero-static-ubuntu-amd64/build/build/release/CMakeFiles/CMakeTmp'

File /home/vagrant/slave/monero-static-ubuntu-amd64/build/build/release/CMakeFiles/CMakeTmp/CheckSymbolExists.c:
/* */
#include <openssl/opensslv.h>

int main(int argc, char** argv)
{
  (void)argv;
#ifndef LIBRESSL_VERSION_TEXT
  return ((int*)(&LIBRESSL_VERSION_TEXT))[argc];
#else
  (void)argc;
  return 0;
#endif
}

Performing C++ SOURCE FILE Test HAVE_CXX_ATOMICS failed with the following output:
Change Dir: /home/vagrant/slave/monero-static-ubuntu-amd64/build/build/release/CMakeFiles/CMakeTmp

Run Build Command:"/usr/bin/make" "cmTC_6009f/fast"
make[1]: Entering directory '/home/vagrant/slave/monero-static-ubuntu-amd64/build/build/release/CMakeFiles/CMakeTmp'
/usr/bin/make -f CMakeFiles/cmTC_6009f.dir/build.make CMakeFiles/cmTC_6009f.dir/build
make[2]: Entering directory '/home/vagrant/slave/monero-static-ubuntu-amd64/build/build/release/CMakeFiles/CMakeTmp'
Building CXX object CMakeFiles/cmTC_6009f.dir/src.cxx.o
/usr/bin/c++     -DZMQ_STATIC -pthread -maes -DHAVE_CXX_ATOMICS   -o CMakeFiles/cmTC_6009f.dir/src.cxx.o -c /home/vagrant/slave/monero-static-ubuntu-amd64/build/build/release/CMakeFiles/CMakeTmp/src.cxx
In file included from /usr/include/c++/5/cstdint:35:0,
                 from /home/vagrant/slave/monero-static-ubuntu-amd64/build/build/release/CMakeFiles/CMakeTmp/src.cxx:2:
/usr/include/c++/5/bits/c++0x_warning.h:32:2: error: #error This file requires compiler and library support for the ISO C++ 2011 standard. This support must be enabled with the -std=c++11 or -std=gnu++11 compiler options.
 #error This file requires compiler and library support \
  ^
/home/vagrant/slave/monero-static-ubuntu-amd64/build/build/release/CMakeFiles/CMakeTmp/src.cxx: In function 'int main()':
/home/vagrant/slave/monero-static-ubuntu-amd64/build/build/release/CMakeFiles/CMakeTmp/src.cxx:5:3: error: 'atomic' is not a member of 'std'
   std::atomic<uint64_t> a;
   ^
/home/vagrant/slave/monero-static-ubuntu-amd64/build/build/release/CMakeFiles/CMakeTmp/src.cxx:5:15: error: 'uint64_t' was not declared in this scope
   std::atomic<uint64_t> a;
               ^
/home/vagrant/slave/monero-static-ubuntu-amd64/build/build/release/CMakeFiles/CMakeTmp/src.cxx:5:25: error: 'a' was not declared in this scope
   std::atomic<uint64_t> a;
                         ^
CMakeFiles/cmTC_6009f.dir/build.make:65: recipe for target 'CMakeFiles/cmTC_6009f.dir/src.cxx.o' failed
make[2]: *** [CMakeFiles/cmTC_6009f.dir/src.cxx.o] Error 1
make[2]: Leaving directory '/home/vagrant/slave/monero-static-ubuntu-amd64/build/build/release/CMakeFiles/CMakeTmp'
Makefile:126: recipe for target 'cmTC_6009f/fast' failed
make[1]: *** [cmTC_6009f/fast] Error 2
make[1]: Leaving directory '/home/vagrant/slave/monero-static-ubuntu-amd64/build/build/release/CMakeFiles/CMakeTmp'

Source file was:

#include <cstdint>
#include <atomic>
int main() {
  std::atomic<uint64_t> a;
  a.is_lock_free();
}
Performing C SOURCE FILE Test _fcf_protection=full_c failed with the following output:
Change Dir: /home/vagrant/slave/monero-static-ubuntu-amd64/build/build/release/CMakeFiles/CMakeTmp

Run Build Command:"/usr/bin/make" "cmTC_b4411/fast"
make[1]: Entering directory '/home/vagrant/slave/monero-static-ubuntu-amd64/build/build/release/CMakeFiles/CMakeTmp'
/usr/bin/make -f CMakeFiles/cmTC_b4411.dir/build.make CMakeFiles/cmTC_b4411.dir/build
make[2]: Entering directory '/home/vagrant/slave/monero-static-ubuntu-amd64/build/build/release/CMakeFiles/CMakeTmp'
Building C object CMakeFiles/cmTC_b4411.dir/src.c.o
/usr/bin/cc   -I/usr/local/include/libusb-1.0  -pthread -maes -march=x86-64 -fno-strict-aliasing -D_fcf_protection=full_c   -fcf-protection=full -o CMakeFiles/cmTC_b4411.dir/src.c.o   -c /home/vagrant/slave/monero-static-ubuntu-amd64/build/build/release/CMakeFiles/CMakeTmp/src.c
cc: error: unrecognized command line option '-fcf-protection=full'
CMakeFiles/cmTC_b4411.dir/build.make:65: recipe for target 'CMakeFiles/cmTC_b4411.dir/src.c.o' failed
make[2]: *** [CMakeFiles/cmTC_b4411.dir/src.c.o] Error 1
make[2]: Leaving directory '/home/vagrant/slave/monero-static-ubuntu-amd64/build/build/release/CMakeFiles/CMakeTmp'
Makefile:126: recipe for target 'cmTC_b4411/fast' failed
make[1]: *** [cmTC_b4411/fast] Error 2
make[1]: Leaving directory '/home/vagrant/slave/monero-static-ubuntu-amd64/build/build/release/CMakeFiles/CMakeTmp'

Source file was:
int main(void) { return 0; }
Performing C++ SOURCE FILE Test _fcf_protection=full_cxx failed with the following output:
Change Dir: /home/vagrant/slave/monero-static-ubuntu-amd64/build/build/release/CMakeFiles/CMakeTmp

Run Build Command:"/usr/bin/make" "cmTC_f27b2/fast"
make[1]: Entering directory '/home/vagrant/slave/monero-static-ubuntu-amd64/build/build/release/CMakeFiles/CMakeTmp'
/usr/bin/make -f CMakeFiles/cmTC_f27b2.dir/build.make CMakeFiles/cmTC_f27b2.dir/build
make[2]: Entering directory '/home/vagrant/slave/monero-static-ubuntu-amd64/build/build/release/CMakeFiles/CMakeTmp'
Building CXX object CMakeFiles/cmTC_f27b2.dir/src.cxx.o
/usr/bin/c++    -I/usr/local/include/libusb-1.0  -DZMQ_STATIC -pthread -maes -march=x86-64 -fno-strict-aliasing -D_fcf_protection=full_cxx   -fcf-protection=full -o CMakeFiles/cmTC_f27b2.dir/src.cxx.o -c /home/vagrant/slave/monero-static-ubuntu-amd64/build/build/release/CMakeFiles/CMakeTmp/src.cxx
c++: error: unrecognized command line option '-fcf-protection=full'
CMakeFiles/cmTC_f27b2.dir/build.make:65: recipe for target 'CMakeFiles/cmTC_f27b2.dir/src.cxx.o' failed
make[2]: *** [CMakeFiles/cmTC_f27b2.dir/src.cxx.o] Error 1
make[2]: Leaving directory '/home/vagrant/slave/monero-static-ubuntu-amd64/build/build/release/CMakeFiles/CMakeTmp'
Makefile:126: recipe for target 'cmTC_f27b2/fast' failed
make[1]: *** [cmTC_f27b2/fast] Error 2
make[1]: Leaving directory '/home/vagrant/slave/monero-static-ubuntu-amd64/build/build/release/CMakeFiles/CMakeTmp'

Source file was:
int main() { return 0; }
Performing C SOURCE FILE Test _fstack_clash_protection_c failed with the following output:
Change Dir: /home/vagrant/slave/monero-static-ubuntu-amd64/build/build/release/CMakeFiles/CMakeTmp

Run Build Command:"/usr/bin/make" "cmTC_54e68/fast"
make[1]: Entering directory '/home/vagrant/slave/monero-static-ubuntu-amd64/build/build/release/CMakeFiles/CMakeTmp'
/usr/bin/make -f CMakeFiles/cmTC_54e68.dir/build.make CMakeFiles/cmTC_54e68.dir/build
make[2]: Entering directory '/home/vagrant/slave/monero-static-ubuntu-amd64/build/build/release/CMakeFiles/CMakeTmp'
Building C object CMakeFiles/cmTC_54e68.dir/src.c.o
/usr/bin/cc   -I/usr/local/include/libusb-1.0  -pthread -maes -march=x86-64 -fno-strict-aliasing -D_fstack_clash_protection_c   -fstack-clash-protection -o CMakeFiles/cmTC_54e68.dir/src.c.o   -c /home/vagrant/slave/monero-static-ubuntu-amd64/build/build/release/CMakeFiles/CMakeTmp/src.c
cc: error: unrecognized command line option '-fstack-clash-protection'
CMakeFiles/cmTC_54e68.dir/build.make:65: recipe for target 'CMakeFiles/cmTC_54e68.dir/src.c.o' failed
make[2]: *** [CMakeFiles/cmTC_54e68.dir/src.c.o] Error 1
make[2]: Leaving directory '/home/vagrant/slave/monero-static-ubuntu-amd64/build/build/release/CMakeFiles/CMakeTmp'
Makefile:126: recipe for target 'cmTC_54e68/fast' failed
make[1]: *** [cmTC_54e68/fast] Error 2
make[1]: Leaving directory '/home/vagrant/slave/monero-static-ubuntu-amd64/build/build/release/CMakeFiles/CMakeTmp'

Source file was:
int main(void) { return 0; }
Performing C++ SOURCE FILE Test _fstack_clash_protection_cxx failed with the following output:
Change Dir: /home/vagrant/slave/monero-static-ubuntu-amd64/build/build/release/CMakeFiles/CMakeTmp

Run Build Command:"/usr/bin/make" "cmTC_c4d31/fast"
make[1]: Entering directory '/home/vagrant/slave/monero-static-ubuntu-amd64/build/build/release/CMakeFiles/CMakeTmp'
/usr/bin/make -f CMakeFiles/cmTC_c4d31.dir/build.make CMakeFiles/cmTC_c4d31.dir/build
make[2]: Entering directory '/home/vagrant/slave/monero-static-ubuntu-amd64/build/build/release/CMakeFiles/CMakeTmp'
Building CXX object CMakeFiles/cmTC_c4d31.dir/src.cxx.o
/usr/bin/c++    -I/usr/local/include/libusb-1.0  -DZMQ_STATIC -pthread -maes -march=x86-64 -fno-strict-aliasing -D_fstack_clash_protection_cxx   -fstack-clash-protection -o CMakeFiles/cmTC_c4d31.dir/src.cxx.o -c /home/vagrant/slave/monero-static-ubuntu-amd64/build/build/release/CMakeFiles/CMakeTmp/src.cxx
c++: error: unrecognized command line option '-fstack-clash-protection'
CMakeFiles/cmTC_c4d31.dir/build.make:65: recipe for target 'CMakeFiles/cmTC_c4d31.dir/src.cxx.o' failed
make[2]: *** [CMakeFiles/cmTC_c4d31.dir/src.cxx.o] Error 1
make[2]: Leaving directory '/home/vagrant/slave/monero-static-ubuntu-amd64/build/build/release/CMakeFiles/CMakeTmp'
Makefile:126: recipe for target 'cmTC_c4d31/fast' failed
make[1]: *** [cmTC_c4d31/fast] Error 2
make[1]: Leaving directory '/home/vagrant/slave/monero-static-ubuntu-amd64/build/build/release/CMakeFiles/CMakeTmp'

Source file was:
int main() { return 0; }
Performing C SOURCE FILE Test _mmitigate_rop_c failed with the following output:
Change Dir: /home/vagrant/slave/monero-static-ubuntu-amd64/build/build/release/CMakeFiles/CMakeTmp

Run Build Command:"/usr/bin/make" "cmTC_1b4ec/fast"
make[1]: Entering directory '/home/vagrant/slave/monero-static-ubuntu-amd64/build/build/release/CMakeFiles/CMakeTmp'
/usr/bin/make -f CMakeFiles/cmTC_1b4ec.dir/build.make CMakeFiles/cmTC_1b4ec.dir/build
make[2]: Entering directory '/home/vagrant/slave/monero-static-ubuntu-amd64/build/build/release/CMakeFiles/CMakeTmp'
Building C object CMakeFiles/cmTC_1b4ec.dir/src.c.o
/usr/bin/cc   -I/usr/local/include/libusb-1.0  -pthread -maes -march=x86-64 -fno-strict-aliasing -D_mmitigate_rop_c   -mmitigate-rop -o CMakeFiles/cmTC_1b4ec.dir/src.c.o   -c /home/vagrant/slave/monero-static-ubuntu-amd64/build/build/release/CMakeFiles/CMakeTmp/src.c
cc: error: unrecognized command line option '-mmitigate-rop'
CMakeFiles/cmTC_1b4ec.dir/build.make:65: recipe for target 'CMakeFiles/cmTC_1b4ec.dir/src.c.o' failed
make[2]: *** [CMakeFiles/cmTC_1b4ec.dir/src.c.o] Error 1
make[2]: Leaving directory '/home/vagrant/slave/monero-static-ubuntu-amd64/build/build/release/CMakeFiles/CMakeTmp'
Makefile:126: recipe for target 'cmTC_1b4ec/fast' failed
make[1]: *** [cmTC_1b4ec/fast] Error 2
make[1]: Leaving directory '/home/vagrant/slave/monero-static-ubuntu-amd64/build/build/release/CMakeFiles/CMakeTmp'

Source file was:
int main(void) { return 0; }
Performing C++ SOURCE FILE Test _mmitigate_rop_cxx failed with the following output:
Change Dir: /home/vagrant/slave/monero-static-ubuntu-amd64/build/build/release/CMakeFiles/CMakeTmp

Run Build Command:"/usr/bin/make" "cmTC_c9c68/fast"
make[1]: Entering directory '/home/vagrant/slave/monero-static-ubuntu-amd64/build/build/release/CMakeFiles/CMakeTmp'
/usr/bin/make -f CMakeFiles/cmTC_c9c68.dir/build.make CMakeFiles/cmTC_c9c68.dir/build
make[2]: Entering directory '/home/vagrant/slave/monero-static-ubuntu-amd64/build/build/release/CMakeFiles/CMakeTmp'
Building CXX object CMakeFiles/cmTC_c9c68.dir/src.cxx.o
/usr/bin/c++    -I/usr/local/include/libusb-1.0  -DZMQ_STATIC -pthread -maes -march=x86-64 -fno-strict-aliasing -D_mmitigate_rop_cxx   -mmitigate-rop -o CMakeFiles/cmTC_c9c68.dir/src.cxx.o -c /home/vagrant/slave/monero-static-ubuntu-amd64/build/build/release/CMakeFiles/CMakeTmp/src.cxx
c++: error: unrecognized command line option '-mmitigate-rop'
CMakeFiles/cmTC_c9c68.dir/build.make:65: recipe for target 'CMakeFiles/cmTC_c9c68.dir/src.cxx.o' failed
make[2]: *** [CMakeFiles/cmTC_c9c68.dir/src.cxx.o] Error 1
make[2]: Leaving directory '/home/vagrant/slave/monero-static-ubuntu-amd64/build/build/release/CMakeFiles/CMakeTmp'
Makefile:126: recipe for target 'cmTC_c9c68/fast' failed
make[1]: *** [cmTC_c9c68/fast] Error 2
make[1]: Leaving directory '/home/vagrant/slave/monero-static-ubuntu-amd64/build/build/release/CMakeFiles/CMakeTmp'

Source file was:
int main() { return 0; }
Determining if the -Wl,-z,noexecheap linker flag is supported failed with the following output:
Change Dir: /home/vagrant/slave/monero-static-ubuntu-amd64/build/build/release/CMakeFiles/CMakeTmp

Run Build Command:"/usr/bin/make" "cmTC_41a0a/fast"
make[1]: Entering directory '/home/vagrant/slave/monero-static-ubuntu-amd64/build/build/release/CMakeFiles/CMakeTmp'
/usr/bin/make -f CMakeFiles/cmTC_41a0a.dir/build.make CMakeFiles/cmTC_41a0a.dir/build
make[2]: Entering directory '/home/vagrant/slave/monero-static-ubuntu-amd64/build/build/release/CMakeFiles/CMakeTmp'
Building C object CMakeFiles/cmTC_41a0a.dir/CheckLinkerFlag.c.o
/usr/bin/cc    -Wl,-z,noexecheap    -Wl,-z,noexecheap -o CMakeFiles/cmTC_41a0a.dir/CheckLinkerFlag.c.o   -c /home/vagrant/slave/monero-static-ubuntu-amd64/build/cmake/CheckLinkerFlag.c
Linking C executable cmTC_41a0a
/usr/bin/cmake -E cmake_link_script CMakeFiles/cmTC_41a0a.dir/link.txt --verbose=1
/usr/bin/cc  -Wl,-z,noexecheap     CMakeFiles/cmTC_41a0a.dir/CheckLinkerFlag.c.o  -o cmTC_41a0a -rdynamic 
/usr/bin/ld: warning: -z noexecheap ignored.
make[2]: Leaving directory '/home/vagrant/slave/monero-static-ubuntu-amd64/build/build/release/CMakeFiles/CMakeTmp'
make[1]: Leaving directory '/home/vagrant/slave/monero-static-ubuntu-amd64/build/build/release/CMakeFiles/CMakeTmp'


Determining if the function rl_copy_text exists failed with the following output:
Change Dir: /home/vagrant/slave/monero-static-ubuntu-amd64/build/build/release/CMakeFiles/CMakeTmp

Run Build Command:"/usr/bin/make" "cmTC_48948/fast"
make[1]: Entering directory '/home/vagrant/slave/monero-static-ubuntu-amd64/build/build/release/CMakeFiles/CMakeTmp'
/usr/bin/make -f CMakeFiles/cmTC_48948.dir/build.make CMakeFiles/cmTC_48948.dir/build
make[2]: Entering directory '/home/vagrant/slave/monero-static-ubuntu-amd64/build/build/release/CMakeFiles/CMakeTmp'
Building C object CMakeFiles/cmTC_48948.dir/CheckFunctionExists.c.o
/usr/bin/cc    -pthread -maes -march=x86-64 -fno-strict-aliasing -std=c11 -D_GNU_SOURCE   -Wall -Wextra -Wpointer-arith -Wundef -Wvla -Wwrite-strings -Wno-error=extra -Wno-error=deprecated-declarations -Wno-unused-parameter -Wno-unused-variable -Wno-error=unused-variable -Wno-error=undef -Wno-error=uninitialized -Wlogical-op -Wno-error=maybe-uninitialized -Wno-error=cpp -Waggregate-return -Wnested-externs -Wold-style-definition -Wstrict-prototypes  -fPIC  -Wformat -Wformat-security -fstack-protector -fstack-protector-strong -fno-strict-aliasing -DCHECK_FUNCTION_EXISTS=rl_copy_text   -o CMakeFiles/cmTC_48948.dir/CheckFunctionExists.c.o   -c /usr/share/cmake-3.5/Modules/CheckFunctionExists.c
/usr/share/cmake-3.5/Modules/CheckFunctionExists.c:6:1: warning: function declaration isn't a prototype [-Wstrict-prototypes]
 char CHECK_FUNCTION_EXISTS();
 ^
Linking C executable cmTC_48948
/usr/bin/cmake -E cmake_link_script CMakeFiles/cmTC_48948.dir/link.txt --verbose=1
/usr/bin/cc   -pthread -maes -march=x86-64 -fno-strict-aliasing -std=c11 -D_GNU_SOURCE   -Wall -Wextra -Wpointer-arith -Wundef -Wvla -Wwrite-strings -Wno-error=extra -Wno-error=deprecated-declarations -Wno-unused-parameter -Wno-unused-variable -Wno-error=unused-variable -Wno-error=undef -Wno-error=uninitialized -Wlogical-op -Wno-error=maybe-uninitialized -Wno-error=cpp -Waggregate-return -Wnested-externs -Wold-style-definition -Wstrict-prototypes  -fPIC  -Wformat -Wformat-security -fstack-protector -fstack-protector-strong -fno-strict-aliasing -DCHECK_FUNCTION_EXISTS=rl_copy_text    CMakeFiles/cmTC_48948.dir/CheckFunctionExists.c.o  -o cmTC_48948 -rdynamic /usr/lib/x86_64-linux-gnu/libreadline.a 
/usr/lib/x86_64-linux-gnu/libreadline.a(terminal.o): In function `_rl_get_screen_size':
(.text+0x283): undefined reference to `tgetnum'
/usr/lib/x86_64-linux-gnu/libreadline.a(terminal.o): In function `_rl_get_screen_size':
(.text+0x303): undefined reference to `tgetnum'
/usr/lib/x86_64-linux-gnu/libreadline.a(terminal.o): In function `_rl_init_terminal_io':
(.text+0x6fa): undefined reference to `PC'
/usr/lib/x86_64-linux-gnu/libreadline.a(terminal.o): In function `_rl_init_terminal_io':
(.text+0x70e): undefined reference to `BC'
/usr/lib/x86_64-linux-gnu/libreadline.a(terminal.o): In function `_rl_init_terminal_io':
(.text+0x718): undefined reference to `UP'
/usr/lib/x86_64-linux-gnu/libreadline.a(terminal.o): In function `_rl_init_terminal_io':
(.text+0x7a8): undefined reference to `tgetent'
/usr/lib/x86_64-linux-gnu/libreadline.a(terminal.o): In function `_rl_init_terminal_io':
(.text+0x7e7): undefined reference to `tgetstr'
/usr/lib/x86_64-linux-gnu/libreadline.a(terminal.o): In function `_rl_init_terminal_io':
(.text+0x817): undefined reference to `PC'
/usr/lib/x86_64-linux-gnu/libreadline.a(terminal.o): In function `_rl_init_terminal_io':
(.text+0x82e): undefined reference to `BC'
/usr/lib/x86_64-linux-gnu/libreadline.a(terminal.o): In function `_rl_init_terminal_io':
(.text+0x842): undefined reference to `UP'
/usr/lib/x86_64-linux-gnu/libreadline.a(terminal.o): In function `_rl_init_terminal_io':
(.text+0x857): undefined reference to `tgetflag'
/usr/lib/x86_64-linux-gnu/libreadline.a(terminal.o): In function `_rl_init_terminal_io':
(.text+0x8b1): undefined reference to `tgetflag'
/usr/lib/x86_64-linux-gnu/libreadline.a(terminal.o): In function `_rl_init_terminal_io':
(.text+0x91f): undefined reference to `tgetflag'
/usr/lib/x86_64-linux-gnu/libreadline.a(terminal.o): In function `_rl_init_terminal_io':
(.text+0x9fb): undefined reference to `tgetent'
/usr/lib/x86_64-linux-gnu/libreadline.a(terminal.o): In function `_rl_backspace':
(.text+0xc00): undefined reference to `tputs'
/usr/lib/x86_64-linux-gnu/libreadline.a(terminal.o): In function `rl_ding':
(.text+0xcaa): undefined reference to `tputs'
/usr/lib/x86_64-linux-gnu/libreadline.a(terminal.o): In function `_rl_enable_meta_key':
(.text+0xd17): undefined reference to `tputs'
/usr/lib/x86_64-linux-gnu/libreadline.a(terminal.o): In function `_rl_disable_meta_key':
(.text+0xd69): undefined reference to `tputs'
/usr/lib/x86_64-linux-gnu/libreadline.a(terminal.o): In function `_rl_control_keypad':
(.text+0xd9d): undefined reference to `tputs'
/usr/lib/x86_64-linux-gnu/libreadline.a(terminal.o):(.text+0xdf0): more undefined references to `tputs' follow
/usr/lib/x86_64-linux-gnu/libreadline.a(display.o): In function `update_line':
(.text+0x238e): undefined reference to `tgoto'
/usr/lib/x86_64-linux-gnu/libreadline.a(display.o): In function `update_line':
(.text+0x23a2): undefined reference to `tputs'
/usr/lib/x86_64-linux-gnu/libreadline.a(display.o): In function `update_line':
(.text+0x2520): undefined reference to `tputs'
/usr/lib/x86_64-linux-gnu/libreadline.a(display.o): In function `update_line':
(.text+0x2d49): undefined reference to `tputs'
/usr/lib/x86_64-linux-gnu/libreadline.a(display.o): In function `update_line':
(.text+0x2e7a): undefined reference to `tgoto'
/usr/lib/x86_64-linux-gnu/libreadline.a(display.o): In function `update_line':
(.text+0x2e8c): undefined reference to `tputs'
/usr/lib/x86_64-linux-gnu/libreadline.a(display.o): In function `update_line':
(.text+0x3056): undefined reference to `tputs'
/usr/lib/x86_64-linux-gnu/libreadline.a(display.o): In function `update_line':
(.text+0x309f): undefined reference to `tputs'
/usr/lib/x86_64-linux-gnu/libreadline.a(display.o): In function `update_line':
(.text+0x30d1): undefined reference to `tputs'
/usr/lib/x86_64-linux-gnu/libreadline.a(display.o): In function `rl_redisplay':
(.text+0x4813): undefined reference to `tputs'
/usr/lib/x86_64-linux-gnu/libreadline.a(display.o):(.text+0x4b2a): more undefined references to `tputs' follow
collect2: error: ld returned 1 exit status
CMakeFiles/cmTC_48948.dir/build.make:98: recipe for target 'cmTC_48948' failed
make[2]: *** [cmTC_48948] Error 1
make[2]: Leaving directory '/home/vagrant/slave/monero-static-ubuntu-amd64/build/build/release/CMakeFiles/CMakeTmp'
Makefile:126: recipe for target 'cmTC_48948/fast' failed
make[1]: *** [cmTC_48948/fast] Error 2
make[1]: Leaving directory '/home/vagrant/slave/monero-static-ubuntu-amd64/build/build/release/CMakeFiles/CMakeTmp'


Determining if the function rl_filename_completion_function exists failed with the following output:
Change Dir: /home/vagrant/slave/monero-static-ubuntu-amd64/build/build/release/CMakeFiles/CMakeTmp

Run Build Command:"/usr/bin/make" "cmTC_ae756/fast"
make[1]: Entering directory '/home/vagrant/slave/monero-static-ubuntu-amd64/build/build/release/CMakeFiles/CMakeTmp'
/usr/bin/make -f CMakeFiles/cmTC_ae756.dir/build.make CMakeFiles/cmTC_ae756.dir/build
make[2]: Entering directory '/home/vagrant/slave/monero-static-ubuntu-amd64/build/build/release/CMakeFiles/CMakeTmp'
Building C object CMakeFiles/cmTC_ae756.dir/CheckFunctionExists.c.o
/usr/bin/cc    -pthread -maes -march=x86-64 -fno-strict-aliasing -std=c11 -D_GNU_SOURCE   -Wall -Wextra -Wpointer-arith -Wundef -Wvla -Wwrite-strings -Wno-error=extra -Wno-error=deprecated-declarations -Wno-unused-parameter -Wno-unused-variable -Wno-error=unused-variable -Wno-error=undef -Wno-error=uninitialized -Wlogical-op -Wno-error=maybe-uninitialized -Wno-error=cpp -Waggregate-return -Wnested-externs -Wold-style-definition -Wstrict-prototypes  -fPIC  -Wformat -Wformat-security -fstack-protector -fstack-protector-strong -fno-strict-aliasing -DCHECK_FUNCTION_EXISTS=rl_filename_completion_function   -o CMakeFiles/cmTC_ae756.dir/CheckFunctionExists.c.o   -c /usr/share/cmake-3.5/Modules/CheckFunctionExists.c
/usr/share/cmake-3.5/Modules/CheckFunctionExists.c:6:1: warning: function declaration isn't a prototype [-Wstrict-prototypes]
 char CHECK_FUNCTION_EXISTS();
 ^
Linking C executable cmTC_ae756
/usr/bin/cmake -E cmake_link_script CMakeFiles/cmTC_ae756.dir/link.txt --verbose=1
/usr/bin/cc   -pthread -maes -march=x86-64 -fno-strict-aliasing -std=c11 -D_GNU_SOURCE   -Wall -Wextra -Wpointer-arith -Wundef -Wvla -Wwrite-strings -Wno-error=extra -Wno-error=deprecated-declarations -Wno-unused-parameter -Wno-unused-variable -Wno-error=unused-variable -Wno-error=undef -Wno-error=uninitialized -Wlogical-op -Wno-error=maybe-uninitialized -Wno-error=cpp -Waggregate-return -Wnested-externs -Wold-style-definition -Wstrict-prototypes  -fPIC  -Wformat -Wformat-security -fstack-protector -fstack-protector-strong -fno-strict-aliasing -DCHECK_FUNCTION_EXISTS=rl_filename_completion_function    CMakeFiles/cmTC_ae756.dir/CheckFunctionExists.c.o  -o cmTC_ae756 -rdynamic /usr/lib/x86_64-linux-gnu/libreadline.a 
/usr/lib/x86_64-linux-gnu/libreadline.a(display.o): In function `_rl_move_cursor_relative':
(.text+0xecc): undefined reference to `tputs'
/usr/lib/x86_64-linux-gnu/libreadline.a(display.o): In function `_rl_move_cursor_relative':
(.text+0xf2e): undefined reference to `tputs'
/usr/lib/x86_64-linux-gnu/libreadline.a(display.o): In function `_rl_move_cursor_relative':
(.text+0x1021): undefined reference to `tputs'
/usr/lib/x86_64-linux-gnu/libreadline.a(display.o): In function `_rl_move_vert':
(.text+0x10cc): undefined reference to `tputs'
/usr/lib/x86_64-linux-gnu/libreadline.a(display.o): In function `_rl_move_vert':
(.text+0x1128): undefined reference to `tputs'
/usr/lib/x86_64-linux-gnu/libreadline.a(display.o): In function `update_line':
(.text+0x238e): undefined reference to `tgoto'
/usr/lib/x86_64-linux-gnu/libreadline.a(display.o): In function `update_line':
(.text+0x23a2): undefined reference to `tputs'
/usr/lib/x86_64-linux-gnu/libreadline.a(display.o): In function `update_line':
(.text+0x2520): undefined reference to `tputs'
/usr/lib/x86_64-linux-gnu/libreadline.a(display.o): In function `update_line':
(.text+0x2d49): undefined reference to `tputs'
/usr/lib/x86_64-linux-gnu/libreadline.a(display.o): In function `update_line':
(.text+0x2e7a): undefined reference to `tgoto'
/usr/lib/x86_64-linux-gnu/libreadline.a(display.o): In function `update_line':
(.text+0x2e8c): undefined reference to `tputs'
/usr/lib/x86_64-linux-gnu/libreadline.a(display.o): In function `update_line':
(.text+0x3056): undefined reference to `tputs'
/usr/lib/x86_64-linux-gnu/libreadline.a(display.o): In function `update_line':
(.text+0x309f): undefined reference to `tputs'
/usr/lib/x86_64-linux-gnu/libreadline.a(display.o): In function `update_line':
(.text+0x30d1): undefined reference to `tputs'
/usr/lib/x86_64-linux-gnu/libreadline.a(display.o): In function `rl_redisplay':
(.text+0x4813): undefined reference to `tputs'
/usr/lib/x86_64-linux-gnu/libreadline.a(display.o):(.text+0x4b2a): more undefined references to `tputs' follow
/usr/lib/x86_64-linux-gnu/libreadline.a(terminal.o): In function `_rl_get_screen_size':
(.text+0x283): undefined reference to `tgetnum'
/usr/lib/x86_64-linux-gnu/libreadline.a(terminal.o): In function `_rl_get_screen_size':
(.text+0x303): undefined reference to `tgetnum'
/usr/lib/x86_64-linux-gnu/libreadline.a(terminal.o): In function `_rl_init_terminal_io':
(.text+0x6fa): undefined reference to `PC'
/usr/lib/x86_64-linux-gnu/libreadline.a(terminal.o): In function `_rl_init_terminal_io':
(.text+0x70e): undefined reference to `BC'
/usr/lib/x86_64-linux-gnu/libreadline.a(terminal.o): In function `_rl_init_terminal_io':
(.text+0x718): undefined reference to `UP'
/usr/lib/x86_64-linux-gnu/libreadline.a(terminal.o): In function `_rl_init_terminal_io':
(.text+0x7a8): undefined reference to `tgetent'
/usr/lib/x86_64-linux-gnu/libreadline.a(terminal.o): In function `_rl_init_terminal_io':
(.text+0x7e7): undefined reference to `tgetstr'
/usr/lib/x86_64-linux-gnu/libreadline.a(terminal.o): In function `_rl_init_terminal_io':
(.text+0x817): undefined reference to `PC'
/usr/lib/x86_64-linux-gnu/libreadline.a(terminal.o): In function `_rl_init_terminal_io':
(.text+0x82e): undefined reference to `BC'
/usr/lib/x86_64-linux-gnu/libreadline.a(terminal.o): In function `_rl_init_terminal_io':
(.text+0x842): undefined reference to `UP'
/usr/lib/x86_64-linux-gnu/libreadline.a(terminal.o): In function `_rl_init_terminal_io':
(.text+0x857): undefined reference to `tgetflag'
/usr/lib/x86_64-linux-gnu/libreadline.a(terminal.o): In function `_rl_init_terminal_io':
(.text+0x8b1): undefined reference to `tgetflag'
/usr/lib/x86_64-linux-gnu/libreadline.a(terminal.o): In function `_rl_init_terminal_io':
(.text+0x91f): undefined reference to `tgetflag'
/usr/lib/x86_64-linux-gnu/libreadline.a(terminal.o): In function `_rl_init_terminal_io':
(.text+0x9fb): undefined reference to `tgetent'
/usr/lib/x86_64-linux-gnu/libreadline.a(terminal.o): In function `_rl_backspace':
(.text+0xc00): undefined reference to `tputs'
/usr/lib/x86_64-linux-gnu/libreadline.a(terminal.o): In function `rl_ding':
(.text+0xcaa): undefined reference to `tputs'
/usr/lib/x86_64-linux-gnu/libreadline.a(terminal.o): In function `_rl_enable_meta_key':
(.text+0xd17): undefined reference to `tputs'
/usr/lib/x86_64-linux-gnu/libreadline.a(terminal.o): In function `_rl_disable_meta_key':
(.text+0xd69): undefined reference to `tputs'
/usr/lib/x86_64-linux-gnu/libreadline.a(terminal.o): In function `_rl_control_keypad':
(.text+0xd9d): undefined reference to `tputs'
/usr/lib/x86_64-linux-gnu/libreadline.a(terminal.o):(.text+0xdf0): more undefined references to `tputs' follow
collect2: error: ld returned 1 exit status
CMakeFiles/cmTC_ae756.dir/build.make:98: recipe for target 'cmTC_ae756' failed
make[2]: *** [cmTC_ae756] Error 1
make[2]: Leaving directory '/home/vagrant/slave/monero-static-ubuntu-amd64/build/build/release/CMakeFiles/CMakeTmp'
Makefile:126: recipe for target 'cmTC_ae756/fast' failed
make[1]: *** [cmTC_ae756/fast] Error 2
make[1]: Leaving directory '/home/vagrant/slave/monero-static-ubuntu-amd64/build/build/release/CMakeFiles/CMakeTmp'