(view as text)
Determining if the pthread_create exist failed with the following output:
Change Dir: /home/vagrant/slave/monero-static-ubuntu-amd64/build/build/release/CMakeFiles/CMakeTmp

Run Build Command:"/usr/bin/make" "cmTC_1b532/fast"
make[1]: Entering directory '/home/vagrant/slave/monero-static-ubuntu-amd64/build/build/release/CMakeFiles/CMakeTmp'
/usr/bin/make -f CMakeFiles/cmTC_1b532.dir/build.make CMakeFiles/cmTC_1b532.dir/build
make[2]: Entering directory '/home/vagrant/slave/monero-static-ubuntu-amd64/build/build/release/CMakeFiles/CMakeTmp'
Building C object CMakeFiles/cmTC_1b532.dir/CheckSymbolExists.c.o
/usr/bin/cc     -o CMakeFiles/cmTC_1b532.dir/CheckSymbolExists.c.o   -c /home/vagrant/slave/monero-static-ubuntu-amd64/build/build/release/CMakeFiles/CMakeTmp/CheckSymbolExists.c
Linking C executable cmTC_1b532
/usr/bin/cmake -E cmake_link_script CMakeFiles/cmTC_1b532.dir/link.txt --verbose=1
/usr/bin/cc       CMakeFiles/cmTC_1b532.dir/CheckSymbolExists.c.o  -o cmTC_1b532 -rdynamic 
CMakeFiles/cmTC_1b532.dir/CheckSymbolExists.c.o: In function `main':
CheckSymbolExists.c:(.text+0x16): undefined reference to `pthread_create'
collect2: error: ld returned 1 exit status
CMakeFiles/cmTC_1b532.dir/build.make:97: recipe for target 'cmTC_1b532' failed
make[2]: *** [cmTC_1b532] Error 1
make[2]: Leaving directory '/home/vagrant/slave/monero-static-ubuntu-amd64/build/build/release/CMakeFiles/CMakeTmp'
Makefile:126: recipe for target 'cmTC_1b532/fast' failed
make[1]: *** [cmTC_1b532/fast] Error 2
make[1]: Leaving directory '/home/vagrant/slave/monero-static-ubuntu-amd64/build/build/release/CMakeFiles/CMakeTmp'

File /home/vagrant/slave/monero-static-ubuntu-amd64/build/build/release/CMakeFiles/CMakeTmp/CheckSymbolExists.c:
/* */
#include <pthread.h>

int main(int argc, char** argv)
{
  (void)argv;
#ifndef pthread_create
  return ((int*)(&pthread_create))[argc];
#else
  (void)argc;
  return 0;
#endif
}

Determining if the function memset_s exists in the c failed with the following output:
Change Dir: /home/vagrant/slave/monero-static-ubuntu-amd64/build/build/release/CMakeFiles/CMakeTmp

Run Build Command:"/usr/bin/make" "cmTC_e80ef/fast"
make[1]: Entering directory '/home/vagrant/slave/monero-static-ubuntu-amd64/build/build/release/CMakeFiles/CMakeTmp'
/usr/bin/make -f CMakeFiles/cmTC_e80ef.dir/build.make CMakeFiles/cmTC_e80ef.dir/build
make[2]: Entering directory '/home/vagrant/slave/monero-static-ubuntu-amd64/build/build/release/CMakeFiles/CMakeTmp'
Building C object CMakeFiles/cmTC_e80ef.dir/CheckFunctionExists.c.o
/usr/bin/cc    -pthread -DCHECK_FUNCTION_EXISTS=memset_s   -o CMakeFiles/cmTC_e80ef.dir/CheckFunctionExists.c.o   -c /usr/share/cmake-3.5/Modules/CheckFunctionExists.c
Linking C executable cmTC_e80ef
/usr/bin/cmake -E cmake_link_script CMakeFiles/cmTC_e80ef.dir/link.txt --verbose=1
/usr/bin/cc   -pthread -DCHECK_FUNCTION_EXISTS=memset_s    CMakeFiles/cmTC_e80ef.dir/CheckFunctionExists.c.o  -o cmTC_e80ef  -L/home/vagrant/slave/monero-static-ubuntu-amd64/build/build/release/CMakeFiles/CMakeTmp/string.h -rdynamic -lc -Wl,-rpath,/home/vagrant/slave/monero-static-ubuntu-amd64/build/build/release/CMakeFiles/CMakeTmp/string.h 
CMakeFiles/cmTC_e80ef.dir/CheckFunctionExists.c.o: In function `main':
CheckFunctionExists.c:(.text+0x15): undefined reference to `memset_s'
collect2: error: ld returned 1 exit status
CMakeFiles/cmTC_e80ef.dir/build.make:97: recipe for target 'cmTC_e80ef' failed
make[2]: *** [cmTC_e80ef] Error 1
make[2]: Leaving directory '/home/vagrant/slave/monero-static-ubuntu-amd64/build/build/release/CMakeFiles/CMakeTmp'
Makefile:126: recipe for target 'cmTC_e80ef/fast' failed
make[1]: *** [cmTC_e80ef/fast] Error 2
make[1]: Leaving directory '/home/vagrant/slave/monero-static-ubuntu-amd64/build/build/release/CMakeFiles/CMakeTmp'


Determining if the function explicit_bzero exists in the c failed with the following output:
Change Dir: /home/vagrant/slave/monero-static-ubuntu-amd64/build/build/release/CMakeFiles/CMakeTmp

Run Build Command:"/usr/bin/make" "cmTC_f4516/fast"
make[1]: Entering directory '/home/vagrant/slave/monero-static-ubuntu-amd64/build/build/release/CMakeFiles/CMakeTmp'
/usr/bin/make -f CMakeFiles/cmTC_f4516.dir/build.make CMakeFiles/cmTC_f4516.dir/build
make[2]: Entering directory '/home/vagrant/slave/monero-static-ubuntu-amd64/build/build/release/CMakeFiles/CMakeTmp'
Building C object CMakeFiles/cmTC_f4516.dir/CheckFunctionExists.c.o
/usr/bin/cc    -pthread -DCHECK_FUNCTION_EXISTS=explicit_bzero   -o CMakeFiles/cmTC_f4516.dir/CheckFunctionExists.c.o   -c /usr/share/cmake-3.5/Modules/CheckFunctionExists.c
Linking C executable cmTC_f4516
/usr/bin/cmake -E cmake_link_script CMakeFiles/cmTC_f4516.dir/link.txt --verbose=1
/usr/bin/cc   -pthread -DCHECK_FUNCTION_EXISTS=explicit_bzero    CMakeFiles/cmTC_f4516.dir/CheckFunctionExists.c.o  -o cmTC_f4516  -L/home/vagrant/slave/monero-static-ubuntu-amd64/build/build/release/CMakeFiles/CMakeTmp/strings.h -rdynamic -lc -Wl,-rpath,/home/vagrant/slave/monero-static-ubuntu-amd64/build/build/release/CMakeFiles/CMakeTmp/strings.h 
CMakeFiles/cmTC_f4516.dir/CheckFunctionExists.c.o: In function `main':
CheckFunctionExists.c:(.text+0x15): undefined reference to `explicit_bzero'
collect2: error: ld returned 1 exit status
CMakeFiles/cmTC_f4516.dir/build.make:97: recipe for target 'cmTC_f4516' failed
make[2]: *** [cmTC_f4516] Error 1
make[2]: Leaving directory '/home/vagrant/slave/monero-static-ubuntu-amd64/build/build/release/CMakeFiles/CMakeTmp'
Makefile:126: recipe for target 'cmTC_f4516/fast' failed
make[1]: *** [cmTC_f4516/fast] Error 2
make[1]: Leaving directory '/home/vagrant/slave/monero-static-ubuntu-amd64/build/build/release/CMakeFiles/CMakeTmp'


Determining if the include file iphlpapi.h exists failed with the following output:
Change Dir: /home/vagrant/slave/monero-static-ubuntu-amd64/build/build/release/CMakeFiles/CMakeTmp

Run Build Command:"/usr/bin/make" "cmTC_48b23/fast"
make[1]: Entering directory '/home/vagrant/slave/monero-static-ubuntu-amd64/build/build/release/CMakeFiles/CMakeTmp'
/usr/bin/make -f CMakeFiles/cmTC_48b23.dir/build.make CMakeFiles/cmTC_48b23.dir/build
make[2]: Entering directory '/home/vagrant/slave/monero-static-ubuntu-amd64/build/build/release/CMakeFiles/CMakeTmp'
Building C object CMakeFiles/cmTC_48b23.dir/CheckIncludeFile.c.o
/usr/bin/cc    -pthread    -o CMakeFiles/cmTC_48b23.dir/CheckIncludeFile.c.o   -c /home/vagrant/slave/monero-static-ubuntu-amd64/build/build/release/CMakeFiles/CMakeTmp/CheckIncludeFile.c
/home/vagrant/slave/monero-static-ubuntu-amd64/build/build/release/CMakeFiles/CMakeTmp/CheckIncludeFile.c:1:22: fatal error: iphlpapi.h: No such file or directory
compilation terminated.
CMakeFiles/cmTC_48b23.dir/build.make:65: recipe for target 'CMakeFiles/cmTC_48b23.dir/CheckIncludeFile.c.o' failed
make[2]: *** [CMakeFiles/cmTC_48b23.dir/CheckIncludeFile.c.o] Error 1
make[2]: Leaving directory '/home/vagrant/slave/monero-static-ubuntu-amd64/build/build/release/CMakeFiles/CMakeTmp'
Makefile:126: recipe for target 'cmTC_48b23/fast' failed
make[1]: *** [cmTC_48b23/fast] Error 2
make[1]: Leaving directory '/home/vagrant/slave/monero-static-ubuntu-amd64/build/build/release/CMakeFiles/CMakeTmp'


Determining if the include file login_cap.h exists failed with the following output:
Change Dir: /home/vagrant/slave/monero-static-ubuntu-amd64/build/build/release/CMakeFiles/CMakeTmp

Run Build Command:"/usr/bin/make" "cmTC_3bc1b/fast"
make[1]: Entering directory '/home/vagrant/slave/monero-static-ubuntu-amd64/build/build/release/CMakeFiles/CMakeTmp'
/usr/bin/make -f CMakeFiles/cmTC_3bc1b.dir/build.make CMakeFiles/cmTC_3bc1b.dir/build
make[2]: Entering directory '/home/vagrant/slave/monero-static-ubuntu-amd64/build/build/release/CMakeFiles/CMakeTmp'
Building C object CMakeFiles/cmTC_3bc1b.dir/CheckIncludeFile.c.o
/usr/bin/cc    -pthread    -o CMakeFiles/cmTC_3bc1b.dir/CheckIncludeFile.c.o   -c /home/vagrant/slave/monero-static-ubuntu-amd64/build/build/release/CMakeFiles/CMakeTmp/CheckIncludeFile.c
/home/vagrant/slave/monero-static-ubuntu-amd64/build/build/release/CMakeFiles/CMakeTmp/CheckIncludeFile.c:1:23: fatal error: login_cap.h: No such file or directory
compilation terminated.
CMakeFiles/cmTC_3bc1b.dir/build.make:65: recipe for target 'CMakeFiles/cmTC_3bc1b.dir/CheckIncludeFile.c.o' failed
make[2]: *** [CMakeFiles/cmTC_3bc1b.dir/CheckIncludeFile.c.o] Error 1
make[2]: Leaving directory '/home/vagrant/slave/monero-static-ubuntu-amd64/build/build/release/CMakeFiles/CMakeTmp'
Makefile:126: recipe for target 'cmTC_3bc1b/fast' failed
make[1]: *** [cmTC_3bc1b/fast] Error 2
make[1]: Leaving directory '/home/vagrant/slave/monero-static-ubuntu-amd64/build/build/release/CMakeFiles/CMakeTmp'


Determining if the include file sys/sha2.h exists failed with the following output:
Change Dir: /home/vagrant/slave/monero-static-ubuntu-amd64/build/build/release/CMakeFiles/CMakeTmp

Run Build Command:"/usr/bin/make" "cmTC_66acf/fast"
make[1]: Entering directory '/home/vagrant/slave/monero-static-ubuntu-amd64/build/build/release/CMakeFiles/CMakeTmp'
/usr/bin/make -f CMakeFiles/cmTC_66acf.dir/build.make CMakeFiles/cmTC_66acf.dir/build
make[2]: Entering directory '/home/vagrant/slave/monero-static-ubuntu-amd64/build/build/release/CMakeFiles/CMakeTmp'
Building C object CMakeFiles/cmTC_66acf.dir/CheckIncludeFile.c.o
/usr/bin/cc    -pthread    -o CMakeFiles/cmTC_66acf.dir/CheckIncludeFile.c.o   -c /home/vagrant/slave/monero-static-ubuntu-amd64/build/build/release/CMakeFiles/CMakeTmp/CheckIncludeFile.c
/home/vagrant/slave/monero-static-ubuntu-amd64/build/build/release/CMakeFiles/CMakeTmp/CheckIncludeFile.c:1:22: fatal error: sys/sha2.h: No such file or directory
compilation terminated.
CMakeFiles/cmTC_66acf.dir/build.make:65: recipe for target 'CMakeFiles/cmTC_66acf.dir/CheckIncludeFile.c.o' failed
make[2]: *** [CMakeFiles/cmTC_66acf.dir/CheckIncludeFile.c.o] Error 1
make[2]: Leaving directory '/home/vagrant/slave/monero-static-ubuntu-amd64/build/build/release/CMakeFiles/CMakeTmp'
Makefile:126: recipe for target 'cmTC_66acf/fast' failed
make[1]: *** [cmTC_66acf/fast] Error 2
make[1]: Leaving directory '/home/vagrant/slave/monero-static-ubuntu-amd64/build/build/release/CMakeFiles/CMakeTmp'


Determining if the include file vfork.h exists failed with the following output:
Change Dir: /home/vagrant/slave/monero-static-ubuntu-amd64/build/build/release/CMakeFiles/CMakeTmp

Run Build Command:"/usr/bin/make" "cmTC_33f6f/fast"
make[1]: Entering directory '/home/vagrant/slave/monero-static-ubuntu-amd64/build/build/release/CMakeFiles/CMakeTmp'
/usr/bin/make -f CMakeFiles/cmTC_33f6f.dir/build.make CMakeFiles/cmTC_33f6f.dir/build
make[2]: Entering directory '/home/vagrant/slave/monero-static-ubuntu-amd64/build/build/release/CMakeFiles/CMakeTmp'
Building C object CMakeFiles/cmTC_33f6f.dir/CheckIncludeFile.c.o
/usr/bin/cc    -pthread    -o CMakeFiles/cmTC_33f6f.dir/CheckIncludeFile.c.o   -c /home/vagrant/slave/monero-static-ubuntu-amd64/build/build/release/CMakeFiles/CMakeTmp/CheckIncludeFile.c
/home/vagrant/slave/monero-static-ubuntu-amd64/build/build/release/CMakeFiles/CMakeTmp/CheckIncludeFile.c:1:19: fatal error: vfork.h: No such file or directory
compilation terminated.
CMakeFiles/cmTC_33f6f.dir/build.make:65: recipe for target 'CMakeFiles/cmTC_33f6f.dir/CheckIncludeFile.c.o' failed
make[2]: *** [CMakeFiles/cmTC_33f6f.dir/CheckIncludeFile.c.o] Error 1
make[2]: Leaving directory '/home/vagrant/slave/monero-static-ubuntu-amd64/build/build/release/CMakeFiles/CMakeTmp'
Makefile:126: recipe for target 'cmTC_33f6f/fast' failed
make[1]: *** [cmTC_33f6f/fast] Error 2
make[1]: Leaving directory '/home/vagrant/slave/monero-static-ubuntu-amd64/build/build/release/CMakeFiles/CMakeTmp'


Determining if the include file windows.h exists failed with the following output:
Change Dir: /home/vagrant/slave/monero-static-ubuntu-amd64/build/build/release/CMakeFiles/CMakeTmp

Run Build Command:"/usr/bin/make" "cmTC_81e05/fast"
make[1]: Entering directory '/home/vagrant/slave/monero-static-ubuntu-amd64/build/build/release/CMakeFiles/CMakeTmp'
/usr/bin/make -f CMakeFiles/cmTC_81e05.dir/build.make CMakeFiles/cmTC_81e05.dir/build
make[2]: Entering directory '/home/vagrant/slave/monero-static-ubuntu-amd64/build/build/release/CMakeFiles/CMakeTmp'
Building C object CMakeFiles/cmTC_81e05.dir/CheckIncludeFile.c.o
/usr/bin/cc    -pthread    -o CMakeFiles/cmTC_81e05.dir/CheckIncludeFile.c.o   -c /home/vagrant/slave/monero-static-ubuntu-amd64/build/build/release/CMakeFiles/CMakeTmp/CheckIncludeFile.c
/home/vagrant/slave/monero-static-ubuntu-amd64/build/build/release/CMakeFiles/CMakeTmp/CheckIncludeFile.c:1:21: fatal error: windows.h: No such file or directory
compilation terminated.
CMakeFiles/cmTC_81e05.dir/build.make:65: recipe for target 'CMakeFiles/cmTC_81e05.dir/CheckIncludeFile.c.o' failed
make[2]: *** [CMakeFiles/cmTC_81e05.dir/CheckIncludeFile.c.o] Error 1
make[2]: Leaving directory '/home/vagrant/slave/monero-static-ubuntu-amd64/build/build/release/CMakeFiles/CMakeTmp'
Makefile:126: recipe for target 'cmTC_81e05/fast' failed
make[1]: *** [cmTC_81e05/fast] Error 2
make[1]: Leaving directory '/home/vagrant/slave/monero-static-ubuntu-amd64/build/build/release/CMakeFiles/CMakeTmp'


Determining if the include file winsock2.h exists failed with the following output:
Change Dir: /home/vagrant/slave/monero-static-ubuntu-amd64/build/build/release/CMakeFiles/CMakeTmp

Run Build Command:"/usr/bin/make" "cmTC_ac227/fast"
make[1]: Entering directory '/home/vagrant/slave/monero-static-ubuntu-amd64/build/build/release/CMakeFiles/CMakeTmp'
/usr/bin/make -f CMakeFiles/cmTC_ac227.dir/build.make CMakeFiles/cmTC_ac227.dir/build
make[2]: Entering directory '/home/vagrant/slave/monero-static-ubuntu-amd64/build/build/release/CMakeFiles/CMakeTmp'
Building C object CMakeFiles/cmTC_ac227.dir/CheckIncludeFile.c.o
/usr/bin/cc    -pthread    -o CMakeFiles/cmTC_ac227.dir/CheckIncludeFile.c.o   -c /home/vagrant/slave/monero-static-ubuntu-amd64/build/build/release/CMakeFiles/CMakeTmp/CheckIncludeFile.c
/home/vagrant/slave/monero-static-ubuntu-amd64/build/build/release/CMakeFiles/CMakeTmp/CheckIncludeFile.c:1:22: fatal error: winsock2.h: No such file or directory
compilation terminated.
CMakeFiles/cmTC_ac227.dir/build.make:65: recipe for target 'CMakeFiles/cmTC_ac227.dir/CheckIncludeFile.c.o' failed
make[2]: *** [CMakeFiles/cmTC_ac227.dir/CheckIncludeFile.c.o] Error 1
make[2]: Leaving directory '/home/vagrant/slave/monero-static-ubuntu-amd64/build/build/release/CMakeFiles/CMakeTmp'
Makefile:126: recipe for target 'cmTC_ac227/fast' failed
make[1]: *** [cmTC_ac227/fast] Error 2
make[1]: Leaving directory '/home/vagrant/slave/monero-static-ubuntu-amd64/build/build/release/CMakeFiles/CMakeTmp'


Determining if the include file ws2tcpip.h exists failed with the following output:
Change Dir: /home/vagrant/slave/monero-static-ubuntu-amd64/build/build/release/CMakeFiles/CMakeTmp

Run Build Command:"/usr/bin/make" "cmTC_0e88f/fast"
make[1]: Entering directory '/home/vagrant/slave/monero-static-ubuntu-amd64/build/build/release/CMakeFiles/CMakeTmp'
/usr/bin/make -f CMakeFiles/cmTC_0e88f.dir/build.make CMakeFiles/cmTC_0e88f.dir/build
make[2]: Entering directory '/home/vagrant/slave/monero-static-ubuntu-amd64/build/build/release/CMakeFiles/CMakeTmp'
Building C object CMakeFiles/cmTC_0e88f.dir/CheckIncludeFile.c.o
/usr/bin/cc    -pthread    -o CMakeFiles/cmTC_0e88f.dir/CheckIncludeFile.c.o   -c /home/vagrant/slave/monero-static-ubuntu-amd64/build/build/release/CMakeFiles/CMakeTmp/CheckIncludeFile.c
/home/vagrant/slave/monero-static-ubuntu-amd64/build/build/release/CMakeFiles/CMakeTmp/CheckIncludeFile.c:1:22: fatal error: ws2tcpip.h: No such file or directory
compilation terminated.
CMakeFiles/cmTC_0e88f.dir/build.make:65: recipe for target 'CMakeFiles/cmTC_0e88f.dir/CheckIncludeFile.c.o' failed
make[2]: *** [CMakeFiles/cmTC_0e88f.dir/CheckIncludeFile.c.o] Error 1
make[2]: Leaving directory '/home/vagrant/slave/monero-static-ubuntu-amd64/build/build/release/CMakeFiles/CMakeTmp'
Makefile:126: recipe for target 'cmTC_0e88f/fast' failed
make[1]: *** [cmTC_0e88f/fast] Error 2
make[1]: Leaving directory '/home/vagrant/slave/monero-static-ubuntu-amd64/build/build/release/CMakeFiles/CMakeTmp'


Determining if the function _beginthreadex exists failed with the following output:
Change Dir: /home/vagrant/slave/monero-static-ubuntu-amd64/build/build/release/CMakeFiles/CMakeTmp

Run Build Command:"/usr/bin/make" "cmTC_19354/fast"
make[1]: Entering directory '/home/vagrant/slave/monero-static-ubuntu-amd64/build/build/release/CMakeFiles/CMakeTmp'
/usr/bin/make -f CMakeFiles/cmTC_19354.dir/build.make CMakeFiles/cmTC_19354.dir/build
make[2]: Entering directory '/home/vagrant/slave/monero-static-ubuntu-amd64/build/build/release/CMakeFiles/CMakeTmp'
Building C object CMakeFiles/cmTC_19354.dir/CheckFunctionExists.c.o
/usr/bin/cc    -pthread -DCHECK_FUNCTION_EXISTS=_beginthreadex   -o CMakeFiles/cmTC_19354.dir/CheckFunctionExists.c.o   -c /usr/share/cmake-3.5/Modules/CheckFunctionExists.c
Linking C executable cmTC_19354
/usr/bin/cmake -E cmake_link_script CMakeFiles/cmTC_19354.dir/link.txt --verbose=1
/usr/bin/cc   -pthread -DCHECK_FUNCTION_EXISTS=_beginthreadex    CMakeFiles/cmTC_19354.dir/CheckFunctionExists.c.o  -o cmTC_19354 -rdynamic 
CMakeFiles/cmTC_19354.dir/CheckFunctionExists.c.o: In function `main':
CheckFunctionExists.c:(.text+0x15): undefined reference to `_beginthreadex'
collect2: error: ld returned 1 exit status
CMakeFiles/cmTC_19354.dir/build.make:97: recipe for target 'cmTC_19354' failed
make[2]: *** [cmTC_19354] Error 1
make[2]: Leaving directory '/home/vagrant/slave/monero-static-ubuntu-amd64/build/build/release/CMakeFiles/CMakeTmp'
Makefile:126: recipe for target 'cmTC_19354/fast' failed
make[1]: *** [cmTC_19354/fast] Error 2
make[1]: Leaving directory '/home/vagrant/slave/monero-static-ubuntu-amd64/build/build/release/CMakeFiles/CMakeTmp'


Determining if the function arc4random exists failed with the following output:
Change Dir: /home/vagrant/slave/monero-static-ubuntu-amd64/build/build/release/CMakeFiles/CMakeTmp

Run Build Command:"/usr/bin/make" "cmTC_43b01/fast"
make[1]: Entering directory '/home/vagrant/slave/monero-static-ubuntu-amd64/build/build/release/CMakeFiles/CMakeTmp'
/usr/bin/make -f CMakeFiles/cmTC_43b01.dir/build.make CMakeFiles/cmTC_43b01.dir/build
make[2]: Entering directory '/home/vagrant/slave/monero-static-ubuntu-amd64/build/build/release/CMakeFiles/CMakeTmp'
Building C object CMakeFiles/cmTC_43b01.dir/CheckFunctionExists.c.o
/usr/bin/cc    -pthread -DCHECK_FUNCTION_EXISTS=arc4random   -o CMakeFiles/cmTC_43b01.dir/CheckFunctionExists.c.o   -c /usr/share/cmake-3.5/Modules/CheckFunctionExists.c
Linking C executable cmTC_43b01
/usr/bin/cmake -E cmake_link_script CMakeFiles/cmTC_43b01.dir/link.txt --verbose=1
/usr/bin/cc   -pthread -DCHECK_FUNCTION_EXISTS=arc4random    CMakeFiles/cmTC_43b01.dir/CheckFunctionExists.c.o  -o cmTC_43b01 -rdynamic 
CMakeFiles/cmTC_43b01.dir/CheckFunctionExists.c.o: In function `main':
CheckFunctionExists.c:(.text+0x15): undefined reference to `arc4random'
collect2: error: ld returned 1 exit status
CMakeFiles/cmTC_43b01.dir/build.make:97: recipe for target 'cmTC_43b01' failed
make[2]: *** [cmTC_43b01] Error 1
make[2]: Leaving directory '/home/vagrant/slave/monero-static-ubuntu-amd64/build/build/release/CMakeFiles/CMakeTmp'
Makefile:126: recipe for target 'cmTC_43b01/fast' failed
make[1]: *** [cmTC_43b01/fast] Error 2
make[1]: Leaving directory '/home/vagrant/slave/monero-static-ubuntu-amd64/build/build/release/CMakeFiles/CMakeTmp'


Determining if the function arc4random_uniform exists failed with the following output:
Change Dir: /home/vagrant/slave/monero-static-ubuntu-amd64/build/build/release/CMakeFiles/CMakeTmp

Run Build Command:"/usr/bin/make" "cmTC_66931/fast"
make[1]: Entering directory '/home/vagrant/slave/monero-static-ubuntu-amd64/build/build/release/CMakeFiles/CMakeTmp'
/usr/bin/make -f CMakeFiles/cmTC_66931.dir/build.make CMakeFiles/cmTC_66931.dir/build
make[2]: Entering directory '/home/vagrant/slave/monero-static-ubuntu-amd64/build/build/release/CMakeFiles/CMakeTmp'
Building C object CMakeFiles/cmTC_66931.dir/CheckFunctionExists.c.o
/usr/bin/cc    -pthread -DCHECK_FUNCTION_EXISTS=arc4random_uniform   -o CMakeFiles/cmTC_66931.dir/CheckFunctionExists.c.o   -c /usr/share/cmake-3.5/Modules/CheckFunctionExists.c
Linking C executable cmTC_66931
/usr/bin/cmake -E cmake_link_script CMakeFiles/cmTC_66931.dir/link.txt --verbose=1
/usr/bin/cc   -pthread -DCHECK_FUNCTION_EXISTS=arc4random_uniform    CMakeFiles/cmTC_66931.dir/CheckFunctionExists.c.o  -o cmTC_66931 -rdynamic 
CMakeFiles/cmTC_66931.dir/CheckFunctionExists.c.o: In function `main':
CheckFunctionExists.c:(.text+0x15): undefined reference to `arc4random_uniform'
collect2: error: ld returned 1 exit status
CMakeFiles/cmTC_66931.dir/build.make:97: recipe for target 'cmTC_66931' failed
make[2]: *** [cmTC_66931] Error 1
make[2]: Leaving directory '/home/vagrant/slave/monero-static-ubuntu-amd64/build/build/release/CMakeFiles/CMakeTmp'
Makefile:126: recipe for target 'cmTC_66931/fast' failed
make[1]: *** [cmTC_66931/fast] Error 2
make[1]: Leaving directory '/home/vagrant/slave/monero-static-ubuntu-amd64/build/build/release/CMakeFiles/CMakeTmp'


Determining if the function getentropy exists failed with the following output:
Change Dir: /home/vagrant/slave/monero-static-ubuntu-amd64/build/build/release/CMakeFiles/CMakeTmp

Run Build Command:"/usr/bin/make" "cmTC_f6385/fast"
make[1]: Entering directory '/home/vagrant/slave/monero-static-ubuntu-amd64/build/build/release/CMakeFiles/CMakeTmp'
/usr/bin/make -f CMakeFiles/cmTC_f6385.dir/build.make CMakeFiles/cmTC_f6385.dir/build
make[2]: Entering directory '/home/vagrant/slave/monero-static-ubuntu-amd64/build/build/release/CMakeFiles/CMakeTmp'
Building C object CMakeFiles/cmTC_f6385.dir/CheckFunctionExists.c.o
/usr/bin/cc    -pthread -DCHECK_FUNCTION_EXISTS=getentropy   -o CMakeFiles/cmTC_f6385.dir/CheckFunctionExists.c.o   -c /usr/share/cmake-3.5/Modules/CheckFunctionExists.c
Linking C executable cmTC_f6385
/usr/bin/cmake -E cmake_link_script CMakeFiles/cmTC_f6385.dir/link.txt --verbose=1
/usr/bin/cc   -pthread -DCHECK_FUNCTION_EXISTS=getentropy    CMakeFiles/cmTC_f6385.dir/CheckFunctionExists.c.o  -o cmTC_f6385 -rdynamic 
CMakeFiles/cmTC_f6385.dir/CheckFunctionExists.c.o: In function `main':
CheckFunctionExists.c:(.text+0x15): undefined reference to `getentropy'
collect2: error: ld returned 1 exit status
CMakeFiles/cmTC_f6385.dir/build.make:97: recipe for target 'cmTC_f6385' failed
make[2]: *** [cmTC_f6385] Error 1
make[2]: Leaving directory '/home/vagrant/slave/monero-static-ubuntu-amd64/build/build/release/CMakeFiles/CMakeTmp'
Makefile:126: recipe for target 'cmTC_f6385/fast' failed
make[1]: *** [cmTC_f6385/fast] Error 2
make[1]: Leaving directory '/home/vagrant/slave/monero-static-ubuntu-amd64/build/build/release/CMakeFiles/CMakeTmp'


Determining if the function ioctlsocket exists failed with the following output:
Change Dir: /home/vagrant/slave/monero-static-ubuntu-amd64/build/build/release/CMakeFiles/CMakeTmp

Run Build Command:"/usr/bin/make" "cmTC_708ad/fast"
make[1]: Entering directory '/home/vagrant/slave/monero-static-ubuntu-amd64/build/build/release/CMakeFiles/CMakeTmp'
/usr/bin/make -f CMakeFiles/cmTC_708ad.dir/build.make CMakeFiles/cmTC_708ad.dir/build
make[2]: Entering directory '/home/vagrant/slave/monero-static-ubuntu-amd64/build/build/release/CMakeFiles/CMakeTmp'
Building C object CMakeFiles/cmTC_708ad.dir/CheckFunctionExists.c.o
/usr/bin/cc    -pthread -DCHECK_FUNCTION_EXISTS=ioctlsocket   -o CMakeFiles/cmTC_708ad.dir/CheckFunctionExists.c.o   -c /usr/share/cmake-3.5/Modules/CheckFunctionExists.c
Linking C executable cmTC_708ad
/usr/bin/cmake -E cmake_link_script CMakeFiles/cmTC_708ad.dir/link.txt --verbose=1
/usr/bin/cc   -pthread -DCHECK_FUNCTION_EXISTS=ioctlsocket    CMakeFiles/cmTC_708ad.dir/CheckFunctionExists.c.o  -o cmTC_708ad -rdynamic 
CMakeFiles/cmTC_708ad.dir/CheckFunctionExists.c.o: In function `main':
CheckFunctionExists.c:(.text+0x15): undefined reference to `ioctlsocket'
collect2: error: ld returned 1 exit status
CMakeFiles/cmTC_708ad.dir/build.make:97: recipe for target 'cmTC_708ad' failed
make[2]: *** [cmTC_708ad] Error 1
make[2]: Leaving directory '/home/vagrant/slave/monero-static-ubuntu-amd64/build/build/release/CMakeFiles/CMakeTmp'
Makefile:126: recipe for target 'cmTC_708ad/fast' failed
make[1]: *** [cmTC_708ad/fast] Error 2
make[1]: Leaving directory '/home/vagrant/slave/monero-static-ubuntu-amd64/build/build/release/CMakeFiles/CMakeTmp'


Determining if the function reallocarray exists failed with the following output:
Change Dir: /home/vagrant/slave/monero-static-ubuntu-amd64/build/build/release/CMakeFiles/CMakeTmp

Run Build Command:"/usr/bin/make" "cmTC_8ae29/fast"
make[1]: Entering directory '/home/vagrant/slave/monero-static-ubuntu-amd64/build/build/release/CMakeFiles/CMakeTmp'
/usr/bin/make -f CMakeFiles/cmTC_8ae29.dir/build.make CMakeFiles/cmTC_8ae29.dir/build
make[2]: Entering directory '/home/vagrant/slave/monero-static-ubuntu-amd64/build/build/release/CMakeFiles/CMakeTmp'
Building C object CMakeFiles/cmTC_8ae29.dir/CheckFunctionExists.c.o
/usr/bin/cc    -pthread -DCHECK_FUNCTION_EXISTS=reallocarray   -o CMakeFiles/cmTC_8ae29.dir/CheckFunctionExists.c.o   -c /usr/share/cmake-3.5/Modules/CheckFunctionExists.c
Linking C executable cmTC_8ae29
/usr/bin/cmake -E cmake_link_script CMakeFiles/cmTC_8ae29.dir/link.txt --verbose=1
/usr/bin/cc   -pthread -DCHECK_FUNCTION_EXISTS=reallocarray    CMakeFiles/cmTC_8ae29.dir/CheckFunctionExists.c.o  -o cmTC_8ae29 -rdynamic 
CMakeFiles/cmTC_8ae29.dir/CheckFunctionExists.c.o: In function `main':
CheckFunctionExists.c:(.text+0x15): undefined reference to `reallocarray'
collect2: error: ld returned 1 exit status
CMakeFiles/cmTC_8ae29.dir/build.make:97: recipe for target 'cmTC_8ae29' failed
make[2]: *** [cmTC_8ae29] Error 1
make[2]: Leaving directory '/home/vagrant/slave/monero-static-ubuntu-amd64/build/build/release/CMakeFiles/CMakeTmp'
Makefile:126: recipe for target 'cmTC_8ae29/fast' failed
make[1]: *** [cmTC_8ae29/fast] Error 2
make[1]: Leaving directory '/home/vagrant/slave/monero-static-ubuntu-amd64/build/build/release/CMakeFiles/CMakeTmp'


Determining if the function setusercontent exists failed with the following output:
Change Dir: /home/vagrant/slave/monero-static-ubuntu-amd64/build/build/release/CMakeFiles/CMakeTmp

Run Build Command:"/usr/bin/make" "cmTC_8c843/fast"
make[1]: Entering directory '/home/vagrant/slave/monero-static-ubuntu-amd64/build/build/release/CMakeFiles/CMakeTmp'
/usr/bin/make -f CMakeFiles/cmTC_8c843.dir/build.make CMakeFiles/cmTC_8c843.dir/build
make[2]: Entering directory '/home/vagrant/slave/monero-static-ubuntu-amd64/build/build/release/CMakeFiles/CMakeTmp'
Building C object CMakeFiles/cmTC_8c843.dir/CheckFunctionExists.c.o
/usr/bin/cc    -pthread -DCHECK_FUNCTION_EXISTS=setusercontent   -o CMakeFiles/cmTC_8c843.dir/CheckFunctionExists.c.o   -c /usr/share/cmake-3.5/Modules/CheckFunctionExists.c
Linking C executable cmTC_8c843
/usr/bin/cmake -E cmake_link_script CMakeFiles/cmTC_8c843.dir/link.txt --verbose=1
/usr/bin/cc   -pthread -DCHECK_FUNCTION_EXISTS=setusercontent    CMakeFiles/cmTC_8c843.dir/CheckFunctionExists.c.o  -o cmTC_8c843 -rdynamic 
CMakeFiles/cmTC_8c843.dir/CheckFunctionExists.c.o: In function `main':
CheckFunctionExists.c:(.text+0x15): undefined reference to `setusercontent'
collect2: error: ld returned 1 exit status
CMakeFiles/cmTC_8c843.dir/build.make:97: recipe for target 'cmTC_8c843' failed
make[2]: *** [cmTC_8c843] Error 1
make[2]: Leaving directory '/home/vagrant/slave/monero-static-ubuntu-amd64/build/build/release/CMakeFiles/CMakeTmp'
Makefile:126: recipe for target 'cmTC_8c843/fast' failed
make[1]: *** [cmTC_8c843/fast] Error 2
make[1]: Leaving directory '/home/vagrant/slave/monero-static-ubuntu-amd64/build/build/release/CMakeFiles/CMakeTmp'


Determining if the function strlcat exists failed with the following output:
Change Dir: /home/vagrant/slave/monero-static-ubuntu-amd64/build/build/release/CMakeFiles/CMakeTmp

Run Build Command:"/usr/bin/make" "cmTC_3fd90/fast"
make[1]: Entering directory '/home/vagrant/slave/monero-static-ubuntu-amd64/build/build/release/CMakeFiles/CMakeTmp'
/usr/bin/make -f CMakeFiles/cmTC_3fd90.dir/build.make CMakeFiles/cmTC_3fd90.dir/build
make[2]: Entering directory '/home/vagrant/slave/monero-static-ubuntu-amd64/build/build/release/CMakeFiles/CMakeTmp'
Building C object CMakeFiles/cmTC_3fd90.dir/CheckFunctionExists.c.o
/usr/bin/cc    -pthread -DCHECK_FUNCTION_EXISTS=strlcat   -o CMakeFiles/cmTC_3fd90.dir/CheckFunctionExists.c.o   -c /usr/share/cmake-3.5/Modules/CheckFunctionExists.c
Linking C executable cmTC_3fd90
/usr/bin/cmake -E cmake_link_script CMakeFiles/cmTC_3fd90.dir/link.txt --verbose=1
/usr/bin/cc   -pthread -DCHECK_FUNCTION_EXISTS=strlcat    CMakeFiles/cmTC_3fd90.dir/CheckFunctionExists.c.o  -o cmTC_3fd90 -rdynamic 
CMakeFiles/cmTC_3fd90.dir/CheckFunctionExists.c.o: In function `main':
CheckFunctionExists.c:(.text+0x15): undefined reference to `strlcat'
collect2: error: ld returned 1 exit status
CMakeFiles/cmTC_3fd90.dir/build.make:97: recipe for target 'cmTC_3fd90' failed
make[2]: *** [cmTC_3fd90] Error 1
make[2]: Leaving directory '/home/vagrant/slave/monero-static-ubuntu-amd64/build/build/release/CMakeFiles/CMakeTmp'
Makefile:126: recipe for target 'cmTC_3fd90/fast' failed
make[1]: *** [cmTC_3fd90/fast] Error 2
make[1]: Leaving directory '/home/vagrant/slave/monero-static-ubuntu-amd64/build/build/release/CMakeFiles/CMakeTmp'


Determining if the function strlcpy exists failed with the following output:
Change Dir: /home/vagrant/slave/monero-static-ubuntu-amd64/build/build/release/CMakeFiles/CMakeTmp

Run Build Command:"/usr/bin/make" "cmTC_b904c/fast"
make[1]: Entering directory '/home/vagrant/slave/monero-static-ubuntu-amd64/build/build/release/CMakeFiles/CMakeTmp'
/usr/bin/make -f CMakeFiles/cmTC_b904c.dir/build.make CMakeFiles/cmTC_b904c.dir/build
make[2]: Entering directory '/home/vagrant/slave/monero-static-ubuntu-amd64/build/build/release/CMakeFiles/CMakeTmp'
Building C object CMakeFiles/cmTC_b904c.dir/CheckFunctionExists.c.o
/usr/bin/cc    -pthread -DCHECK_FUNCTION_EXISTS=strlcpy   -o CMakeFiles/cmTC_b904c.dir/CheckFunctionExists.c.o   -c /usr/share/cmake-3.5/Modules/CheckFunctionExists.c
Linking C executable cmTC_b904c
/usr/bin/cmake -E cmake_link_script CMakeFiles/cmTC_b904c.dir/link.txt --verbose=1
/usr/bin/cc   -pthread -DCHECK_FUNCTION_EXISTS=strlcpy    CMakeFiles/cmTC_b904c.dir/CheckFunctionExists.c.o  -o cmTC_b904c -rdynamic 
CMakeFiles/cmTC_b904c.dir/CheckFunctionExists.c.o: In function `main':
CheckFunctionExists.c:(.text+0x15): undefined reference to `strlcpy'
collect2: error: ld returned 1 exit status
CMakeFiles/cmTC_b904c.dir/build.make:97: recipe for target 'cmTC_b904c' failed
make[2]: *** [cmTC_b904c] Error 1
make[2]: Leaving directory '/home/vagrant/slave/monero-static-ubuntu-amd64/build/build/release/CMakeFiles/CMakeTmp'
Makefile:126: recipe for target 'cmTC_b904c/fast' failed
make[1]: *** [cmTC_b904c/fast] Error 2
make[1]: Leaving directory '/home/vagrant/slave/monero-static-ubuntu-amd64/build/build/release/CMakeFiles/CMakeTmp'


Determining if the PTHREAD_PRIO_INHERIT exist failed with the following output:
Change Dir: /home/vagrant/slave/monero-static-ubuntu-amd64/build/build/release/CMakeFiles/CMakeTmp

Run Build Command:"/usr/bin/make" "cmTC_02e1f/fast"
make[1]: Entering directory '/home/vagrant/slave/monero-static-ubuntu-amd64/build/build/release/CMakeFiles/CMakeTmp'
/usr/bin/make -f CMakeFiles/cmTC_02e1f.dir/build.make CMakeFiles/cmTC_02e1f.dir/build
make[2]: Entering directory '/home/vagrant/slave/monero-static-ubuntu-amd64/build/build/release/CMakeFiles/CMakeTmp'
Building C object CMakeFiles/cmTC_02e1f.dir/CheckSymbolExists.c.o
/usr/bin/cc    -pthread    -o CMakeFiles/cmTC_02e1f.dir/CheckSymbolExists.c.o   -c /home/vagrant/slave/monero-static-ubuntu-amd64/build/build/release/CMakeFiles/CMakeTmp/CheckSymbolExists.c
/home/vagrant/slave/monero-static-ubuntu-amd64/build/build/release/CMakeFiles/CMakeTmp/CheckSymbolExists.c: In function 'main':
/home/vagrant/slave/monero-static-ubuntu-amd64/build/build/release/CMakeFiles/CMakeTmp/CheckSymbolExists.c:8:18: error: lvalue required as unary '&' operand
   return ((int*)(&PTHREAD_PRIO_INHERIT))[argc];
                  ^
CMakeFiles/cmTC_02e1f.dir/build.make:65: recipe for target 'CMakeFiles/cmTC_02e1f.dir/CheckSymbolExists.c.o' failed
make[2]: *** [CMakeFiles/cmTC_02e1f.dir/CheckSymbolExists.c.o] Error 1
make[2]: Leaving directory '/home/vagrant/slave/monero-static-ubuntu-amd64/build/build/release/CMakeFiles/CMakeTmp'
Makefile:126: recipe for target 'cmTC_02e1f/fast' failed
make[1]: *** [cmTC_02e1f/fast] Error 2
make[1]: Leaving directory '/home/vagrant/slave/monero-static-ubuntu-amd64/build/build/release/CMakeFiles/CMakeTmp'

File /home/vagrant/slave/monero-static-ubuntu-amd64/build/build/release/CMakeFiles/CMakeTmp/CheckSymbolExists.c:
/* */
#include <pthread.h>

int main(int argc, char** argv)
{
  (void)argv;
#ifndef PTHREAD_PRIO_INHERIT
  return ((int*)(&PTHREAD_PRIO_INHERIT))[argc];
#else
  (void)argc;
  return 0;
#endif
}

Determining if the pthread_rwlock_t exist failed with the following output:
Change Dir: /home/vagrant/slave/monero-static-ubuntu-amd64/build/build/release/CMakeFiles/CMakeTmp

Run Build Command:"/usr/bin/make" "cmTC_6ba61/fast"
make[1]: Entering directory '/home/vagrant/slave/monero-static-ubuntu-amd64/build/build/release/CMakeFiles/CMakeTmp'
/usr/bin/make -f CMakeFiles/cmTC_6ba61.dir/build.make CMakeFiles/cmTC_6ba61.dir/build
make[2]: Entering directory '/home/vagrant/slave/monero-static-ubuntu-amd64/build/build/release/CMakeFiles/CMakeTmp'
Building C object CMakeFiles/cmTC_6ba61.dir/CheckSymbolExists.c.o
/usr/bin/cc    -pthread    -o CMakeFiles/cmTC_6ba61.dir/CheckSymbolExists.c.o   -c /home/vagrant/slave/monero-static-ubuntu-amd64/build/build/release/CMakeFiles/CMakeTmp/CheckSymbolExists.c
/home/vagrant/slave/monero-static-ubuntu-amd64/build/build/release/CMakeFiles/CMakeTmp/CheckSymbolExists.c: In function 'main':
/home/vagrant/slave/monero-static-ubuntu-amd64/build/build/release/CMakeFiles/CMakeTmp/CheckSymbolExists.c:8:19: error: expected expression before 'pthread_rwlock_t'
   return ((int*)(&pthread_rwlock_t))[argc];
                   ^
CMakeFiles/cmTC_6ba61.dir/build.make:65: recipe for target 'CMakeFiles/cmTC_6ba61.dir/CheckSymbolExists.c.o' failed
make[2]: *** [CMakeFiles/cmTC_6ba61.dir/CheckSymbolExists.c.o] Error 1
make[2]: Leaving directory '/home/vagrant/slave/monero-static-ubuntu-amd64/build/build/release/CMakeFiles/CMakeTmp'
Makefile:126: recipe for target 'cmTC_6ba61/fast' failed
make[1]: *** [cmTC_6ba61/fast] Error 2
make[1]: Leaving directory '/home/vagrant/slave/monero-static-ubuntu-amd64/build/build/release/CMakeFiles/CMakeTmp'

File /home/vagrant/slave/monero-static-ubuntu-amd64/build/build/release/CMakeFiles/CMakeTmp/CheckSymbolExists.c:
/* */
#include <pthread.h>

int main(int argc, char** argv)
{
  (void)argv;
#ifndef pthread_rwlock_t
  return ((int*)(&pthread_rwlock_t))[argc];
#else
  (void)argc;
  return 0;
#endif
}

Determining if the pthread_spinlock_t exist failed with the following output:
Change Dir: /home/vagrant/slave/monero-static-ubuntu-amd64/build/build/release/CMakeFiles/CMakeTmp

Run Build Command:"/usr/bin/make" "cmTC_fe608/fast"
make[1]: Entering directory '/home/vagrant/slave/monero-static-ubuntu-amd64/build/build/release/CMakeFiles/CMakeTmp'
/usr/bin/make -f CMakeFiles/cmTC_fe608.dir/build.make CMakeFiles/cmTC_fe608.dir/build
make[2]: Entering directory '/home/vagrant/slave/monero-static-ubuntu-amd64/build/build/release/CMakeFiles/CMakeTmp'
Building C object CMakeFiles/cmTC_fe608.dir/CheckSymbolExists.c.o
/usr/bin/cc    -pthread    -o CMakeFiles/cmTC_fe608.dir/CheckSymbolExists.c.o   -c /home/vagrant/slave/monero-static-ubuntu-amd64/build/build/release/CMakeFiles/CMakeTmp/CheckSymbolExists.c
/home/vagrant/slave/monero-static-ubuntu-amd64/build/build/release/CMakeFiles/CMakeTmp/CheckSymbolExists.c: In function 'main':
/home/vagrant/slave/monero-static-ubuntu-amd64/build/build/release/CMakeFiles/CMakeTmp/CheckSymbolExists.c:8:19: error: expected expression before 'pthread_spinlock_t'
   return ((int*)(&pthread_spinlock_t))[argc];
                   ^
CMakeFiles/cmTC_fe608.dir/build.make:65: recipe for target 'CMakeFiles/cmTC_fe608.dir/CheckSymbolExists.c.o' failed
make[2]: *** [CMakeFiles/cmTC_fe608.dir/CheckSymbolExists.c.o] Error 1
make[2]: Leaving directory '/home/vagrant/slave/monero-static-ubuntu-amd64/build/build/release/CMakeFiles/CMakeTmp'
Makefile:126: recipe for target 'cmTC_fe608/fast' failed
make[1]: *** [cmTC_fe608/fast] Error 2
make[1]: Leaving directory '/home/vagrant/slave/monero-static-ubuntu-amd64/build/build/release/CMakeFiles/CMakeTmp'

File /home/vagrant/slave/monero-static-ubuntu-amd64/build/build/release/CMakeFiles/CMakeTmp/CheckSymbolExists.c:
/* */
#include <pthread.h>

int main(int argc, char** argv)
{
  (void)argv;
#ifndef pthread_spinlock_t
  return ((int*)(&pthread_spinlock_t))[argc];
#else
  (void)argc;
  return 0;
#endif
}

Determining if the function EVP_MD_CTX_new exists failed with the following output:
Change Dir: /home/vagrant/slave/monero-static-ubuntu-amd64/build/build/release/CMakeFiles/CMakeTmp

Run Build Command:"/usr/bin/make" "cmTC_b34da/fast"
make[1]: Entering directory '/home/vagrant/slave/monero-static-ubuntu-amd64/build/build/release/CMakeFiles/CMakeTmp'
/usr/bin/make -f CMakeFiles/cmTC_b34da.dir/build.make CMakeFiles/cmTC_b34da.dir/build
make[2]: Entering directory '/home/vagrant/slave/monero-static-ubuntu-amd64/build/build/release/CMakeFiles/CMakeTmp'
Building C object CMakeFiles/cmTC_b34da.dir/CheckFunctionExists.c.o
/usr/bin/cc    -pthread -DCHECK_FUNCTION_EXISTS=EVP_MD_CTX_new   -o CMakeFiles/cmTC_b34da.dir/CheckFunctionExists.c.o   -c /usr/share/cmake-3.5/Modules/CheckFunctionExists.c
Linking C executable cmTC_b34da
/usr/bin/cmake -E cmake_link_script CMakeFiles/cmTC_b34da.dir/link.txt --verbose=1
/usr/bin/cc   -pthread -DCHECK_FUNCTION_EXISTS=EVP_MD_CTX_new    CMakeFiles/cmTC_b34da.dir/CheckFunctionExists.c.o  -o cmTC_b34da -rdynamic /usr/lib/x86_64-linux-gnu/libssl.a /usr/lib/x86_64-linux-gnu/libcrypto.a -ldl -pthread 
CMakeFiles/cmTC_b34da.dir/CheckFunctionExists.c.o: In function `main':
CheckFunctionExists.c:(.text+0x15): undefined reference to `EVP_MD_CTX_new'
collect2: error: ld returned 1 exit status
CMakeFiles/cmTC_b34da.dir/build.make:99: recipe for target 'cmTC_b34da' failed
make[2]: *** [cmTC_b34da] Error 1
make[2]: Leaving directory '/home/vagrant/slave/monero-static-ubuntu-amd64/build/build/release/CMakeFiles/CMakeTmp'
Makefile:126: recipe for target 'cmTC_b34da/fast' failed
make[1]: *** [cmTC_b34da/fast] Error 2
make[1]: Leaving directory '/home/vagrant/slave/monero-static-ubuntu-amd64/build/build/release/CMakeFiles/CMakeTmp'


Determining if the LIBRESSL_VERSION_TEXT exist failed with the following output:
Change Dir: /home/vagrant/slave/monero-static-ubuntu-amd64/build/build/release/CMakeFiles/CMakeTmp

Run Build Command:"/usr/bin/make" "cmTC_e2117/fast"
make[1]: Entering directory '/home/vagrant/slave/monero-static-ubuntu-amd64/build/build/release/CMakeFiles/CMakeTmp'
/usr/bin/make -f CMakeFiles/cmTC_e2117.dir/build.make CMakeFiles/cmTC_e2117.dir/build
make[2]: Entering directory '/home/vagrant/slave/monero-static-ubuntu-amd64/build/build/release/CMakeFiles/CMakeTmp'
Building C object CMakeFiles/cmTC_e2117.dir/CheckSymbolExists.c.o
/usr/bin/cc    -pthread    -o CMakeFiles/cmTC_e2117.dir/CheckSymbolExists.c.o   -c /home/vagrant/slave/monero-static-ubuntu-amd64/build/build/release/CMakeFiles/CMakeTmp/CheckSymbolExists.c
/home/vagrant/slave/monero-static-ubuntu-amd64/build/build/release/CMakeFiles/CMakeTmp/CheckSymbolExists.c: In function 'main':
/home/vagrant/slave/monero-static-ubuntu-amd64/build/build/release/CMakeFiles/CMakeTmp/CheckSymbolExists.c:8:19: error: 'LIBRESSL_VERSION_TEXT' undeclared (first use in this function)
   return ((int*)(&LIBRESSL_VERSION_TEXT))[argc];
                   ^
/home/vagrant/slave/monero-static-ubuntu-amd64/build/build/release/CMakeFiles/CMakeTmp/CheckSymbolExists.c:8:19: note: each undeclared identifier is reported only once for each function it appears in
CMakeFiles/cmTC_e2117.dir/build.make:65: recipe for target 'CMakeFiles/cmTC_e2117.dir/CheckSymbolExists.c.o' failed
make[2]: *** [CMakeFiles/cmTC_e2117.dir/CheckSymbolExists.c.o] Error 1
make[2]: Leaving directory '/home/vagrant/slave/monero-static-ubuntu-amd64/build/build/release/CMakeFiles/CMakeTmp'
Makefile:126: recipe for target 'cmTC_e2117/fast' failed
make[1]: *** [cmTC_e2117/fast] Error 2
make[1]: Leaving directory '/home/vagrant/slave/monero-static-ubuntu-amd64/build/build/release/CMakeFiles/CMakeTmp'

File /home/vagrant/slave/monero-static-ubuntu-amd64/build/build/release/CMakeFiles/CMakeTmp/CheckSymbolExists.c:
/* */
#include <openssl/opensslv.h>

int main(int argc, char** argv)
{
  (void)argv;
#ifndef LIBRESSL_VERSION_TEXT
  return ((int*)(&LIBRESSL_VERSION_TEXT))[argc];
#else
  (void)argc;
  return 0;
#endif
}

Performing C++ SOURCE FILE Test HAVE_CXX_ATOMICS failed with the following output:
Change Dir: /home/vagrant/slave/monero-static-ubuntu-amd64/build/build/release/CMakeFiles/CMakeTmp

Run Build Command:"/usr/bin/make" "cmTC_5bacb/fast"
make[1]: Entering directory '/home/vagrant/slave/monero-static-ubuntu-amd64/build/build/release/CMakeFiles/CMakeTmp'
/usr/bin/make -f CMakeFiles/cmTC_5bacb.dir/build.make CMakeFiles/cmTC_5bacb.dir/build
make[2]: Entering directory '/home/vagrant/slave/monero-static-ubuntu-amd64/build/build/release/CMakeFiles/CMakeTmp'
Building CXX object CMakeFiles/cmTC_5bacb.dir/src.cxx.o
/usr/bin/c++     -DZMQ_STATIC -pthread -maes -DHAVE_CXX_ATOMICS   -o CMakeFiles/cmTC_5bacb.dir/src.cxx.o -c /home/vagrant/slave/monero-static-ubuntu-amd64/build/build/release/CMakeFiles/CMakeTmp/src.cxx
In file included from /usr/include/c++/5/cstdint:35:0,
                 from /home/vagrant/slave/monero-static-ubuntu-amd64/build/build/release/CMakeFiles/CMakeTmp/src.cxx:2:
/usr/include/c++/5/bits/c++0x_warning.h:32:2: error: #error This file requires compiler and library support for the ISO C++ 2011 standard. This support must be enabled with the -std=c++11 or -std=gnu++11 compiler options.
 #error This file requires compiler and library support \
  ^
/home/vagrant/slave/monero-static-ubuntu-amd64/build/build/release/CMakeFiles/CMakeTmp/src.cxx: In function 'int main()':
/home/vagrant/slave/monero-static-ubuntu-amd64/build/build/release/CMakeFiles/CMakeTmp/src.cxx:5:3: error: 'atomic' is not a member of 'std'
   std::atomic<uint64_t> a;
   ^
/home/vagrant/slave/monero-static-ubuntu-amd64/build/build/release/CMakeFiles/CMakeTmp/src.cxx:5:15: error: 'uint64_t' was not declared in this scope
   std::atomic<uint64_t> a;
               ^
/home/vagrant/slave/monero-static-ubuntu-amd64/build/build/release/CMakeFiles/CMakeTmp/src.cxx:5:25: error: 'a' was not declared in this scope
   std::atomic<uint64_t> a;
                         ^
CMakeFiles/cmTC_5bacb.dir/build.make:65: recipe for target 'CMakeFiles/cmTC_5bacb.dir/src.cxx.o' failed
make[2]: *** [CMakeFiles/cmTC_5bacb.dir/src.cxx.o] Error 1
make[2]: Leaving directory '/home/vagrant/slave/monero-static-ubuntu-amd64/build/build/release/CMakeFiles/CMakeTmp'
Makefile:126: recipe for target 'cmTC_5bacb/fast' failed
make[1]: *** [cmTC_5bacb/fast] Error 2
make[1]: Leaving directory '/home/vagrant/slave/monero-static-ubuntu-amd64/build/build/release/CMakeFiles/CMakeTmp'

Source file was:

#include <cstdint>
#include <atomic>
int main() {
  std::atomic<uint64_t> a;
  a.is_lock_free();
}
Performing C SOURCE FILE Test _fcf_protection=full_c failed with the following output:
Change Dir: /home/vagrant/slave/monero-static-ubuntu-amd64/build/build/release/CMakeFiles/CMakeTmp

Run Build Command:"/usr/bin/make" "cmTC_3c133/fast"
make[1]: Entering directory '/home/vagrant/slave/monero-static-ubuntu-amd64/build/build/release/CMakeFiles/CMakeTmp'
/usr/bin/make -f CMakeFiles/cmTC_3c133.dir/build.make CMakeFiles/cmTC_3c133.dir/build
make[2]: Entering directory '/home/vagrant/slave/monero-static-ubuntu-amd64/build/build/release/CMakeFiles/CMakeTmp'
Building C object CMakeFiles/cmTC_3c133.dir/src.c.o
/usr/bin/cc   -I/usr/local/include/libusb-1.0  -pthread -maes -march=x86-64 -fno-strict-aliasing -D_fcf_protection=full_c   -fcf-protection=full -o CMakeFiles/cmTC_3c133.dir/src.c.o   -c /home/vagrant/slave/monero-static-ubuntu-amd64/build/build/release/CMakeFiles/CMakeTmp/src.c
cc: error: unrecognized command line option '-fcf-protection=full'
CMakeFiles/cmTC_3c133.dir/build.make:65: recipe for target 'CMakeFiles/cmTC_3c133.dir/src.c.o' failed
make[2]: *** [CMakeFiles/cmTC_3c133.dir/src.c.o] Error 1
make[2]: Leaving directory '/home/vagrant/slave/monero-static-ubuntu-amd64/build/build/release/CMakeFiles/CMakeTmp'
Makefile:126: recipe for target 'cmTC_3c133/fast' failed
make[1]: *** [cmTC_3c133/fast] Error 2
make[1]: Leaving directory '/home/vagrant/slave/monero-static-ubuntu-amd64/build/build/release/CMakeFiles/CMakeTmp'

Source file was:
int main(void) { return 0; }
Performing C++ SOURCE FILE Test _fcf_protection=full_cxx failed with the following output:
Change Dir: /home/vagrant/slave/monero-static-ubuntu-amd64/build/build/release/CMakeFiles/CMakeTmp

Run Build Command:"/usr/bin/make" "cmTC_627cc/fast"
make[1]: Entering directory '/home/vagrant/slave/monero-static-ubuntu-amd64/build/build/release/CMakeFiles/CMakeTmp'
/usr/bin/make -f CMakeFiles/cmTC_627cc.dir/build.make CMakeFiles/cmTC_627cc.dir/build
make[2]: Entering directory '/home/vagrant/slave/monero-static-ubuntu-amd64/build/build/release/CMakeFiles/CMakeTmp'
Building CXX object CMakeFiles/cmTC_627cc.dir/src.cxx.o
/usr/bin/c++    -I/usr/local/include/libusb-1.0  -DZMQ_STATIC -pthread -maes -march=x86-64 -fno-strict-aliasing -D_fcf_protection=full_cxx   -fcf-protection=full -o CMakeFiles/cmTC_627cc.dir/src.cxx.o -c /home/vagrant/slave/monero-static-ubuntu-amd64/build/build/release/CMakeFiles/CMakeTmp/src.cxx
c++: error: unrecognized command line option '-fcf-protection=full'
CMakeFiles/cmTC_627cc.dir/build.make:65: recipe for target 'CMakeFiles/cmTC_627cc.dir/src.cxx.o' failed
make[2]: *** [CMakeFiles/cmTC_627cc.dir/src.cxx.o] Error 1
make[2]: Leaving directory '/home/vagrant/slave/monero-static-ubuntu-amd64/build/build/release/CMakeFiles/CMakeTmp'
Makefile:126: recipe for target 'cmTC_627cc/fast' failed
make[1]: *** [cmTC_627cc/fast] Error 2
make[1]: Leaving directory '/home/vagrant/slave/monero-static-ubuntu-amd64/build/build/release/CMakeFiles/CMakeTmp'

Source file was:
int main() { return 0; }
Performing C SOURCE FILE Test _fstack_clash_protection_c failed with the following output:
Change Dir: /home/vagrant/slave/monero-static-ubuntu-amd64/build/build/release/CMakeFiles/CMakeTmp

Run Build Command:"/usr/bin/make" "cmTC_d8e47/fast"
make[1]: Entering directory '/home/vagrant/slave/monero-static-ubuntu-amd64/build/build/release/CMakeFiles/CMakeTmp'
/usr/bin/make -f CMakeFiles/cmTC_d8e47.dir/build.make CMakeFiles/cmTC_d8e47.dir/build
make[2]: Entering directory '/home/vagrant/slave/monero-static-ubuntu-amd64/build/build/release/CMakeFiles/CMakeTmp'
Building C object CMakeFiles/cmTC_d8e47.dir/src.c.o
/usr/bin/cc   -I/usr/local/include/libusb-1.0  -pthread -maes -march=x86-64 -fno-strict-aliasing -D_fstack_clash_protection_c   -fstack-clash-protection -o CMakeFiles/cmTC_d8e47.dir/src.c.o   -c /home/vagrant/slave/monero-static-ubuntu-amd64/build/build/release/CMakeFiles/CMakeTmp/src.c
cc: error: unrecognized command line option '-fstack-clash-protection'
CMakeFiles/cmTC_d8e47.dir/build.make:65: recipe for target 'CMakeFiles/cmTC_d8e47.dir/src.c.o' failed
make[2]: *** [CMakeFiles/cmTC_d8e47.dir/src.c.o] Error 1
make[2]: Leaving directory '/home/vagrant/slave/monero-static-ubuntu-amd64/build/build/release/CMakeFiles/CMakeTmp'
Makefile:126: recipe for target 'cmTC_d8e47/fast' failed
make[1]: *** [cmTC_d8e47/fast] Error 2
make[1]: Leaving directory '/home/vagrant/slave/monero-static-ubuntu-amd64/build/build/release/CMakeFiles/CMakeTmp'

Source file was:
int main(void) { return 0; }
Performing C++ SOURCE FILE Test _fstack_clash_protection_cxx failed with the following output:
Change Dir: /home/vagrant/slave/monero-static-ubuntu-amd64/build/build/release/CMakeFiles/CMakeTmp

Run Build Command:"/usr/bin/make" "cmTC_15a4f/fast"
make[1]: Entering directory '/home/vagrant/slave/monero-static-ubuntu-amd64/build/build/release/CMakeFiles/CMakeTmp'
/usr/bin/make -f CMakeFiles/cmTC_15a4f.dir/build.make CMakeFiles/cmTC_15a4f.dir/build
make[2]: Entering directory '/home/vagrant/slave/monero-static-ubuntu-amd64/build/build/release/CMakeFiles/CMakeTmp'
Building CXX object CMakeFiles/cmTC_15a4f.dir/src.cxx.o
/usr/bin/c++    -I/usr/local/include/libusb-1.0  -DZMQ_STATIC -pthread -maes -march=x86-64 -fno-strict-aliasing -D_fstack_clash_protection_cxx   -fstack-clash-protection -o CMakeFiles/cmTC_15a4f.dir/src.cxx.o -c /home/vagrant/slave/monero-static-ubuntu-amd64/build/build/release/CMakeFiles/CMakeTmp/src.cxx
c++: error: unrecognized command line option '-fstack-clash-protection'
CMakeFiles/cmTC_15a4f.dir/build.make:65: recipe for target 'CMakeFiles/cmTC_15a4f.dir/src.cxx.o' failed
make[2]: *** [CMakeFiles/cmTC_15a4f.dir/src.cxx.o] Error 1
make[2]: Leaving directory '/home/vagrant/slave/monero-static-ubuntu-amd64/build/build/release/CMakeFiles/CMakeTmp'
Makefile:126: recipe for target 'cmTC_15a4f/fast' failed
make[1]: *** [cmTC_15a4f/fast] Error 2
make[1]: Leaving directory '/home/vagrant/slave/monero-static-ubuntu-amd64/build/build/release/CMakeFiles/CMakeTmp'

Source file was:
int main() { return 0; }
Performing C SOURCE FILE Test _mmitigate_rop_c failed with the following output:
Change Dir: /home/vagrant/slave/monero-static-ubuntu-amd64/build/build/release/CMakeFiles/CMakeTmp

Run Build Command:"/usr/bin/make" "cmTC_2b60f/fast"
make[1]: Entering directory '/home/vagrant/slave/monero-static-ubuntu-amd64/build/build/release/CMakeFiles/CMakeTmp'
/usr/bin/make -f CMakeFiles/cmTC_2b60f.dir/build.make CMakeFiles/cmTC_2b60f.dir/build
make[2]: Entering directory '/home/vagrant/slave/monero-static-ubuntu-amd64/build/build/release/CMakeFiles/CMakeTmp'
Building C object CMakeFiles/cmTC_2b60f.dir/src.c.o
/usr/bin/cc   -I/usr/local/include/libusb-1.0  -pthread -maes -march=x86-64 -fno-strict-aliasing -D_mmitigate_rop_c   -mmitigate-rop -o CMakeFiles/cmTC_2b60f.dir/src.c.o   -c /home/vagrant/slave/monero-static-ubuntu-amd64/build/build/release/CMakeFiles/CMakeTmp/src.c
cc: error: unrecognized command line option '-mmitigate-rop'
CMakeFiles/cmTC_2b60f.dir/build.make:65: recipe for target 'CMakeFiles/cmTC_2b60f.dir/src.c.o' failed
make[2]: *** [CMakeFiles/cmTC_2b60f.dir/src.c.o] Error 1
make[2]: Leaving directory '/home/vagrant/slave/monero-static-ubuntu-amd64/build/build/release/CMakeFiles/CMakeTmp'
Makefile:126: recipe for target 'cmTC_2b60f/fast' failed
make[1]: *** [cmTC_2b60f/fast] Error 2
make[1]: Leaving directory '/home/vagrant/slave/monero-static-ubuntu-amd64/build/build/release/CMakeFiles/CMakeTmp'

Source file was:
int main(void) { return 0; }
Performing C++ SOURCE FILE Test _mmitigate_rop_cxx failed with the following output:
Change Dir: /home/vagrant/slave/monero-static-ubuntu-amd64/build/build/release/CMakeFiles/CMakeTmp

Run Build Command:"/usr/bin/make" "cmTC_9ca83/fast"
make[1]: Entering directory '/home/vagrant/slave/monero-static-ubuntu-amd64/build/build/release/CMakeFiles/CMakeTmp'
/usr/bin/make -f CMakeFiles/cmTC_9ca83.dir/build.make CMakeFiles/cmTC_9ca83.dir/build
make[2]: Entering directory '/home/vagrant/slave/monero-static-ubuntu-amd64/build/build/release/CMakeFiles/CMakeTmp'
Building CXX object CMakeFiles/cmTC_9ca83.dir/src.cxx.o
/usr/bin/c++    -I/usr/local/include/libusb-1.0  -DZMQ_STATIC -pthread -maes -march=x86-64 -fno-strict-aliasing -D_mmitigate_rop_cxx   -mmitigate-rop -o CMakeFiles/cmTC_9ca83.dir/src.cxx.o -c /home/vagrant/slave/monero-static-ubuntu-amd64/build/build/release/CMakeFiles/CMakeTmp/src.cxx
c++: error: unrecognized command line option '-mmitigate-rop'
CMakeFiles/cmTC_9ca83.dir/build.make:65: recipe for target 'CMakeFiles/cmTC_9ca83.dir/src.cxx.o' failed
make[2]: *** [CMakeFiles/cmTC_9ca83.dir/src.cxx.o] Error 1
make[2]: Leaving directory '/home/vagrant/slave/monero-static-ubuntu-amd64/build/build/release/CMakeFiles/CMakeTmp'
Makefile:126: recipe for target 'cmTC_9ca83/fast' failed
make[1]: *** [cmTC_9ca83/fast] Error 2
make[1]: Leaving directory '/home/vagrant/slave/monero-static-ubuntu-amd64/build/build/release/CMakeFiles/CMakeTmp'

Source file was:
int main() { return 0; }
Determining if the -Wl,-z,noexecheap linker flag is supported failed with the following output:
Change Dir: /home/vagrant/slave/monero-static-ubuntu-amd64/build/build/release/CMakeFiles/CMakeTmp

Run Build Command:"/usr/bin/make" "cmTC_78945/fast"
make[1]: Entering directory '/home/vagrant/slave/monero-static-ubuntu-amd64/build/build/release/CMakeFiles/CMakeTmp'
/usr/bin/make -f CMakeFiles/cmTC_78945.dir/build.make CMakeFiles/cmTC_78945.dir/build
make[2]: Entering directory '/home/vagrant/slave/monero-static-ubuntu-amd64/build/build/release/CMakeFiles/CMakeTmp'
Building C object CMakeFiles/cmTC_78945.dir/CheckLinkerFlag.c.o
/usr/bin/cc    -Wl,-z,noexecheap    -Wl,-z,noexecheap -o CMakeFiles/cmTC_78945.dir/CheckLinkerFlag.c.o   -c /home/vagrant/slave/monero-static-ubuntu-amd64/build/cmake/CheckLinkerFlag.c
Linking C executable cmTC_78945
/usr/bin/cmake -E cmake_link_script CMakeFiles/cmTC_78945.dir/link.txt --verbose=1
/usr/bin/cc  -Wl,-z,noexecheap     CMakeFiles/cmTC_78945.dir/CheckLinkerFlag.c.o  -o cmTC_78945 -rdynamic 
/usr/bin/ld: warning: -z noexecheap ignored.
make[2]: Leaving directory '/home/vagrant/slave/monero-static-ubuntu-amd64/build/build/release/CMakeFiles/CMakeTmp'
make[1]: Leaving directory '/home/vagrant/slave/monero-static-ubuntu-amd64/build/build/release/CMakeFiles/CMakeTmp'


Determining if the function rl_copy_text exists failed with the following output:
Change Dir: /home/vagrant/slave/monero-static-ubuntu-amd64/build/build/release/CMakeFiles/CMakeTmp

Run Build Command:"/usr/bin/make" "cmTC_6788f/fast"
make[1]: Entering directory '/home/vagrant/slave/monero-static-ubuntu-amd64/build/build/release/CMakeFiles/CMakeTmp'
/usr/bin/make -f CMakeFiles/cmTC_6788f.dir/build.make CMakeFiles/cmTC_6788f.dir/build
make[2]: Entering directory '/home/vagrant/slave/monero-static-ubuntu-amd64/build/build/release/CMakeFiles/CMakeTmp'
Building C object CMakeFiles/cmTC_6788f.dir/CheckFunctionExists.c.o
/usr/bin/cc    -pthread -maes -march=x86-64 -fno-strict-aliasing -std=c11 -D_GNU_SOURCE   -Wall -Wextra -Wpointer-arith -Wundef -Wvla -Wwrite-strings -Wno-error=extra -Wno-error=deprecated-declarations -Wno-unused-parameter -Wno-unused-variable -Wno-error=unused-variable -Wno-error=undef -Wno-error=uninitialized -Wlogical-op -Wno-error=maybe-uninitialized -Wno-error=cpp -Waggregate-return -Wnested-externs -Wold-style-definition -Wstrict-prototypes  -fPIC  -Wformat -Wformat-security -fstack-protector -fstack-protector-strong -fno-strict-aliasing -DCHECK_FUNCTION_EXISTS=rl_copy_text   -o CMakeFiles/cmTC_6788f.dir/CheckFunctionExists.c.o   -c /usr/share/cmake-3.5/Modules/CheckFunctionExists.c
/usr/share/cmake-3.5/Modules/CheckFunctionExists.c:6:1: warning: function declaration isn't a prototype [-Wstrict-prototypes]
 char CHECK_FUNCTION_EXISTS();
 ^
Linking C executable cmTC_6788f
/usr/bin/cmake -E cmake_link_script CMakeFiles/cmTC_6788f.dir/link.txt --verbose=1
/usr/bin/cc   -pthread -maes -march=x86-64 -fno-strict-aliasing -std=c11 -D_GNU_SOURCE   -Wall -Wextra -Wpointer-arith -Wundef -Wvla -Wwrite-strings -Wno-error=extra -Wno-error=deprecated-declarations -Wno-unused-parameter -Wno-unused-variable -Wno-error=unused-variable -Wno-error=undef -Wno-error=uninitialized -Wlogical-op -Wno-error=maybe-uninitialized -Wno-error=cpp -Waggregate-return -Wnested-externs -Wold-style-definition -Wstrict-prototypes  -fPIC  -Wformat -Wformat-security -fstack-protector -fstack-protector-strong -fno-strict-aliasing -DCHECK_FUNCTION_EXISTS=rl_copy_text    CMakeFiles/cmTC_6788f.dir/CheckFunctionExists.c.o  -o cmTC_6788f -rdynamic /usr/lib/x86_64-linux-gnu/libreadline.a 
/usr/lib/x86_64-linux-gnu/libreadline.a(terminal.o): In function `_rl_get_screen_size':
(.text+0x283): undefined reference to `tgetnum'
/usr/lib/x86_64-linux-gnu/libreadline.a(terminal.o): In function `_rl_get_screen_size':
(.text+0x303): undefined reference to `tgetnum'
/usr/lib/x86_64-linux-gnu/libreadline.a(terminal.o): In function `_rl_init_terminal_io':
(.text+0x6fa): undefined reference to `PC'
/usr/lib/x86_64-linux-gnu/libreadline.a(terminal.o): In function `_rl_init_terminal_io':
(.text+0x70e): undefined reference to `BC'
/usr/lib/x86_64-linux-gnu/libreadline.a(terminal.o): In function `_rl_init_terminal_io':
(.text+0x718): undefined reference to `UP'
/usr/lib/x86_64-linux-gnu/libreadline.a(terminal.o): In function `_rl_init_terminal_io':
(.text+0x7a8): undefined reference to `tgetent'
/usr/lib/x86_64-linux-gnu/libreadline.a(terminal.o): In function `_rl_init_terminal_io':
(.text+0x7e7): undefined reference to `tgetstr'
/usr/lib/x86_64-linux-gnu/libreadline.a(terminal.o): In function `_rl_init_terminal_io':
(.text+0x817): undefined reference to `PC'
/usr/lib/x86_64-linux-gnu/libreadline.a(terminal.o): In function `_rl_init_terminal_io':
(.text+0x82e): undefined reference to `BC'
/usr/lib/x86_64-linux-gnu/libreadline.a(terminal.o): In function `_rl_init_terminal_io':
(.text+0x842): undefined reference to `UP'
/usr/lib/x86_64-linux-gnu/libreadline.a(terminal.o): In function `_rl_init_terminal_io':
(.text+0x857): undefined reference to `tgetflag'
/usr/lib/x86_64-linux-gnu/libreadline.a(terminal.o): In function `_rl_init_terminal_io':
(.text+0x8b1): undefined reference to `tgetflag'
/usr/lib/x86_64-linux-gnu/libreadline.a(terminal.o): In function `_rl_init_terminal_io':
(.text+0x91f): undefined reference to `tgetflag'
/usr/lib/x86_64-linux-gnu/libreadline.a(terminal.o): In function `_rl_init_terminal_io':
(.text+0x9fb): undefined reference to `tgetent'
/usr/lib/x86_64-linux-gnu/libreadline.a(terminal.o): In function `_rl_backspace':
(.text+0xc00): undefined reference to `tputs'
/usr/lib/x86_64-linux-gnu/libreadline.a(terminal.o): In function `rl_ding':
(.text+0xcaa): undefined reference to `tputs'
/usr/lib/x86_64-linux-gnu/libreadline.a(terminal.o): In function `_rl_enable_meta_key':
(.text+0xd17): undefined reference to `tputs'
/usr/lib/x86_64-linux-gnu/libreadline.a(terminal.o): In function `_rl_disable_meta_key':
(.text+0xd69): undefined reference to `tputs'
/usr/lib/x86_64-linux-gnu/libreadline.a(terminal.o): In function `_rl_control_keypad':
(.text+0xd9d): undefined reference to `tputs'
/usr/lib/x86_64-linux-gnu/libreadline.a(terminal.o):(.text+0xdf0): more undefined references to `tputs' follow
/usr/lib/x86_64-linux-gnu/libreadline.a(display.o): In function `update_line':
(.text+0x238e): undefined reference to `tgoto'
/usr/lib/x86_64-linux-gnu/libreadline.a(display.o): In function `update_line':
(.text+0x23a2): undefined reference to `tputs'
/usr/lib/x86_64-linux-gnu/libreadline.a(display.o): In function `update_line':
(.text+0x2520): undefined reference to `tputs'
/usr/lib/x86_64-linux-gnu/libreadline.a(display.o): In function `update_line':
(.text+0x2d49): undefined reference to `tputs'
/usr/lib/x86_64-linux-gnu/libreadline.a(display.o): In function `update_line':
(.text+0x2e7a): undefined reference to `tgoto'
/usr/lib/x86_64-linux-gnu/libreadline.a(display.o): In function `update_line':
(.text+0x2e8c): undefined reference to `tputs'
/usr/lib/x86_64-linux-gnu/libreadline.a(display.o): In function `update_line':
(.text+0x3056): undefined reference to `tputs'
/usr/lib/x86_64-linux-gnu/libreadline.a(display.o): In function `update_line':
(.text+0x309f): undefined reference to `tputs'
/usr/lib/x86_64-linux-gnu/libreadline.a(display.o): In function `update_line':
(.text+0x30d1): undefined reference to `tputs'
/usr/lib/x86_64-linux-gnu/libreadline.a(display.o): In function `rl_redisplay':
(.text+0x4813): undefined reference to `tputs'
/usr/lib/x86_64-linux-gnu/libreadline.a(display.o):(.text+0x4b2a): more undefined references to `tputs' follow
collect2: error: ld returned 1 exit status
CMakeFiles/cmTC_6788f.dir/build.make:98: recipe for target 'cmTC_6788f' failed
make[2]: *** [cmTC_6788f] Error 1
make[2]: Leaving directory '/home/vagrant/slave/monero-static-ubuntu-amd64/build/build/release/CMakeFiles/CMakeTmp'
Makefile:126: recipe for target 'cmTC_6788f/fast' failed
make[1]: *** [cmTC_6788f/fast] Error 2
make[1]: Leaving directory '/home/vagrant/slave/monero-static-ubuntu-amd64/build/build/release/CMakeFiles/CMakeTmp'


Determining if the function rl_filename_completion_function exists failed with the following output:
Change Dir: /home/vagrant/slave/monero-static-ubuntu-amd64/build/build/release/CMakeFiles/CMakeTmp

Run Build Command:"/usr/bin/make" "cmTC_7c58f/fast"
make[1]: Entering directory '/home/vagrant/slave/monero-static-ubuntu-amd64/build/build/release/CMakeFiles/CMakeTmp'
/usr/bin/make -f CMakeFiles/cmTC_7c58f.dir/build.make CMakeFiles/cmTC_7c58f.dir/build
make[2]: Entering directory '/home/vagrant/slave/monero-static-ubuntu-amd64/build/build/release/CMakeFiles/CMakeTmp'
Building C object CMakeFiles/cmTC_7c58f.dir/CheckFunctionExists.c.o
/usr/bin/cc    -pthread -maes -march=x86-64 -fno-strict-aliasing -std=c11 -D_GNU_SOURCE   -Wall -Wextra -Wpointer-arith -Wundef -Wvla -Wwrite-strings -Wno-error=extra -Wno-error=deprecated-declarations -Wno-unused-parameter -Wno-unused-variable -Wno-error=unused-variable -Wno-error=undef -Wno-error=uninitialized -Wlogical-op -Wno-error=maybe-uninitialized -Wno-error=cpp -Waggregate-return -Wnested-externs -Wold-style-definition -Wstrict-prototypes  -fPIC  -Wformat -Wformat-security -fstack-protector -fstack-protector-strong -fno-strict-aliasing -DCHECK_FUNCTION_EXISTS=rl_filename_completion_function   -o CMakeFiles/cmTC_7c58f.dir/CheckFunctionExists.c.o   -c /usr/share/cmake-3.5/Modules/CheckFunctionExists.c
/usr/share/cmake-3.5/Modules/CheckFunctionExists.c:6:1: warning: function declaration isn't a prototype [-Wstrict-prototypes]
 char CHECK_FUNCTION_EXISTS();
 ^
Linking C executable cmTC_7c58f
/usr/bin/cmake -E cmake_link_script CMakeFiles/cmTC_7c58f.dir/link.txt --verbose=1
/usr/bin/cc   -pthread -maes -march=x86-64 -fno-strict-aliasing -std=c11 -D_GNU_SOURCE   -Wall -Wextra -Wpointer-arith -Wundef -Wvla -Wwrite-strings -Wno-error=extra -Wno-error=deprecated-declarations -Wno-unused-parameter -Wno-unused-variable -Wno-error=unused-variable -Wno-error=undef -Wno-error=uninitialized -Wlogical-op -Wno-error=maybe-uninitialized -Wno-error=cpp -Waggregate-return -Wnested-externs -Wold-style-definition -Wstrict-prototypes  -fPIC  -Wformat -Wformat-security -fstack-protector -fstack-protector-strong -fno-strict-aliasing -DCHECK_FUNCTION_EXISTS=rl_filename_completion_function    CMakeFiles/cmTC_7c58f.dir/CheckFunctionExists.c.o  -o cmTC_7c58f -rdynamic /usr/lib/x86_64-linux-gnu/libreadline.a 
/usr/lib/x86_64-linux-gnu/libreadline.a(display.o): In function `_rl_move_cursor_relative':
(.text+0xecc): undefined reference to `tputs'
/usr/lib/x86_64-linux-gnu/libreadline.a(display.o): In function `_rl_move_cursor_relative':
(.text+0xf2e): undefined reference to `tputs'
/usr/lib/x86_64-linux-gnu/libreadline.a(display.o): In function `_rl_move_cursor_relative':
(.text+0x1021): undefined reference to `tputs'
/usr/lib/x86_64-linux-gnu/libreadline.a(display.o): In function `_rl_move_vert':
(.text+0x10cc): undefined reference to `tputs'
/usr/lib/x86_64-linux-gnu/libreadline.a(display.o): In function `_rl_move_vert':
(.text+0x1128): undefined reference to `tputs'
/usr/lib/x86_64-linux-gnu/libreadline.a(display.o): In function `update_line':
(.text+0x238e): undefined reference to `tgoto'
/usr/lib/x86_64-linux-gnu/libreadline.a(display.o): In function `update_line':
(.text+0x23a2): undefined reference to `tputs'
/usr/lib/x86_64-linux-gnu/libreadline.a(display.o): In function `update_line':
(.text+0x2520): undefined reference to `tputs'
/usr/lib/x86_64-linux-gnu/libreadline.a(display.o): In function `update_line':
(.text+0x2d49): undefined reference to `tputs'
/usr/lib/x86_64-linux-gnu/libreadline.a(display.o): In function `update_line':
(.text+0x2e7a): undefined reference to `tgoto'
/usr/lib/x86_64-linux-gnu/libreadline.a(display.o): In function `update_line':
(.text+0x2e8c): undefined reference to `tputs'
/usr/lib/x86_64-linux-gnu/libreadline.a(display.o): In function `update_line':
(.text+0x3056): undefined reference to `tputs'
/usr/lib/x86_64-linux-gnu/libreadline.a(display.o): In function `update_line':
(.text+0x309f): undefined reference to `tputs'
/usr/lib/x86_64-linux-gnu/libreadline.a(display.o): In function `update_line':
(.text+0x30d1): undefined reference to `tputs'
/usr/lib/x86_64-linux-gnu/libreadline.a(display.o): In function `rl_redisplay':
(.text+0x4813): undefined reference to `tputs'
/usr/lib/x86_64-linux-gnu/libreadline.a(display.o):(.text+0x4b2a): more undefined references to `tputs' follow
/usr/lib/x86_64-linux-gnu/libreadline.a(terminal.o): In function `_rl_get_screen_size':
(.text+0x283): undefined reference to `tgetnum'
/usr/lib/x86_64-linux-gnu/libreadline.a(terminal.o): In function `_rl_get_screen_size':
(.text+0x303): undefined reference to `tgetnum'
/usr/lib/x86_64-linux-gnu/libreadline.a(terminal.o): In function `_rl_init_terminal_io':
(.text+0x6fa): undefined reference to `PC'
/usr/lib/x86_64-linux-gnu/libreadline.a(terminal.o): In function `_rl_init_terminal_io':
(.text+0x70e): undefined reference to `BC'
/usr/lib/x86_64-linux-gnu/libreadline.a(terminal.o): In function `_rl_init_terminal_io':
(.text+0x718): undefined reference to `UP'
/usr/lib/x86_64-linux-gnu/libreadline.a(terminal.o): In function `_rl_init_terminal_io':
(.text+0x7a8): undefined reference to `tgetent'
/usr/lib/x86_64-linux-gnu/libreadline.a(terminal.o): In function `_rl_init_terminal_io':
(.text+0x7e7): undefined reference to `tgetstr'
/usr/lib/x86_64-linux-gnu/libreadline.a(terminal.o): In function `_rl_init_terminal_io':
(.text+0x817): undefined reference to `PC'
/usr/lib/x86_64-linux-gnu/libreadline.a(terminal.o): In function `_rl_init_terminal_io':
(.text+0x82e): undefined reference to `BC'
/usr/lib/x86_64-linux-gnu/libreadline.a(terminal.o): In function `_rl_init_terminal_io':
(.text+0x842): undefined reference to `UP'
/usr/lib/x86_64-linux-gnu/libreadline.a(terminal.o): In function `_rl_init_terminal_io':
(.text+0x857): undefined reference to `tgetflag'
/usr/lib/x86_64-linux-gnu/libreadline.a(terminal.o): In function `_rl_init_terminal_io':
(.text+0x8b1): undefined reference to `tgetflag'
/usr/lib/x86_64-linux-gnu/libreadline.a(terminal.o): In function `_rl_init_terminal_io':
(.text+0x91f): undefined reference to `tgetflag'
/usr/lib/x86_64-linux-gnu/libreadline.a(terminal.o): In function `_rl_init_terminal_io':
(.text+0x9fb): undefined reference to `tgetent'
/usr/lib/x86_64-linux-gnu/libreadline.a(terminal.o): In function `_rl_backspace':
(.text+0xc00): undefined reference to `tputs'
/usr/lib/x86_64-linux-gnu/libreadline.a(terminal.o): In function `rl_ding':
(.text+0xcaa): undefined reference to `tputs'
/usr/lib/x86_64-linux-gnu/libreadline.a(terminal.o): In function `_rl_enable_meta_key':
(.text+0xd17): undefined reference to `tputs'
/usr/lib/x86_64-linux-gnu/libreadline.a(terminal.o): In function `_rl_disable_meta_key':
(.text+0xd69): undefined reference to `tputs'
/usr/lib/x86_64-linux-gnu/libreadline.a(terminal.o): In function `_rl_control_keypad':
(.text+0xd9d): undefined reference to `tputs'
/usr/lib/x86_64-linux-gnu/libreadline.a(terminal.o):(.text+0xdf0): more undefined references to `tputs' follow
collect2: error: ld returned 1 exit status
CMakeFiles/cmTC_7c58f.dir/build.make:98: recipe for target 'cmTC_7c58f' failed
make[2]: *** [cmTC_7c58f] Error 1
make[2]: Leaving directory '/home/vagrant/slave/monero-static-ubuntu-amd64/build/build/release/CMakeFiles/CMakeTmp'
Makefile:126: recipe for target 'cmTC_7c58f/fast' failed
make[1]: *** [cmTC_7c58f/fast] Error 2
make[1]: Leaving directory '/home/vagrant/slave/monero-static-ubuntu-amd64/build/build/release/CMakeFiles/CMakeTmp'