(view as text)
Determining if the pthread_create exist failed with the following output:
Change Dir: /home/buildbot/builder/monero-static-ubuntu-amd64/build/build/release/CMakeFiles/CMakeTmp

Run Build Command:"/usr/bin/make" "cmTC_97903/fast"
make[1]: Entering directory '/home/buildbot/builder/monero-static-ubuntu-amd64/build/build/release/CMakeFiles/CMakeTmp'
/usr/bin/make -f CMakeFiles/cmTC_97903.dir/build.make CMakeFiles/cmTC_97903.dir/build
make[2]: Entering directory '/home/buildbot/builder/monero-static-ubuntu-amd64/build/build/release/CMakeFiles/CMakeTmp'
Building C object CMakeFiles/cmTC_97903.dir/CheckSymbolExists.c.o
/usr/bin/cc    -o CMakeFiles/cmTC_97903.dir/CheckSymbolExists.c.o   -c /home/buildbot/builder/monero-static-ubuntu-amd64/build/build/release/CMakeFiles/CMakeTmp/CheckSymbolExists.c
Linking C executable cmTC_97903
/usr/bin/cmake -E cmake_link_script CMakeFiles/cmTC_97903.dir/link.txt --verbose=1
/usr/bin/cc      -rdynamic CMakeFiles/cmTC_97903.dir/CheckSymbolExists.c.o  -o cmTC_97903 
CMakeFiles/cmTC_97903.dir/CheckSymbolExists.c.o: In function `main':
CheckSymbolExists.c:(.text+0x1b): undefined reference to `pthread_create'
collect2: error: ld returned 1 exit status
CMakeFiles/cmTC_97903.dir/build.make:97: recipe for target 'cmTC_97903' failed
make[2]: *** [cmTC_97903] Error 1
make[2]: Leaving directory '/home/buildbot/builder/monero-static-ubuntu-amd64/build/build/release/CMakeFiles/CMakeTmp'
Makefile:126: recipe for target 'cmTC_97903/fast' failed
make[1]: *** [cmTC_97903/fast] Error 2
make[1]: Leaving directory '/home/buildbot/builder/monero-static-ubuntu-amd64/build/build/release/CMakeFiles/CMakeTmp'

File /home/buildbot/builder/monero-static-ubuntu-amd64/build/build/release/CMakeFiles/CMakeTmp/CheckSymbolExists.c:
/* */
#include <pthread.h>

int main(int argc, char** argv)
{
  (void)argv;
#ifndef pthread_create
  return ((int*)(&pthread_create))[argc];
#else
  (void)argc;
  return 0;
#endif
}

Determining if the function memset_s exists in the c failed with the following output:
Change Dir: /home/buildbot/builder/monero-static-ubuntu-amd64/build/build/release/CMakeFiles/CMakeTmp

Run Build Command:"/usr/bin/make" "cmTC_7de3c/fast"
make[1]: Entering directory '/home/buildbot/builder/monero-static-ubuntu-amd64/build/build/release/CMakeFiles/CMakeTmp'
/usr/bin/make -f CMakeFiles/cmTC_7de3c.dir/build.make CMakeFiles/cmTC_7de3c.dir/build
make[2]: Entering directory '/home/buildbot/builder/monero-static-ubuntu-amd64/build/build/release/CMakeFiles/CMakeTmp'
Building C object CMakeFiles/cmTC_7de3c.dir/CheckFunctionExists.c.o
/usr/bin/cc   -pthread -DCHECK_FUNCTION_EXISTS=memset_s   -o CMakeFiles/cmTC_7de3c.dir/CheckFunctionExists.c.o   -c /usr/share/cmake-3.10/Modules/CheckFunctionExists.c
Linking C executable cmTC_7de3c
/usr/bin/cmake -E cmake_link_script CMakeFiles/cmTC_7de3c.dir/link.txt --verbose=1
/usr/bin/cc  -pthread -DCHECK_FUNCTION_EXISTS=memset_s    -rdynamic CMakeFiles/cmTC_7de3c.dir/CheckFunctionExists.c.o  -o cmTC_7de3c  -L/home/buildbot/builder/monero-static-ubuntu-amd64/build/build/release/CMakeFiles/CMakeTmp/string.h -Wl,-rpath,/home/buildbot/builder/monero-static-ubuntu-amd64/build/build/release/CMakeFiles/CMakeTmp/string.h -lc 
CMakeFiles/cmTC_7de3c.dir/CheckFunctionExists.c.o: In function `main':
CheckFunctionExists.c:(.text+0x10): undefined reference to `memset_s'
collect2: error: ld returned 1 exit status
CMakeFiles/cmTC_7de3c.dir/build.make:97: recipe for target 'cmTC_7de3c' failed
make[2]: *** [cmTC_7de3c] Error 1
make[2]: Leaving directory '/home/buildbot/builder/monero-static-ubuntu-amd64/build/build/release/CMakeFiles/CMakeTmp'
Makefile:126: recipe for target 'cmTC_7de3c/fast' failed
make[1]: *** [cmTC_7de3c/fast] Error 2
make[1]: Leaving directory '/home/buildbot/builder/monero-static-ubuntu-amd64/build/build/release/CMakeFiles/CMakeTmp'


Determining if the include file event.h exists failed with the following output:
Change Dir: /home/buildbot/builder/monero-static-ubuntu-amd64/build/build/release/CMakeFiles/CMakeTmp

Run Build Command:"/usr/bin/make" "cmTC_bceaa/fast"
make[1]: Entering directory '/home/buildbot/builder/monero-static-ubuntu-amd64/build/build/release/CMakeFiles/CMakeTmp'
/usr/bin/make -f CMakeFiles/cmTC_bceaa.dir/build.make CMakeFiles/cmTC_bceaa.dir/build
make[2]: Entering directory '/home/buildbot/builder/monero-static-ubuntu-amd64/build/build/release/CMakeFiles/CMakeTmp'
Building C object CMakeFiles/cmTC_bceaa.dir/CheckIncludeFile.c.o
/usr/bin/cc   -pthread    -o CMakeFiles/cmTC_bceaa.dir/CheckIncludeFile.c.o   -c /home/buildbot/builder/monero-static-ubuntu-amd64/build/build/release/CMakeFiles/CMakeTmp/CheckIncludeFile.c
/home/buildbot/builder/monero-static-ubuntu-amd64/build/build/release/CMakeFiles/CMakeTmp/CheckIncludeFile.c:1:10: fatal error: event.h: No such file or directory
 #include <event.h>
          ^~~~~~~~~
compilation terminated.
CMakeFiles/cmTC_bceaa.dir/build.make:65: recipe for target 'CMakeFiles/cmTC_bceaa.dir/CheckIncludeFile.c.o' failed
make[2]: *** [CMakeFiles/cmTC_bceaa.dir/CheckIncludeFile.c.o] Error 1
make[2]: Leaving directory '/home/buildbot/builder/monero-static-ubuntu-amd64/build/build/release/CMakeFiles/CMakeTmp'
Makefile:126: recipe for target 'cmTC_bceaa/fast' failed
make[1]: *** [cmTC_bceaa/fast] Error 2
make[1]: Leaving directory '/home/buildbot/builder/monero-static-ubuntu-amd64/build/build/release/CMakeFiles/CMakeTmp'


Determining if the include file iphlpapi.h exists failed with the following output:
Change Dir: /home/buildbot/builder/monero-static-ubuntu-amd64/build/build/release/CMakeFiles/CMakeTmp

Run Build Command:"/usr/bin/make" "cmTC_8b3cb/fast"
make[1]: Entering directory '/home/buildbot/builder/monero-static-ubuntu-amd64/build/build/release/CMakeFiles/CMakeTmp'
/usr/bin/make -f CMakeFiles/cmTC_8b3cb.dir/build.make CMakeFiles/cmTC_8b3cb.dir/build
make[2]: Entering directory '/home/buildbot/builder/monero-static-ubuntu-amd64/build/build/release/CMakeFiles/CMakeTmp'
Building C object CMakeFiles/cmTC_8b3cb.dir/CheckIncludeFile.c.o
/usr/bin/cc   -pthread    -o CMakeFiles/cmTC_8b3cb.dir/CheckIncludeFile.c.o   -c /home/buildbot/builder/monero-static-ubuntu-amd64/build/build/release/CMakeFiles/CMakeTmp/CheckIncludeFile.c
/home/buildbot/builder/monero-static-ubuntu-amd64/build/build/release/CMakeFiles/CMakeTmp/CheckIncludeFile.c:1:10: fatal error: iphlpapi.h: No such file or directory
 #include <iphlpapi.h>
          ^~~~~~~~~~~~
compilation terminated.
CMakeFiles/cmTC_8b3cb.dir/build.make:65: recipe for target 'CMakeFiles/cmTC_8b3cb.dir/CheckIncludeFile.c.o' failed
make[2]: *** [CMakeFiles/cmTC_8b3cb.dir/CheckIncludeFile.c.o] Error 1
make[2]: Leaving directory '/home/buildbot/builder/monero-static-ubuntu-amd64/build/build/release/CMakeFiles/CMakeTmp'
Makefile:126: recipe for target 'cmTC_8b3cb/fast' failed
make[1]: *** [cmTC_8b3cb/fast] Error 2
make[1]: Leaving directory '/home/buildbot/builder/monero-static-ubuntu-amd64/build/build/release/CMakeFiles/CMakeTmp'


Determining if the include file login_cap.h exists failed with the following output:
Change Dir: /home/buildbot/builder/monero-static-ubuntu-amd64/build/build/release/CMakeFiles/CMakeTmp

Run Build Command:"/usr/bin/make" "cmTC_e71cd/fast"
make[1]: Entering directory '/home/buildbot/builder/monero-static-ubuntu-amd64/build/build/release/CMakeFiles/CMakeTmp'
/usr/bin/make -f CMakeFiles/cmTC_e71cd.dir/build.make CMakeFiles/cmTC_e71cd.dir/build
make[2]: Entering directory '/home/buildbot/builder/monero-static-ubuntu-amd64/build/build/release/CMakeFiles/CMakeTmp'
Building C object CMakeFiles/cmTC_e71cd.dir/CheckIncludeFile.c.o
/usr/bin/cc   -pthread    -o CMakeFiles/cmTC_e71cd.dir/CheckIncludeFile.c.o   -c /home/buildbot/builder/monero-static-ubuntu-amd64/build/build/release/CMakeFiles/CMakeTmp/CheckIncludeFile.c
/home/buildbot/builder/monero-static-ubuntu-amd64/build/build/release/CMakeFiles/CMakeTmp/CheckIncludeFile.c:1:10: fatal error: login_cap.h: No such file or directory
 #include <login_cap.h>
          ^~~~~~~~~~~~~
compilation terminated.
CMakeFiles/cmTC_e71cd.dir/build.make:65: recipe for target 'CMakeFiles/cmTC_e71cd.dir/CheckIncludeFile.c.o' failed
make[2]: *** [CMakeFiles/cmTC_e71cd.dir/CheckIncludeFile.c.o] Error 1
make[2]: Leaving directory '/home/buildbot/builder/monero-static-ubuntu-amd64/build/build/release/CMakeFiles/CMakeTmp'
Makefile:126: recipe for target 'cmTC_e71cd/fast' failed
make[1]: *** [cmTC_e71cd/fast] Error 2
make[1]: Leaving directory '/home/buildbot/builder/monero-static-ubuntu-amd64/build/build/release/CMakeFiles/CMakeTmp'


Determining if the include file sys/sha2.h exists failed with the following output:
Change Dir: /home/buildbot/builder/monero-static-ubuntu-amd64/build/build/release/CMakeFiles/CMakeTmp

Run Build Command:"/usr/bin/make" "cmTC_2944c/fast"
make[1]: Entering directory '/home/buildbot/builder/monero-static-ubuntu-amd64/build/build/release/CMakeFiles/CMakeTmp'
/usr/bin/make -f CMakeFiles/cmTC_2944c.dir/build.make CMakeFiles/cmTC_2944c.dir/build
make[2]: Entering directory '/home/buildbot/builder/monero-static-ubuntu-amd64/build/build/release/CMakeFiles/CMakeTmp'
Building C object CMakeFiles/cmTC_2944c.dir/CheckIncludeFile.c.o
/usr/bin/cc   -pthread    -o CMakeFiles/cmTC_2944c.dir/CheckIncludeFile.c.o   -c /home/buildbot/builder/monero-static-ubuntu-amd64/build/build/release/CMakeFiles/CMakeTmp/CheckIncludeFile.c
/home/buildbot/builder/monero-static-ubuntu-amd64/build/build/release/CMakeFiles/CMakeTmp/CheckIncludeFile.c:1:10: fatal error: sys/sha2.h: No such file or directory
 #include <sys/sha2.h>
          ^~~~~~~~~~~~
compilation terminated.
CMakeFiles/cmTC_2944c.dir/build.make:65: recipe for target 'CMakeFiles/cmTC_2944c.dir/CheckIncludeFile.c.o' failed
make[2]: *** [CMakeFiles/cmTC_2944c.dir/CheckIncludeFile.c.o] Error 1
make[2]: Leaving directory '/home/buildbot/builder/monero-static-ubuntu-amd64/build/build/release/CMakeFiles/CMakeTmp'
Makefile:126: recipe for target 'cmTC_2944c/fast' failed
make[1]: *** [cmTC_2944c/fast] Error 2
make[1]: Leaving directory '/home/buildbot/builder/monero-static-ubuntu-amd64/build/build/release/CMakeFiles/CMakeTmp'


Determining if the include file vfork.h exists failed with the following output:
Change Dir: /home/buildbot/builder/monero-static-ubuntu-amd64/build/build/release/CMakeFiles/CMakeTmp

Run Build Command:"/usr/bin/make" "cmTC_43265/fast"
make[1]: Entering directory '/home/buildbot/builder/monero-static-ubuntu-amd64/build/build/release/CMakeFiles/CMakeTmp'
/usr/bin/make -f CMakeFiles/cmTC_43265.dir/build.make CMakeFiles/cmTC_43265.dir/build
make[2]: Entering directory '/home/buildbot/builder/monero-static-ubuntu-amd64/build/build/release/CMakeFiles/CMakeTmp'
Building C object CMakeFiles/cmTC_43265.dir/CheckIncludeFile.c.o
/usr/bin/cc   -pthread    -o CMakeFiles/cmTC_43265.dir/CheckIncludeFile.c.o   -c /home/buildbot/builder/monero-static-ubuntu-amd64/build/build/release/CMakeFiles/CMakeTmp/CheckIncludeFile.c
/home/buildbot/builder/monero-static-ubuntu-amd64/build/build/release/CMakeFiles/CMakeTmp/CheckIncludeFile.c:1:10: fatal error: vfork.h: No such file or directory
 #include <vfork.h>
          ^~~~~~~~~
compilation terminated.
CMakeFiles/cmTC_43265.dir/build.make:65: recipe for target 'CMakeFiles/cmTC_43265.dir/CheckIncludeFile.c.o' failed
make[2]: *** [CMakeFiles/cmTC_43265.dir/CheckIncludeFile.c.o] Error 1
make[2]: Leaving directory '/home/buildbot/builder/monero-static-ubuntu-amd64/build/build/release/CMakeFiles/CMakeTmp'
Makefile:126: recipe for target 'cmTC_43265/fast' failed
make[1]: *** [cmTC_43265/fast] Error 2
make[1]: Leaving directory '/home/buildbot/builder/monero-static-ubuntu-amd64/build/build/release/CMakeFiles/CMakeTmp'


Determining if the include file windows.h exists failed with the following output:
Change Dir: /home/buildbot/builder/monero-static-ubuntu-amd64/build/build/release/CMakeFiles/CMakeTmp

Run Build Command:"/usr/bin/make" "cmTC_d7336/fast"
make[1]: Entering directory '/home/buildbot/builder/monero-static-ubuntu-amd64/build/build/release/CMakeFiles/CMakeTmp'
/usr/bin/make -f CMakeFiles/cmTC_d7336.dir/build.make CMakeFiles/cmTC_d7336.dir/build
make[2]: Entering directory '/home/buildbot/builder/monero-static-ubuntu-amd64/build/build/release/CMakeFiles/CMakeTmp'
Building C object CMakeFiles/cmTC_d7336.dir/CheckIncludeFile.c.o
/usr/bin/cc   -pthread    -o CMakeFiles/cmTC_d7336.dir/CheckIncludeFile.c.o   -c /home/buildbot/builder/monero-static-ubuntu-amd64/build/build/release/CMakeFiles/CMakeTmp/CheckIncludeFile.c
/home/buildbot/builder/monero-static-ubuntu-amd64/build/build/release/CMakeFiles/CMakeTmp/CheckIncludeFile.c:1:10: fatal error: windows.h: No such file or directory
 #include <windows.h>
          ^~~~~~~~~~~
compilation terminated.
CMakeFiles/cmTC_d7336.dir/build.make:65: recipe for target 'CMakeFiles/cmTC_d7336.dir/CheckIncludeFile.c.o' failed
make[2]: *** [CMakeFiles/cmTC_d7336.dir/CheckIncludeFile.c.o] Error 1
make[2]: Leaving directory '/home/buildbot/builder/monero-static-ubuntu-amd64/build/build/release/CMakeFiles/CMakeTmp'
Makefile:126: recipe for target 'cmTC_d7336/fast' failed
make[1]: *** [cmTC_d7336/fast] Error 2
make[1]: Leaving directory '/home/buildbot/builder/monero-static-ubuntu-amd64/build/build/release/CMakeFiles/CMakeTmp'


Determining if the include file winsock2.h exists failed with the following output:
Change Dir: /home/buildbot/builder/monero-static-ubuntu-amd64/build/build/release/CMakeFiles/CMakeTmp

Run Build Command:"/usr/bin/make" "cmTC_366d5/fast"
make[1]: Entering directory '/home/buildbot/builder/monero-static-ubuntu-amd64/build/build/release/CMakeFiles/CMakeTmp'
/usr/bin/make -f CMakeFiles/cmTC_366d5.dir/build.make CMakeFiles/cmTC_366d5.dir/build
make[2]: Entering directory '/home/buildbot/builder/monero-static-ubuntu-amd64/build/build/release/CMakeFiles/CMakeTmp'
Building C object CMakeFiles/cmTC_366d5.dir/CheckIncludeFile.c.o
/usr/bin/cc   -pthread    -o CMakeFiles/cmTC_366d5.dir/CheckIncludeFile.c.o   -c /home/buildbot/builder/monero-static-ubuntu-amd64/build/build/release/CMakeFiles/CMakeTmp/CheckIncludeFile.c
/home/buildbot/builder/monero-static-ubuntu-amd64/build/build/release/CMakeFiles/CMakeTmp/CheckIncludeFile.c:1:10: fatal error: winsock2.h: No such file or directory
 #include <winsock2.h>
          ^~~~~~~~~~~~
compilation terminated.
CMakeFiles/cmTC_366d5.dir/build.make:65: recipe for target 'CMakeFiles/cmTC_366d5.dir/CheckIncludeFile.c.o' failed
make[2]: *** [CMakeFiles/cmTC_366d5.dir/CheckIncludeFile.c.o] Error 1
make[2]: Leaving directory '/home/buildbot/builder/monero-static-ubuntu-amd64/build/build/release/CMakeFiles/CMakeTmp'
Makefile:126: recipe for target 'cmTC_366d5/fast' failed
make[1]: *** [cmTC_366d5/fast] Error 2
make[1]: Leaving directory '/home/buildbot/builder/monero-static-ubuntu-amd64/build/build/release/CMakeFiles/CMakeTmp'


Determining if the include file ws2tcpip.h exists failed with the following output:
Change Dir: /home/buildbot/builder/monero-static-ubuntu-amd64/build/build/release/CMakeFiles/CMakeTmp

Run Build Command:"/usr/bin/make" "cmTC_c5c80/fast"
make[1]: Entering directory '/home/buildbot/builder/monero-static-ubuntu-amd64/build/build/release/CMakeFiles/CMakeTmp'
/usr/bin/make -f CMakeFiles/cmTC_c5c80.dir/build.make CMakeFiles/cmTC_c5c80.dir/build
make[2]: Entering directory '/home/buildbot/builder/monero-static-ubuntu-amd64/build/build/release/CMakeFiles/CMakeTmp'
Building C object CMakeFiles/cmTC_c5c80.dir/CheckIncludeFile.c.o
/usr/bin/cc   -pthread    -o CMakeFiles/cmTC_c5c80.dir/CheckIncludeFile.c.o   -c /home/buildbot/builder/monero-static-ubuntu-amd64/build/build/release/CMakeFiles/CMakeTmp/CheckIncludeFile.c
/home/buildbot/builder/monero-static-ubuntu-amd64/build/build/release/CMakeFiles/CMakeTmp/CheckIncludeFile.c:1:10: fatal error: ws2tcpip.h: No such file or directory
 #include <ws2tcpip.h>
          ^~~~~~~~~~~~
compilation terminated.
CMakeFiles/cmTC_c5c80.dir/build.make:65: recipe for target 'CMakeFiles/cmTC_c5c80.dir/CheckIncludeFile.c.o' failed
make[2]: *** [CMakeFiles/cmTC_c5c80.dir/CheckIncludeFile.c.o] Error 1
make[2]: Leaving directory '/home/buildbot/builder/monero-static-ubuntu-amd64/build/build/release/CMakeFiles/CMakeTmp'
Makefile:126: recipe for target 'cmTC_c5c80/fast' failed
make[1]: *** [cmTC_c5c80/fast] Error 2
make[1]: Leaving directory '/home/buildbot/builder/monero-static-ubuntu-amd64/build/build/release/CMakeFiles/CMakeTmp'


Determining if the function _beginthreadex exists failed with the following output:
Change Dir: /home/buildbot/builder/monero-static-ubuntu-amd64/build/build/release/CMakeFiles/CMakeTmp

Run Build Command:"/usr/bin/make" "cmTC_48a96/fast"
make[1]: Entering directory '/home/buildbot/builder/monero-static-ubuntu-amd64/build/build/release/CMakeFiles/CMakeTmp'
/usr/bin/make -f CMakeFiles/cmTC_48a96.dir/build.make CMakeFiles/cmTC_48a96.dir/build
make[2]: Entering directory '/home/buildbot/builder/monero-static-ubuntu-amd64/build/build/release/CMakeFiles/CMakeTmp'
Building C object CMakeFiles/cmTC_48a96.dir/CheckFunctionExists.c.o
/usr/bin/cc   -pthread -DCHECK_FUNCTION_EXISTS=_beginthreadex   -o CMakeFiles/cmTC_48a96.dir/CheckFunctionExists.c.o   -c /usr/share/cmake-3.10/Modules/CheckFunctionExists.c
Linking C executable cmTC_48a96
/usr/bin/cmake -E cmake_link_script CMakeFiles/cmTC_48a96.dir/link.txt --verbose=1
/usr/bin/cc  -pthread -DCHECK_FUNCTION_EXISTS=_beginthreadex    -rdynamic CMakeFiles/cmTC_48a96.dir/CheckFunctionExists.c.o  -o cmTC_48a96 
CMakeFiles/cmTC_48a96.dir/CheckFunctionExists.c.o: In function `main':
CheckFunctionExists.c:(.text+0x10): undefined reference to `_beginthreadex'
collect2: error: ld returned 1 exit status
CMakeFiles/cmTC_48a96.dir/build.make:97: recipe for target 'cmTC_48a96' failed
make[2]: *** [cmTC_48a96] Error 1
make[2]: Leaving directory '/home/buildbot/builder/monero-static-ubuntu-amd64/build/build/release/CMakeFiles/CMakeTmp'
Makefile:126: recipe for target 'cmTC_48a96/fast' failed
make[1]: *** [cmTC_48a96/fast] Error 2
make[1]: Leaving directory '/home/buildbot/builder/monero-static-ubuntu-amd64/build/build/release/CMakeFiles/CMakeTmp'


Determining if the function arc4random exists failed with the following output:
Change Dir: /home/buildbot/builder/monero-static-ubuntu-amd64/build/build/release/CMakeFiles/CMakeTmp

Run Build Command:"/usr/bin/make" "cmTC_43ce8/fast"
make[1]: Entering directory '/home/buildbot/builder/monero-static-ubuntu-amd64/build/build/release/CMakeFiles/CMakeTmp'
/usr/bin/make -f CMakeFiles/cmTC_43ce8.dir/build.make CMakeFiles/cmTC_43ce8.dir/build
make[2]: Entering directory '/home/buildbot/builder/monero-static-ubuntu-amd64/build/build/release/CMakeFiles/CMakeTmp'
Building C object CMakeFiles/cmTC_43ce8.dir/CheckFunctionExists.c.o
/usr/bin/cc   -pthread -DCHECK_FUNCTION_EXISTS=arc4random   -o CMakeFiles/cmTC_43ce8.dir/CheckFunctionExists.c.o   -c /usr/share/cmake-3.10/Modules/CheckFunctionExists.c
Linking C executable cmTC_43ce8
/usr/bin/cmake -E cmake_link_script CMakeFiles/cmTC_43ce8.dir/link.txt --verbose=1
/usr/bin/cc  -pthread -DCHECK_FUNCTION_EXISTS=arc4random    -rdynamic CMakeFiles/cmTC_43ce8.dir/CheckFunctionExists.c.o  -o cmTC_43ce8 
CMakeFiles/cmTC_43ce8.dir/CheckFunctionExists.c.o: In function `main':
CheckFunctionExists.c:(.text+0x10): undefined reference to `arc4random'
collect2: error: ld returned 1 exit status
CMakeFiles/cmTC_43ce8.dir/build.make:97: recipe for target 'cmTC_43ce8' failed
make[2]: *** [cmTC_43ce8] Error 1
make[2]: Leaving directory '/home/buildbot/builder/monero-static-ubuntu-amd64/build/build/release/CMakeFiles/CMakeTmp'
Makefile:126: recipe for target 'cmTC_43ce8/fast' failed
make[1]: *** [cmTC_43ce8/fast] Error 2
make[1]: Leaving directory '/home/buildbot/builder/monero-static-ubuntu-amd64/build/build/release/CMakeFiles/CMakeTmp'


Determining if the function arc4random_uniform exists failed with the following output:
Change Dir: /home/buildbot/builder/monero-static-ubuntu-amd64/build/build/release/CMakeFiles/CMakeTmp

Run Build Command:"/usr/bin/make" "cmTC_12bee/fast"
make[1]: Entering directory '/home/buildbot/builder/monero-static-ubuntu-amd64/build/build/release/CMakeFiles/CMakeTmp'
/usr/bin/make -f CMakeFiles/cmTC_12bee.dir/build.make CMakeFiles/cmTC_12bee.dir/build
make[2]: Entering directory '/home/buildbot/builder/monero-static-ubuntu-amd64/build/build/release/CMakeFiles/CMakeTmp'
Building C object CMakeFiles/cmTC_12bee.dir/CheckFunctionExists.c.o
/usr/bin/cc   -pthread -DCHECK_FUNCTION_EXISTS=arc4random_uniform   -o CMakeFiles/cmTC_12bee.dir/CheckFunctionExists.c.o   -c /usr/share/cmake-3.10/Modules/CheckFunctionExists.c
Linking C executable cmTC_12bee
/usr/bin/cmake -E cmake_link_script CMakeFiles/cmTC_12bee.dir/link.txt --verbose=1
/usr/bin/cc  -pthread -DCHECK_FUNCTION_EXISTS=arc4random_uniform    -rdynamic CMakeFiles/cmTC_12bee.dir/CheckFunctionExists.c.o  -o cmTC_12bee 
CMakeFiles/cmTC_12bee.dir/CheckFunctionExists.c.o: In function `main':
CheckFunctionExists.c:(.text+0x10): undefined reference to `arc4random_uniform'
collect2: error: ld returned 1 exit status
CMakeFiles/cmTC_12bee.dir/build.make:97: recipe for target 'cmTC_12bee' failed
make[2]: *** [cmTC_12bee] Error 1
make[2]: Leaving directory '/home/buildbot/builder/monero-static-ubuntu-amd64/build/build/release/CMakeFiles/CMakeTmp'
Makefile:126: recipe for target 'cmTC_12bee/fast' failed
make[1]: *** [cmTC_12bee/fast] Error 2
make[1]: Leaving directory '/home/buildbot/builder/monero-static-ubuntu-amd64/build/build/release/CMakeFiles/CMakeTmp'


Determining if the function ioctlsocket exists failed with the following output:
Change Dir: /home/buildbot/builder/monero-static-ubuntu-amd64/build/build/release/CMakeFiles/CMakeTmp

Run Build Command:"/usr/bin/make" "cmTC_3fcc8/fast"
make[1]: Entering directory '/home/buildbot/builder/monero-static-ubuntu-amd64/build/build/release/CMakeFiles/CMakeTmp'
/usr/bin/make -f CMakeFiles/cmTC_3fcc8.dir/build.make CMakeFiles/cmTC_3fcc8.dir/build
make[2]: Entering directory '/home/buildbot/builder/monero-static-ubuntu-amd64/build/build/release/CMakeFiles/CMakeTmp'
Building C object CMakeFiles/cmTC_3fcc8.dir/CheckFunctionExists.c.o
/usr/bin/cc   -pthread -DCHECK_FUNCTION_EXISTS=ioctlsocket   -o CMakeFiles/cmTC_3fcc8.dir/CheckFunctionExists.c.o   -c /usr/share/cmake-3.10/Modules/CheckFunctionExists.c
Linking C executable cmTC_3fcc8
/usr/bin/cmake -E cmake_link_script CMakeFiles/cmTC_3fcc8.dir/link.txt --verbose=1
/usr/bin/cc  -pthread -DCHECK_FUNCTION_EXISTS=ioctlsocket    -rdynamic CMakeFiles/cmTC_3fcc8.dir/CheckFunctionExists.c.o  -o cmTC_3fcc8 
CMakeFiles/cmTC_3fcc8.dir/CheckFunctionExists.c.o: In function `main':
CheckFunctionExists.c:(.text+0x10): undefined reference to `ioctlsocket'
collect2: error: ld returned 1 exit status
CMakeFiles/cmTC_3fcc8.dir/build.make:97: recipe for target 'cmTC_3fcc8' failed
make[2]: *** [cmTC_3fcc8] Error 1
make[2]: Leaving directory '/home/buildbot/builder/monero-static-ubuntu-amd64/build/build/release/CMakeFiles/CMakeTmp'
Makefile:126: recipe for target 'cmTC_3fcc8/fast' failed
make[1]: *** [cmTC_3fcc8/fast] Error 2
make[1]: Leaving directory '/home/buildbot/builder/monero-static-ubuntu-amd64/build/build/release/CMakeFiles/CMakeTmp'


Determining if the function setusercontent exists failed with the following output:
Change Dir: /home/buildbot/builder/monero-static-ubuntu-amd64/build/build/release/CMakeFiles/CMakeTmp

Run Build Command:"/usr/bin/make" "cmTC_7787b/fast"
make[1]: Entering directory '/home/buildbot/builder/monero-static-ubuntu-amd64/build/build/release/CMakeFiles/CMakeTmp'
/usr/bin/make -f CMakeFiles/cmTC_7787b.dir/build.make CMakeFiles/cmTC_7787b.dir/build
make[2]: Entering directory '/home/buildbot/builder/monero-static-ubuntu-amd64/build/build/release/CMakeFiles/CMakeTmp'
Building C object CMakeFiles/cmTC_7787b.dir/CheckFunctionExists.c.o
/usr/bin/cc   -pthread -DCHECK_FUNCTION_EXISTS=setusercontent   -o CMakeFiles/cmTC_7787b.dir/CheckFunctionExists.c.o   -c /usr/share/cmake-3.10/Modules/CheckFunctionExists.c
Linking C executable cmTC_7787b
/usr/bin/cmake -E cmake_link_script CMakeFiles/cmTC_7787b.dir/link.txt --verbose=1
/usr/bin/cc  -pthread -DCHECK_FUNCTION_EXISTS=setusercontent    -rdynamic CMakeFiles/cmTC_7787b.dir/CheckFunctionExists.c.o  -o cmTC_7787b 
CMakeFiles/cmTC_7787b.dir/CheckFunctionExists.c.o: In function `main':
CheckFunctionExists.c:(.text+0x10): undefined reference to `setusercontent'
collect2: error: ld returned 1 exit status
CMakeFiles/cmTC_7787b.dir/build.make:97: recipe for target 'cmTC_7787b' failed
make[2]: *** [cmTC_7787b] Error 1
make[2]: Leaving directory '/home/buildbot/builder/monero-static-ubuntu-amd64/build/build/release/CMakeFiles/CMakeTmp'
Makefile:126: recipe for target 'cmTC_7787b/fast' failed
make[1]: *** [cmTC_7787b/fast] Error 2
make[1]: Leaving directory '/home/buildbot/builder/monero-static-ubuntu-amd64/build/build/release/CMakeFiles/CMakeTmp'


Determining if the function strlcat exists failed with the following output:
Change Dir: /home/buildbot/builder/monero-static-ubuntu-amd64/build/build/release/CMakeFiles/CMakeTmp

Run Build Command:"/usr/bin/make" "cmTC_6c89d/fast"
make[1]: Entering directory '/home/buildbot/builder/monero-static-ubuntu-amd64/build/build/release/CMakeFiles/CMakeTmp'
/usr/bin/make -f CMakeFiles/cmTC_6c89d.dir/build.make CMakeFiles/cmTC_6c89d.dir/build
make[2]: Entering directory '/home/buildbot/builder/monero-static-ubuntu-amd64/build/build/release/CMakeFiles/CMakeTmp'
Building C object CMakeFiles/cmTC_6c89d.dir/CheckFunctionExists.c.o
/usr/bin/cc   -pthread -DCHECK_FUNCTION_EXISTS=strlcat   -o CMakeFiles/cmTC_6c89d.dir/CheckFunctionExists.c.o   -c /usr/share/cmake-3.10/Modules/CheckFunctionExists.c
Linking C executable cmTC_6c89d
/usr/bin/cmake -E cmake_link_script CMakeFiles/cmTC_6c89d.dir/link.txt --verbose=1
/usr/bin/cc  -pthread -DCHECK_FUNCTION_EXISTS=strlcat    -rdynamic CMakeFiles/cmTC_6c89d.dir/CheckFunctionExists.c.o  -o cmTC_6c89d 
CMakeFiles/cmTC_6c89d.dir/CheckFunctionExists.c.o: In function `main':
CheckFunctionExists.c:(.text+0x10): undefined reference to `strlcat'
collect2: error: ld returned 1 exit status
CMakeFiles/cmTC_6c89d.dir/build.make:97: recipe for target 'cmTC_6c89d' failed
make[2]: *** [cmTC_6c89d] Error 1
make[2]: Leaving directory '/home/buildbot/builder/monero-static-ubuntu-amd64/build/build/release/CMakeFiles/CMakeTmp'
Makefile:126: recipe for target 'cmTC_6c89d/fast' failed
make[1]: *** [cmTC_6c89d/fast] Error 2
make[1]: Leaving directory '/home/buildbot/builder/monero-static-ubuntu-amd64/build/build/release/CMakeFiles/CMakeTmp'


Determining if the function strlcpy exists failed with the following output:
Change Dir: /home/buildbot/builder/monero-static-ubuntu-amd64/build/build/release/CMakeFiles/CMakeTmp

Run Build Command:"/usr/bin/make" "cmTC_46801/fast"
make[1]: Entering directory '/home/buildbot/builder/monero-static-ubuntu-amd64/build/build/release/CMakeFiles/CMakeTmp'
/usr/bin/make -f CMakeFiles/cmTC_46801.dir/build.make CMakeFiles/cmTC_46801.dir/build
make[2]: Entering directory '/home/buildbot/builder/monero-static-ubuntu-amd64/build/build/release/CMakeFiles/CMakeTmp'
Building C object CMakeFiles/cmTC_46801.dir/CheckFunctionExists.c.o
/usr/bin/cc   -pthread -DCHECK_FUNCTION_EXISTS=strlcpy   -o CMakeFiles/cmTC_46801.dir/CheckFunctionExists.c.o   -c /usr/share/cmake-3.10/Modules/CheckFunctionExists.c
Linking C executable cmTC_46801
/usr/bin/cmake -E cmake_link_script CMakeFiles/cmTC_46801.dir/link.txt --verbose=1
/usr/bin/cc  -pthread -DCHECK_FUNCTION_EXISTS=strlcpy    -rdynamic CMakeFiles/cmTC_46801.dir/CheckFunctionExists.c.o  -o cmTC_46801 
CMakeFiles/cmTC_46801.dir/CheckFunctionExists.c.o: In function `main':
CheckFunctionExists.c:(.text+0x10): undefined reference to `strlcpy'
collect2: error: ld returned 1 exit status
CMakeFiles/cmTC_46801.dir/build.make:97: recipe for target 'cmTC_46801' failed
make[2]: *** [cmTC_46801] Error 1
make[2]: Leaving directory '/home/buildbot/builder/monero-static-ubuntu-amd64/build/build/release/CMakeFiles/CMakeTmp'
Makefile:126: recipe for target 'cmTC_46801/fast' failed
make[1]: *** [cmTC_46801/fast] Error 2
make[1]: Leaving directory '/home/buildbot/builder/monero-static-ubuntu-amd64/build/build/release/CMakeFiles/CMakeTmp'


Determining if the PTHREAD_PRIO_INHERIT exist failed with the following output:
Change Dir: /home/buildbot/builder/monero-static-ubuntu-amd64/build/build/release/CMakeFiles/CMakeTmp

Run Build Command:"/usr/bin/make" "cmTC_fe8bd/fast"
make[1]: Entering directory '/home/buildbot/builder/monero-static-ubuntu-amd64/build/build/release/CMakeFiles/CMakeTmp'
/usr/bin/make -f CMakeFiles/cmTC_fe8bd.dir/build.make CMakeFiles/cmTC_fe8bd.dir/build
make[2]: Entering directory '/home/buildbot/builder/monero-static-ubuntu-amd64/build/build/release/CMakeFiles/CMakeTmp'
Building C object CMakeFiles/cmTC_fe8bd.dir/CheckSymbolExists.c.o
/usr/bin/cc   -pthread    -o CMakeFiles/cmTC_fe8bd.dir/CheckSymbolExists.c.o   -c /home/buildbot/builder/monero-static-ubuntu-amd64/build/build/release/CMakeFiles/CMakeTmp/CheckSymbolExists.c
/home/buildbot/builder/monero-static-ubuntu-amd64/build/build/release/CMakeFiles/CMakeTmp/CheckSymbolExists.c: In function 'main':
/home/buildbot/builder/monero-static-ubuntu-amd64/build/build/release/CMakeFiles/CMakeTmp/CheckSymbolExists.c:8:18: error: lvalue required as unary '&' operand
   return ((int*)(&PTHREAD_PRIO_INHERIT))[argc];
                  ^
CMakeFiles/cmTC_fe8bd.dir/build.make:65: recipe for target 'CMakeFiles/cmTC_fe8bd.dir/CheckSymbolExists.c.o' failed
make[2]: *** [CMakeFiles/cmTC_fe8bd.dir/CheckSymbolExists.c.o] Error 1
make[2]: Leaving directory '/home/buildbot/builder/monero-static-ubuntu-amd64/build/build/release/CMakeFiles/CMakeTmp'
Makefile:126: recipe for target 'cmTC_fe8bd/fast' failed
make[1]: *** [cmTC_fe8bd/fast] Error 2
make[1]: Leaving directory '/home/buildbot/builder/monero-static-ubuntu-amd64/build/build/release/CMakeFiles/CMakeTmp'

File /home/buildbot/builder/monero-static-ubuntu-amd64/build/build/release/CMakeFiles/CMakeTmp/CheckSymbolExists.c:
/* */
#include <pthread.h>

int main(int argc, char** argv)
{
  (void)argv;
#ifndef PTHREAD_PRIO_INHERIT
  return ((int*)(&PTHREAD_PRIO_INHERIT))[argc];
#else
  (void)argc;
  return 0;
#endif
}

Determining if the pthread_rwlock_t exist failed with the following output:
Change Dir: /home/buildbot/builder/monero-static-ubuntu-amd64/build/build/release/CMakeFiles/CMakeTmp

Run Build Command:"/usr/bin/make" "cmTC_7e8b4/fast"
make[1]: Entering directory '/home/buildbot/builder/monero-static-ubuntu-amd64/build/build/release/CMakeFiles/CMakeTmp'
/usr/bin/make -f CMakeFiles/cmTC_7e8b4.dir/build.make CMakeFiles/cmTC_7e8b4.dir/build
make[2]: Entering directory '/home/buildbot/builder/monero-static-ubuntu-amd64/build/build/release/CMakeFiles/CMakeTmp'
Building C object CMakeFiles/cmTC_7e8b4.dir/CheckSymbolExists.c.o
/usr/bin/cc   -pthread    -o CMakeFiles/cmTC_7e8b4.dir/CheckSymbolExists.c.o   -c /home/buildbot/builder/monero-static-ubuntu-amd64/build/build/release/CMakeFiles/CMakeTmp/CheckSymbolExists.c
/home/buildbot/builder/monero-static-ubuntu-amd64/build/build/release/CMakeFiles/CMakeTmp/CheckSymbolExists.c: In function 'main':
/home/buildbot/builder/monero-static-ubuntu-amd64/build/build/release/CMakeFiles/CMakeTmp/CheckSymbolExists.c:8:19: error: expected expression before 'pthread_rwlock_t'
   return ((int*)(&pthread_rwlock_t))[argc];
                   ^~~~~~~~~~~~~~~~
CMakeFiles/cmTC_7e8b4.dir/build.make:65: recipe for target 'CMakeFiles/cmTC_7e8b4.dir/CheckSymbolExists.c.o' failed
make[2]: *** [CMakeFiles/cmTC_7e8b4.dir/CheckSymbolExists.c.o] Error 1
make[2]: Leaving directory '/home/buildbot/builder/monero-static-ubuntu-amd64/build/build/release/CMakeFiles/CMakeTmp'
Makefile:126: recipe for target 'cmTC_7e8b4/fast' failed
make[1]: *** [cmTC_7e8b4/fast] Error 2
make[1]: Leaving directory '/home/buildbot/builder/monero-static-ubuntu-amd64/build/build/release/CMakeFiles/CMakeTmp'

File /home/buildbot/builder/monero-static-ubuntu-amd64/build/build/release/CMakeFiles/CMakeTmp/CheckSymbolExists.c:
/* */
#include <pthread.h>

int main(int argc, char** argv)
{
  (void)argv;
#ifndef pthread_rwlock_t
  return ((int*)(&pthread_rwlock_t))[argc];
#else
  (void)argc;
  return 0;
#endif
}

Determining if the pthread_spinlock_t exist failed with the following output:
Change Dir: /home/buildbot/builder/monero-static-ubuntu-amd64/build/build/release/CMakeFiles/CMakeTmp

Run Build Command:"/usr/bin/make" "cmTC_ed8d9/fast"
make[1]: Entering directory '/home/buildbot/builder/monero-static-ubuntu-amd64/build/build/release/CMakeFiles/CMakeTmp'
/usr/bin/make -f CMakeFiles/cmTC_ed8d9.dir/build.make CMakeFiles/cmTC_ed8d9.dir/build
make[2]: Entering directory '/home/buildbot/builder/monero-static-ubuntu-amd64/build/build/release/CMakeFiles/CMakeTmp'
Building C object CMakeFiles/cmTC_ed8d9.dir/CheckSymbolExists.c.o
/usr/bin/cc   -pthread    -o CMakeFiles/cmTC_ed8d9.dir/CheckSymbolExists.c.o   -c /home/buildbot/builder/monero-static-ubuntu-amd64/build/build/release/CMakeFiles/CMakeTmp/CheckSymbolExists.c
/home/buildbot/builder/monero-static-ubuntu-amd64/build/build/release/CMakeFiles/CMakeTmp/CheckSymbolExists.c: In function 'main':
/home/buildbot/builder/monero-static-ubuntu-amd64/build/build/release/CMakeFiles/CMakeTmp/CheckSymbolExists.c:8:19: error: expected expression before 'pthread_spinlock_t'
   return ((int*)(&pthread_spinlock_t))[argc];
                   ^~~~~~~~~~~~~~~~~~
CMakeFiles/cmTC_ed8d9.dir/build.make:65: recipe for target 'CMakeFiles/cmTC_ed8d9.dir/CheckSymbolExists.c.o' failed
make[2]: *** [CMakeFiles/cmTC_ed8d9.dir/CheckSymbolExists.c.o] Error 1
make[2]: Leaving directory '/home/buildbot/builder/monero-static-ubuntu-amd64/build/build/release/CMakeFiles/CMakeTmp'
Makefile:126: recipe for target 'cmTC_ed8d9/fast' failed
make[1]: *** [cmTC_ed8d9/fast] Error 2
make[1]: Leaving directory '/home/buildbot/builder/monero-static-ubuntu-amd64/build/build/release/CMakeFiles/CMakeTmp'

File /home/buildbot/builder/monero-static-ubuntu-amd64/build/build/release/CMakeFiles/CMakeTmp/CheckSymbolExists.c:
/* */
#include <pthread.h>

int main(int argc, char** argv)
{
  (void)argv;
#ifndef pthread_spinlock_t
  return ((int*)(&pthread_spinlock_t))[argc];
#else
  (void)argc;
  return 0;
#endif
}

Determining if the LIBRESSL_VERSION_TEXT exist failed with the following output:
Change Dir: /home/buildbot/builder/monero-static-ubuntu-amd64/build/build/release/CMakeFiles/CMakeTmp

Run Build Command:"/usr/bin/make" "cmTC_f2fb0/fast"
make[1]: Entering directory '/home/buildbot/builder/monero-static-ubuntu-amd64/build/build/release/CMakeFiles/CMakeTmp'
/usr/bin/make -f CMakeFiles/cmTC_f2fb0.dir/build.make CMakeFiles/cmTC_f2fb0.dir/build
make[2]: Entering directory '/home/buildbot/builder/monero-static-ubuntu-amd64/build/build/release/CMakeFiles/CMakeTmp'
Building C object CMakeFiles/cmTC_f2fb0.dir/CheckSymbolExists.c.o
/usr/bin/cc   -pthread    -o CMakeFiles/cmTC_f2fb0.dir/CheckSymbolExists.c.o   -c /home/buildbot/builder/monero-static-ubuntu-amd64/build/build/release/CMakeFiles/CMakeTmp/CheckSymbolExists.c
/home/buildbot/builder/monero-static-ubuntu-amd64/build/build/release/CMakeFiles/CMakeTmp/CheckSymbolExists.c: In function 'main':
/home/buildbot/builder/monero-static-ubuntu-amd64/build/build/release/CMakeFiles/CMakeTmp/CheckSymbolExists.c:8:19: error: 'LIBRESSL_VERSION_TEXT' undeclared (first use in this function); did you mean 'OPENSSL_VERSION_TEXT'?
   return ((int*)(&LIBRESSL_VERSION_TEXT))[argc];
                   ^~~~~~~~~~~~~~~~~~~~~
                   OPENSSL_VERSION_TEXT
/home/buildbot/builder/monero-static-ubuntu-amd64/build/build/release/CMakeFiles/CMakeTmp/CheckSymbolExists.c:8:19: note: each undeclared identifier is reported only once for each function it appears in
CMakeFiles/cmTC_f2fb0.dir/build.make:65: recipe for target 'CMakeFiles/cmTC_f2fb0.dir/CheckSymbolExists.c.o' failed
make[2]: *** [CMakeFiles/cmTC_f2fb0.dir/CheckSymbolExists.c.o] Error 1
make[2]: Leaving directory '/home/buildbot/builder/monero-static-ubuntu-amd64/build/build/release/CMakeFiles/CMakeTmp'
Makefile:126: recipe for target 'cmTC_f2fb0/fast' failed
make[1]: *** [cmTC_f2fb0/fast] Error 2
make[1]: Leaving directory '/home/buildbot/builder/monero-static-ubuntu-amd64/build/build/release/CMakeFiles/CMakeTmp'

File /home/buildbot/builder/monero-static-ubuntu-amd64/build/build/release/CMakeFiles/CMakeTmp/CheckSymbolExists.c:
/* */
#include <openssl/opensslv.h>

int main(int argc, char** argv)
{
  (void)argv;
#ifndef LIBRESSL_VERSION_TEXT
  return ((int*)(&LIBRESSL_VERSION_TEXT))[argc];
#else
  (void)argc;
  return 0;
#endif
}

Performing C SOURCE FILE Test _fcf_protection=full_c failed with the following output:
Change Dir: /home/buildbot/builder/monero-static-ubuntu-amd64/build/build/release/CMakeFiles/CMakeTmp

Run Build Command:"/usr/bin/make" "cmTC_da1c2/fast"
make[1]: Entering directory '/home/buildbot/builder/monero-static-ubuntu-amd64/build/build/release/CMakeFiles/CMakeTmp'
/usr/bin/make -f CMakeFiles/cmTC_da1c2.dir/build.make CMakeFiles/cmTC_da1c2.dir/build
make[2]: Entering directory '/home/buildbot/builder/monero-static-ubuntu-amd64/build/build/release/CMakeFiles/CMakeTmp'
Building C object CMakeFiles/cmTC_da1c2.dir/src.c.o
/usr/bin/cc   -pthread -maes -march=x86-64 -fno-strict-aliasing -D_fcf_protection=full_c   -fcf-protection=full -o CMakeFiles/cmTC_da1c2.dir/src.c.o   -c /home/buildbot/builder/monero-static-ubuntu-amd64/build/build/release/CMakeFiles/CMakeTmp/src.c
cc: error: unrecognized command line option '-fcf-protection=full'; did you mean '-fstack-protector-all'?
CMakeFiles/cmTC_da1c2.dir/build.make:65: recipe for target 'CMakeFiles/cmTC_da1c2.dir/src.c.o' failed
make[2]: *** [CMakeFiles/cmTC_da1c2.dir/src.c.o] Error 1
make[2]: Leaving directory '/home/buildbot/builder/monero-static-ubuntu-amd64/build/build/release/CMakeFiles/CMakeTmp'
Makefile:126: recipe for target 'cmTC_da1c2/fast' failed
make[1]: *** [cmTC_da1c2/fast] Error 2
make[1]: Leaving directory '/home/buildbot/builder/monero-static-ubuntu-amd64/build/build/release/CMakeFiles/CMakeTmp'

Source file was:
int main(void) { return 0; }
Performing C++ SOURCE FILE Test _fcf_protection=full_cxx failed with the following output:
Change Dir: /home/buildbot/builder/monero-static-ubuntu-amd64/build/build/release/CMakeFiles/CMakeTmp

Run Build Command:"/usr/bin/make" "cmTC_b8edd/fast"
make[1]: Entering directory '/home/buildbot/builder/monero-static-ubuntu-amd64/build/build/release/CMakeFiles/CMakeTmp'
/usr/bin/make -f CMakeFiles/cmTC_b8edd.dir/build.make CMakeFiles/cmTC_b8edd.dir/build
make[2]: Entering directory '/home/buildbot/builder/monero-static-ubuntu-amd64/build/build/release/CMakeFiles/CMakeTmp'
Building CXX object CMakeFiles/cmTC_b8edd.dir/src.cxx.o
/usr/bin/c++    -DZMQ_STATIC -pthread -maes -march=x86-64 -fno-strict-aliasing -D_fcf_protection=full_cxx   -fcf-protection=full -o CMakeFiles/cmTC_b8edd.dir/src.cxx.o -c /home/buildbot/builder/monero-static-ubuntu-amd64/build/build/release/CMakeFiles/CMakeTmp/src.cxx
c++: error: unrecognized command line option '-fcf-protection=full'; did you mean '-fstack-protector-all'?
CMakeFiles/cmTC_b8edd.dir/build.make:65: recipe for target 'CMakeFiles/cmTC_b8edd.dir/src.cxx.o' failed
make[2]: *** [CMakeFiles/cmTC_b8edd.dir/src.cxx.o] Error 1
make[2]: Leaving directory '/home/buildbot/builder/monero-static-ubuntu-amd64/build/build/release/CMakeFiles/CMakeTmp'
Makefile:126: recipe for target 'cmTC_b8edd/fast' failed
make[1]: *** [cmTC_b8edd/fast] Error 2
make[1]: Leaving directory '/home/buildbot/builder/monero-static-ubuntu-amd64/build/build/release/CMakeFiles/CMakeTmp'

Source file was:
int main() { return 0; }
Performing C SOURCE FILE Test _fstack_clash_protection_c failed with the following output:
Change Dir: /home/buildbot/builder/monero-static-ubuntu-amd64/build/build/release/CMakeFiles/CMakeTmp

Run Build Command:"/usr/bin/make" "cmTC_c2dd2/fast"
make[1]: Entering directory '/home/buildbot/builder/monero-static-ubuntu-amd64/build/build/release/CMakeFiles/CMakeTmp'
/usr/bin/make -f CMakeFiles/cmTC_c2dd2.dir/build.make CMakeFiles/cmTC_c2dd2.dir/build
make[2]: Entering directory '/home/buildbot/builder/monero-static-ubuntu-amd64/build/build/release/CMakeFiles/CMakeTmp'
Building C object CMakeFiles/cmTC_c2dd2.dir/src.c.o
/usr/bin/cc   -pthread -maes -march=x86-64 -fno-strict-aliasing -D_fstack_clash_protection_c   -fstack-clash-protection -o CMakeFiles/cmTC_c2dd2.dir/src.c.o   -c /home/buildbot/builder/monero-static-ubuntu-amd64/build/build/release/CMakeFiles/CMakeTmp/src.c
cc: error: unrecognized command line option '-fstack-clash-protection'; did you mean '-fstack-protector'?
CMakeFiles/cmTC_c2dd2.dir/build.make:65: recipe for target 'CMakeFiles/cmTC_c2dd2.dir/src.c.o' failed
make[2]: *** [CMakeFiles/cmTC_c2dd2.dir/src.c.o] Error 1
make[2]: Leaving directory '/home/buildbot/builder/monero-static-ubuntu-amd64/build/build/release/CMakeFiles/CMakeTmp'
Makefile:126: recipe for target 'cmTC_c2dd2/fast' failed
make[1]: *** [cmTC_c2dd2/fast] Error 2
make[1]: Leaving directory '/home/buildbot/builder/monero-static-ubuntu-amd64/build/build/release/CMakeFiles/CMakeTmp'

Source file was:
int main(void) { return 0; }
Performing C++ SOURCE FILE Test _fstack_clash_protection_cxx failed with the following output:
Change Dir: /home/buildbot/builder/monero-static-ubuntu-amd64/build/build/release/CMakeFiles/CMakeTmp

Run Build Command:"/usr/bin/make" "cmTC_a2212/fast"
make[1]: Entering directory '/home/buildbot/builder/monero-static-ubuntu-amd64/build/build/release/CMakeFiles/CMakeTmp'
/usr/bin/make -f CMakeFiles/cmTC_a2212.dir/build.make CMakeFiles/cmTC_a2212.dir/build
make[2]: Entering directory '/home/buildbot/builder/monero-static-ubuntu-amd64/build/build/release/CMakeFiles/CMakeTmp'
Building CXX object CMakeFiles/cmTC_a2212.dir/src.cxx.o
/usr/bin/c++    -DZMQ_STATIC -pthread -maes -march=x86-64 -fno-strict-aliasing -D_fstack_clash_protection_cxx   -fstack-clash-protection -o CMakeFiles/cmTC_a2212.dir/src.cxx.o -c /home/buildbot/builder/monero-static-ubuntu-amd64/build/build/release/CMakeFiles/CMakeTmp/src.cxx
c++: error: unrecognized command line option '-fstack-clash-protection'; did you mean '-fstack-protector'?
CMakeFiles/cmTC_a2212.dir/build.make:65: recipe for target 'CMakeFiles/cmTC_a2212.dir/src.cxx.o' failed
make[2]: *** [CMakeFiles/cmTC_a2212.dir/src.cxx.o] Error 1
make[2]: Leaving directory '/home/buildbot/builder/monero-static-ubuntu-amd64/build/build/release/CMakeFiles/CMakeTmp'
Makefile:126: recipe for target 'cmTC_a2212/fast' failed
make[1]: *** [cmTC_a2212/fast] Error 2
make[1]: Leaving directory '/home/buildbot/builder/monero-static-ubuntu-amd64/build/build/release/CMakeFiles/CMakeTmp'

Source file was:
int main() { return 0; }
Determining if the -Wl,-z,noexecheap linker flag is supported failed with the following output:
Change Dir: /home/buildbot/builder/monero-static-ubuntu-amd64/build/build/release/CMakeFiles/CMakeTmp

Run Build Command:"/usr/bin/make" "cmTC_904d1/fast"
make[1]: Entering directory '/home/buildbot/builder/monero-static-ubuntu-amd64/build/build/release/CMakeFiles/CMakeTmp'
/usr/bin/make -f CMakeFiles/cmTC_904d1.dir/build.make CMakeFiles/cmTC_904d1.dir/build
make[2]: Entering directory '/home/buildbot/builder/monero-static-ubuntu-amd64/build/build/release/CMakeFiles/CMakeTmp'
Building C object CMakeFiles/cmTC_904d1.dir/CheckLinkerFlag.c.o
/usr/bin/cc   -Wl,-z,noexecheap    -Wl,-z,noexecheap -o CMakeFiles/cmTC_904d1.dir/CheckLinkerFlag.c.o   -c /home/buildbot/builder/monero-static-ubuntu-amd64/build/cmake/CheckLinkerFlag.c
Linking C executable cmTC_904d1
/usr/bin/cmake -E cmake_link_script CMakeFiles/cmTC_904d1.dir/link.txt --verbose=1
/usr/bin/cc -Wl,-z,noexecheap     -rdynamic CMakeFiles/cmTC_904d1.dir/CheckLinkerFlag.c.o  -o cmTC_904d1 
/usr/bin/ld: warning: -z noexecheap ignored.
make[2]: Leaving directory '/home/buildbot/builder/monero-static-ubuntu-amd64/build/build/release/CMakeFiles/CMakeTmp'
make[1]: Leaving directory '/home/buildbot/builder/monero-static-ubuntu-amd64/build/build/release/CMakeFiles/CMakeTmp'


Determining if the function rl_copy_text exists failed with the following output:
Change Dir: /home/buildbot/builder/monero-static-ubuntu-amd64/build/build/release/CMakeFiles/CMakeTmp

Run Build Command:"/usr/bin/make" "cmTC_638e8/fast"
make[1]: Entering directory '/home/buildbot/builder/monero-static-ubuntu-amd64/build/build/release/CMakeFiles/CMakeTmp'
/usr/bin/make -f CMakeFiles/cmTC_638e8.dir/build.make CMakeFiles/cmTC_638e8.dir/build
make[2]: Entering directory '/home/buildbot/builder/monero-static-ubuntu-amd64/build/build/release/CMakeFiles/CMakeTmp'
Building C object CMakeFiles/cmTC_638e8.dir/CheckFunctionExists.c.o
/usr/bin/cc   -pthread -maes -march=x86-64 -fno-strict-aliasing -std=c11 -D_GNU_SOURCE   -Wall -Wextra -Wpointer-arith -Wundef -Wvla -Wwrite-strings -Wno-error=extra -Wno-error=deprecated-declarations -Wno-unused-parameter -Wno-unused-variable -Wno-error=unused-variable -Wno-error=undef -Wno-error=uninitialized -Wlogical-op -Wno-error=maybe-uninitialized -Wno-error=cpp -Waggregate-return -Wnested-externs -Wold-style-definition -Wstrict-prototypes  -fPIC  -Wformat -Wformat-security -fstack-protector -fstack-protector-strong -mmitigate-rop -fno-strict-aliasing -DCHECK_FUNCTION_EXISTS=rl_copy_text   -o CMakeFiles/cmTC_638e8.dir/CheckFunctionExists.c.o   -c /usr/share/cmake-3.10/Modules/CheckFunctionExists.c
Linking C executable cmTC_638e8
/usr/bin/cmake -E cmake_link_script CMakeFiles/cmTC_638e8.dir/link.txt --verbose=1
/usr/bin/cc  -pthread -maes -march=x86-64 -fno-strict-aliasing -std=c11 -D_GNU_SOURCE   -Wall -Wextra -Wpointer-arith -Wundef -Wvla -Wwrite-strings -Wno-error=extra -Wno-error=deprecated-declarations -Wno-unused-parameter -Wno-unused-variable -Wno-error=unused-variable -Wno-error=undef -Wno-error=uninitialized -Wlogical-op -Wno-error=maybe-uninitialized -Wno-error=cpp -Waggregate-return -Wnested-externs -Wold-style-definition -Wstrict-prototypes  -fPIC  -Wformat -Wformat-security -fstack-protector -fstack-protector-strong -mmitigate-rop -fno-strict-aliasing -DCHECK_FUNCTION_EXISTS=rl_copy_text    -rdynamic CMakeFiles/cmTC_638e8.dir/CheckFunctionExists.c.o  -o cmTC_638e8 /usr/lib/x86_64-linux-gnu/libreadline.a 
/usr/lib/x86_64-linux-gnu/libreadline.a(terminal.o): In function `_rl_get_screen_size':
(.text+0x186): undefined reference to `tgetnum'
(.text+0x2be): undefined reference to `tgetnum'
/usr/lib/x86_64-linux-gnu/libreadline.a(terminal.o): In function `_rl_init_terminal_io':
(.text+0x678): undefined reference to `PC'
(.text+0x687): undefined reference to `BC'
(.text+0x68e): undefined reference to `UP'
(.text+0x728): undefined reference to `tgetent'
(.text+0x76f): undefined reference to `tgetstr'
(.text+0x799): undefined reference to `PC'
(.text+0x7af): undefined reference to `BC'
(.text+0x7bd): undefined reference to `UP'
(.text+0x7cf): undefined reference to `tgetflag'
(.text+0x81e): undefined reference to `tgetflag'
(.text+0x938): undefined reference to `tgetflag'
/usr/lib/x86_64-linux-gnu/libreadline.a(terminal.o): In function `_rl_backspace':
(.text+0xb4b): undefined reference to `tputs'
/usr/lib/x86_64-linux-gnu/libreadline.a(terminal.o): In function `rl_ding':
(.text+0xc1d): undefined reference to `tputs'
/usr/lib/x86_64-linux-gnu/libreadline.a(terminal.o): In function `_rl_enable_meta_key':
(.text+0xc67): undefined reference to `tputs'
/usr/lib/x86_64-linux-gnu/libreadline.a(terminal.o): In function `_rl_disable_meta_key':
(.text+0xcc9): undefined reference to `tputs'
/usr/lib/x86_64-linux-gnu/libreadline.a(terminal.o): In function `_rl_control_keypad':
(.text+0xcfd): undefined reference to `tputs'
/usr/lib/x86_64-linux-gnu/libreadline.a(terminal.o):(.text+0xd50): more undefined references to `tputs' follow
/usr/lib/x86_64-linux-gnu/libreadline.a(display.o): In function `update_line':
(.text+0x301f): undefined reference to `tgoto'
(.text+0x3033): undefined reference to `tputs'
(.text+0x31cc): undefined reference to `tputs'
(.text+0x32bf): undefined reference to `tputs'
(.text+0x34b8): undefined reference to `tputs'
(.text+0x3513): undefined reference to `tputs'
(.text+0x3546): undefined reference to `tgoto'
(.text+0x3557): undefined reference to `tputs'
/usr/lib/x86_64-linux-gnu/libreadline.a(display.o): In function `rl_redisplay':
(.text+0x4591): undefined reference to `tputs'
(.text+0x50be): undefined reference to `tputs'
/usr/lib/x86_64-linux-gnu/libreadline.a(display.o): In function `rl_clear_visible_line':
(.text+0x5265): undefined reference to `tputs'
/usr/lib/x86_64-linux-gnu/libreadline.a(display.o): In function `_rl_redisplay_after_sigwinch':
(.text+0x53f1): undefined reference to `tputs'
/usr/lib/x86_64-linux-gnu/libreadline.a(display.o):(.text+0x5414): more undefined references to `tputs' follow
collect2: error: ld returned 1 exit status
CMakeFiles/cmTC_638e8.dir/build.make:98: recipe for target 'cmTC_638e8' failed
make[2]: *** [cmTC_638e8] Error 1
make[2]: Leaving directory '/home/buildbot/builder/monero-static-ubuntu-amd64/build/build/release/CMakeFiles/CMakeTmp'
Makefile:126: recipe for target 'cmTC_638e8/fast' failed
make[1]: *** [cmTC_638e8/fast] Error 2
make[1]: Leaving directory '/home/buildbot/builder/monero-static-ubuntu-amd64/build/build/release/CMakeFiles/CMakeTmp'


Determining if the function rl_filename_completion_function exists failed with the following output:
Change Dir: /home/buildbot/builder/monero-static-ubuntu-amd64/build/build/release/CMakeFiles/CMakeTmp

Run Build Command:"/usr/bin/make" "cmTC_28bc8/fast"
make[1]: Entering directory '/home/buildbot/builder/monero-static-ubuntu-amd64/build/build/release/CMakeFiles/CMakeTmp'
/usr/bin/make -f CMakeFiles/cmTC_28bc8.dir/build.make CMakeFiles/cmTC_28bc8.dir/build
make[2]: Entering directory '/home/buildbot/builder/monero-static-ubuntu-amd64/build/build/release/CMakeFiles/CMakeTmp'
Building C object CMakeFiles/cmTC_28bc8.dir/CheckFunctionExists.c.o
/usr/bin/cc   -pthread -maes -march=x86-64 -fno-strict-aliasing -std=c11 -D_GNU_SOURCE   -Wall -Wextra -Wpointer-arith -Wundef -Wvla -Wwrite-strings -Wno-error=extra -Wno-error=deprecated-declarations -Wno-unused-parameter -Wno-unused-variable -Wno-error=unused-variable -Wno-error=undef -Wno-error=uninitialized -Wlogical-op -Wno-error=maybe-uninitialized -Wno-error=cpp -Waggregate-return -Wnested-externs -Wold-style-definition -Wstrict-prototypes  -fPIC  -Wformat -Wformat-security -fstack-protector -fstack-protector-strong -mmitigate-rop -fno-strict-aliasing -DCHECK_FUNCTION_EXISTS=rl_filename_completion_function   -o CMakeFiles/cmTC_28bc8.dir/CheckFunctionExists.c.o   -c /usr/share/cmake-3.10/Modules/CheckFunctionExists.c
Linking C executable cmTC_28bc8
/usr/bin/cmake -E cmake_link_script CMakeFiles/cmTC_28bc8.dir/link.txt --verbose=1
/usr/bin/cc  -pthread -maes -march=x86-64 -fno-strict-aliasing -std=c11 -D_GNU_SOURCE   -Wall -Wextra -Wpointer-arith -Wundef -Wvla -Wwrite-strings -Wno-error=extra -Wno-error=deprecated-declarations -Wno-unused-parameter -Wno-unused-variable -Wno-error=unused-variable -Wno-error=undef -Wno-error=uninitialized -Wlogical-op -Wno-error=maybe-uninitialized -Wno-error=cpp -Waggregate-return -Wnested-externs -Wold-style-definition -Wstrict-prototypes  -fPIC  -Wformat -Wformat-security -fstack-protector -fstack-protector-strong -mmitigate-rop -fno-strict-aliasing -DCHECK_FUNCTION_EXISTS=rl_filename_completion_function    -rdynamic CMakeFiles/cmTC_28bc8.dir/CheckFunctionExists.c.o  -o cmTC_28bc8 /usr/lib/x86_64-linux-gnu/libreadline.a 
/usr/lib/x86_64-linux-gnu/libreadline.a(display.o): In function `_rl_move_cursor_relative':
(.text+0xf86): undefined reference to `tputs'
(.text+0xfec): undefined reference to `tputs'
(.text+0x11ac): undefined reference to `tputs'
/usr/lib/x86_64-linux-gnu/libreadline.a(display.o): In function `_rl_move_vert':
(.text+0x123d): undefined reference to `tputs'
(.text+0x12a3): undefined reference to `tputs'
/usr/lib/x86_64-linux-gnu/libreadline.a(display.o):(.text+0x2117): more undefined references to `tputs' follow
/usr/lib/x86_64-linux-gnu/libreadline.a(display.o): In function `update_line':
(.text+0x301f): undefined reference to `tgoto'
(.text+0x3033): undefined reference to `tputs'
(.text+0x31cc): undefined reference to `tputs'
(.text+0x32bf): undefined reference to `tputs'
(.text+0x34b8): undefined reference to `tputs'
(.text+0x3513): undefined reference to `tputs'
(.text+0x3546): undefined reference to `tgoto'
(.text+0x3557): undefined reference to `tputs'
/usr/lib/x86_64-linux-gnu/libreadline.a(display.o): In function `rl_redisplay':
(.text+0x4591): undefined reference to `tputs'
(.text+0x50be): undefined reference to `tputs'
/usr/lib/x86_64-linux-gnu/libreadline.a(display.o): In function `rl_clear_visible_line':
(.text+0x5265): undefined reference to `tputs'
/usr/lib/x86_64-linux-gnu/libreadline.a(display.o): In function `_rl_redisplay_after_sigwinch':
(.text+0x53f1): undefined reference to `tputs'
/usr/lib/x86_64-linux-gnu/libreadline.a(display.o):(.text+0x5414): more undefined references to `tputs' follow
/usr/lib/x86_64-linux-gnu/libreadline.a(terminal.o): In function `_rl_get_screen_size':
(.text+0x186): undefined reference to `tgetnum'
(.text+0x2be): undefined reference to `tgetnum'
/usr/lib/x86_64-linux-gnu/libreadline.a(terminal.o): In function `_rl_init_terminal_io':
(.text+0x678): undefined reference to `PC'
(.text+0x687): undefined reference to `BC'
(.text+0x68e): undefined reference to `UP'
(.text+0x728): undefined reference to `tgetent'
(.text+0x76f): undefined reference to `tgetstr'
(.text+0x799): undefined reference to `PC'
(.text+0x7af): undefined reference to `BC'
(.text+0x7bd): undefined reference to `UP'
(.text+0x7cf): undefined reference to `tgetflag'
(.text+0x81e): undefined reference to `tgetflag'
(.text+0x938): undefined reference to `tgetflag'
/usr/lib/x86_64-linux-gnu/libreadline.a(terminal.o): In function `_rl_backspace':
(.text+0xb4b): undefined reference to `tputs'
/usr/lib/x86_64-linux-gnu/libreadline.a(terminal.o): In function `rl_ding':
(.text+0xc1d): undefined reference to `tputs'
/usr/lib/x86_64-linux-gnu/libreadline.a(terminal.o): In function `_rl_enable_meta_key':
(.text+0xc67): undefined reference to `tputs'
/usr/lib/x86_64-linux-gnu/libreadline.a(terminal.o): In function `_rl_disable_meta_key':
(.text+0xcc9): undefined reference to `tputs'
/usr/lib/x86_64-linux-gnu/libreadline.a(terminal.o): In function `_rl_control_keypad':
(.text+0xcfd): undefined reference to `tputs'
/usr/lib/x86_64-linux-gnu/libreadline.a(terminal.o):(.text+0xd50): more undefined references to `tputs' follow
collect2: error: ld returned 1 exit status
CMakeFiles/cmTC_28bc8.dir/build.make:98: recipe for target 'cmTC_28bc8' failed
make[2]: *** [cmTC_28bc8] Error 1
make[2]: Leaving directory '/home/buildbot/builder/monero-static-ubuntu-amd64/build/build/release/CMakeFiles/CMakeTmp'
Makefile:126: recipe for target 'cmTC_28bc8/fast' failed
make[1]: *** [cmTC_28bc8/fast] Error 2
make[1]: Leaving directory '/home/buildbot/builder/monero-static-ubuntu-amd64/build/build/release/CMakeFiles/CMakeTmp'