(view as text)
Determining if the pthread_create exist failed with the following output:
Change Dir: /home/buildbot/builder/monero-static-ubuntu-amd64/build/build/release/CMakeFiles/CMakeTmp

Run Build Command:"/usr/bin/make" "cmTC_01cde/fast"
make[1]: Entering directory '/home/buildbot/builder/monero-static-ubuntu-amd64/build/build/release/CMakeFiles/CMakeTmp'
/usr/bin/make -f CMakeFiles/cmTC_01cde.dir/build.make CMakeFiles/cmTC_01cde.dir/build
make[2]: Entering directory '/home/buildbot/builder/monero-static-ubuntu-amd64/build/build/release/CMakeFiles/CMakeTmp'
Building C object CMakeFiles/cmTC_01cde.dir/CheckSymbolExists.c.o
/usr/bin/cc    -o CMakeFiles/cmTC_01cde.dir/CheckSymbolExists.c.o   -c /home/buildbot/builder/monero-static-ubuntu-amd64/build/build/release/CMakeFiles/CMakeTmp/CheckSymbolExists.c
Linking C executable cmTC_01cde
/usr/bin/cmake -E cmake_link_script CMakeFiles/cmTC_01cde.dir/link.txt --verbose=1
/usr/bin/cc      -rdynamic CMakeFiles/cmTC_01cde.dir/CheckSymbolExists.c.o  -o cmTC_01cde 
CMakeFiles/cmTC_01cde.dir/CheckSymbolExists.c.o: In function `main':
CheckSymbolExists.c:(.text+0x1b): undefined reference to `pthread_create'
collect2: error: ld returned 1 exit status
CMakeFiles/cmTC_01cde.dir/build.make:97: recipe for target 'cmTC_01cde' failed
make[2]: *** [cmTC_01cde] Error 1
make[2]: Leaving directory '/home/buildbot/builder/monero-static-ubuntu-amd64/build/build/release/CMakeFiles/CMakeTmp'
Makefile:126: recipe for target 'cmTC_01cde/fast' failed
make[1]: *** [cmTC_01cde/fast] Error 2
make[1]: Leaving directory '/home/buildbot/builder/monero-static-ubuntu-amd64/build/build/release/CMakeFiles/CMakeTmp'

File /home/buildbot/builder/monero-static-ubuntu-amd64/build/build/release/CMakeFiles/CMakeTmp/CheckSymbolExists.c:
/* */
#include <pthread.h>

int main(int argc, char** argv)
{
  (void)argv;
#ifndef pthread_create
  return ((int*)(&pthread_create))[argc];
#else
  (void)argc;
  return 0;
#endif
}

Determining if the function memset_s exists in the c failed with the following output:
Change Dir: /home/buildbot/builder/monero-static-ubuntu-amd64/build/build/release/CMakeFiles/CMakeTmp

Run Build Command:"/usr/bin/make" "cmTC_d323c/fast"
make[1]: Entering directory '/home/buildbot/builder/monero-static-ubuntu-amd64/build/build/release/CMakeFiles/CMakeTmp'
/usr/bin/make -f CMakeFiles/cmTC_d323c.dir/build.make CMakeFiles/cmTC_d323c.dir/build
make[2]: Entering directory '/home/buildbot/builder/monero-static-ubuntu-amd64/build/build/release/CMakeFiles/CMakeTmp'
Building C object CMakeFiles/cmTC_d323c.dir/CheckFunctionExists.c.o
/usr/bin/cc   -pthread -DCHECK_FUNCTION_EXISTS=memset_s   -o CMakeFiles/cmTC_d323c.dir/CheckFunctionExists.c.o   -c /usr/share/cmake-3.10/Modules/CheckFunctionExists.c
Linking C executable cmTC_d323c
/usr/bin/cmake -E cmake_link_script CMakeFiles/cmTC_d323c.dir/link.txt --verbose=1
/usr/bin/cc  -pthread -DCHECK_FUNCTION_EXISTS=memset_s    -rdynamic CMakeFiles/cmTC_d323c.dir/CheckFunctionExists.c.o  -o cmTC_d323c  -L/home/buildbot/builder/monero-static-ubuntu-amd64/build/build/release/CMakeFiles/CMakeTmp/string.h -Wl,-rpath,/home/buildbot/builder/monero-static-ubuntu-amd64/build/build/release/CMakeFiles/CMakeTmp/string.h -lc 
CMakeFiles/cmTC_d323c.dir/CheckFunctionExists.c.o: In function `main':
CheckFunctionExists.c:(.text+0x10): undefined reference to `memset_s'
collect2: error: ld returned 1 exit status
CMakeFiles/cmTC_d323c.dir/build.make:97: recipe for target 'cmTC_d323c' failed
make[2]: *** [cmTC_d323c] Error 1
make[2]: Leaving directory '/home/buildbot/builder/monero-static-ubuntu-amd64/build/build/release/CMakeFiles/CMakeTmp'
Makefile:126: recipe for target 'cmTC_d323c/fast' failed
make[1]: *** [cmTC_d323c/fast] Error 2
make[1]: Leaving directory '/home/buildbot/builder/monero-static-ubuntu-amd64/build/build/release/CMakeFiles/CMakeTmp'


Determining if the include file event.h exists failed with the following output:
Change Dir: /home/buildbot/builder/monero-static-ubuntu-amd64/build/build/release/CMakeFiles/CMakeTmp

Run Build Command:"/usr/bin/make" "cmTC_c68a8/fast"
make[1]: Entering directory '/home/buildbot/builder/monero-static-ubuntu-amd64/build/build/release/CMakeFiles/CMakeTmp'
/usr/bin/make -f CMakeFiles/cmTC_c68a8.dir/build.make CMakeFiles/cmTC_c68a8.dir/build
make[2]: Entering directory '/home/buildbot/builder/monero-static-ubuntu-amd64/build/build/release/CMakeFiles/CMakeTmp'
Building C object CMakeFiles/cmTC_c68a8.dir/CheckIncludeFile.c.o
/usr/bin/cc   -pthread    -o CMakeFiles/cmTC_c68a8.dir/CheckIncludeFile.c.o   -c /home/buildbot/builder/monero-static-ubuntu-amd64/build/build/release/CMakeFiles/CMakeTmp/CheckIncludeFile.c
/home/buildbot/builder/monero-static-ubuntu-amd64/build/build/release/CMakeFiles/CMakeTmp/CheckIncludeFile.c:1:10: fatal error: event.h: No such file or directory
 #include <event.h>
          ^~~~~~~~~
compilation terminated.
CMakeFiles/cmTC_c68a8.dir/build.make:65: recipe for target 'CMakeFiles/cmTC_c68a8.dir/CheckIncludeFile.c.o' failed
make[2]: *** [CMakeFiles/cmTC_c68a8.dir/CheckIncludeFile.c.o] Error 1
make[2]: Leaving directory '/home/buildbot/builder/monero-static-ubuntu-amd64/build/build/release/CMakeFiles/CMakeTmp'
Makefile:126: recipe for target 'cmTC_c68a8/fast' failed
make[1]: *** [cmTC_c68a8/fast] Error 2
make[1]: Leaving directory '/home/buildbot/builder/monero-static-ubuntu-amd64/build/build/release/CMakeFiles/CMakeTmp'


Determining if the include file iphlpapi.h exists failed with the following output:
Change Dir: /home/buildbot/builder/monero-static-ubuntu-amd64/build/build/release/CMakeFiles/CMakeTmp

Run Build Command:"/usr/bin/make" "cmTC_fa032/fast"
make[1]: Entering directory '/home/buildbot/builder/monero-static-ubuntu-amd64/build/build/release/CMakeFiles/CMakeTmp'
/usr/bin/make -f CMakeFiles/cmTC_fa032.dir/build.make CMakeFiles/cmTC_fa032.dir/build
make[2]: Entering directory '/home/buildbot/builder/monero-static-ubuntu-amd64/build/build/release/CMakeFiles/CMakeTmp'
Building C object CMakeFiles/cmTC_fa032.dir/CheckIncludeFile.c.o
/usr/bin/cc   -pthread    -o CMakeFiles/cmTC_fa032.dir/CheckIncludeFile.c.o   -c /home/buildbot/builder/monero-static-ubuntu-amd64/build/build/release/CMakeFiles/CMakeTmp/CheckIncludeFile.c
/home/buildbot/builder/monero-static-ubuntu-amd64/build/build/release/CMakeFiles/CMakeTmp/CheckIncludeFile.c:1:10: fatal error: iphlpapi.h: No such file or directory
 #include <iphlpapi.h>
          ^~~~~~~~~~~~
compilation terminated.
CMakeFiles/cmTC_fa032.dir/build.make:65: recipe for target 'CMakeFiles/cmTC_fa032.dir/CheckIncludeFile.c.o' failed
make[2]: *** [CMakeFiles/cmTC_fa032.dir/CheckIncludeFile.c.o] Error 1
make[2]: Leaving directory '/home/buildbot/builder/monero-static-ubuntu-amd64/build/build/release/CMakeFiles/CMakeTmp'
Makefile:126: recipe for target 'cmTC_fa032/fast' failed
make[1]: *** [cmTC_fa032/fast] Error 2
make[1]: Leaving directory '/home/buildbot/builder/monero-static-ubuntu-amd64/build/build/release/CMakeFiles/CMakeTmp'


Determining if the include file login_cap.h exists failed with the following output:
Change Dir: /home/buildbot/builder/monero-static-ubuntu-amd64/build/build/release/CMakeFiles/CMakeTmp

Run Build Command:"/usr/bin/make" "cmTC_6f279/fast"
make[1]: Entering directory '/home/buildbot/builder/monero-static-ubuntu-amd64/build/build/release/CMakeFiles/CMakeTmp'
/usr/bin/make -f CMakeFiles/cmTC_6f279.dir/build.make CMakeFiles/cmTC_6f279.dir/build
make[2]: Entering directory '/home/buildbot/builder/monero-static-ubuntu-amd64/build/build/release/CMakeFiles/CMakeTmp'
Building C object CMakeFiles/cmTC_6f279.dir/CheckIncludeFile.c.o
/usr/bin/cc   -pthread    -o CMakeFiles/cmTC_6f279.dir/CheckIncludeFile.c.o   -c /home/buildbot/builder/monero-static-ubuntu-amd64/build/build/release/CMakeFiles/CMakeTmp/CheckIncludeFile.c
/home/buildbot/builder/monero-static-ubuntu-amd64/build/build/release/CMakeFiles/CMakeTmp/CheckIncludeFile.c:1:10: fatal error: login_cap.h: No such file or directory
 #include <login_cap.h>
          ^~~~~~~~~~~~~
compilation terminated.
CMakeFiles/cmTC_6f279.dir/build.make:65: recipe for target 'CMakeFiles/cmTC_6f279.dir/CheckIncludeFile.c.o' failed
make[2]: *** [CMakeFiles/cmTC_6f279.dir/CheckIncludeFile.c.o] Error 1
make[2]: Leaving directory '/home/buildbot/builder/monero-static-ubuntu-amd64/build/build/release/CMakeFiles/CMakeTmp'
Makefile:126: recipe for target 'cmTC_6f279/fast' failed
make[1]: *** [cmTC_6f279/fast] Error 2
make[1]: Leaving directory '/home/buildbot/builder/monero-static-ubuntu-amd64/build/build/release/CMakeFiles/CMakeTmp'


Determining if the include file sys/sha2.h exists failed with the following output:
Change Dir: /home/buildbot/builder/monero-static-ubuntu-amd64/build/build/release/CMakeFiles/CMakeTmp

Run Build Command:"/usr/bin/make" "cmTC_a6b54/fast"
make[1]: Entering directory '/home/buildbot/builder/monero-static-ubuntu-amd64/build/build/release/CMakeFiles/CMakeTmp'
/usr/bin/make -f CMakeFiles/cmTC_a6b54.dir/build.make CMakeFiles/cmTC_a6b54.dir/build
make[2]: Entering directory '/home/buildbot/builder/monero-static-ubuntu-amd64/build/build/release/CMakeFiles/CMakeTmp'
Building C object CMakeFiles/cmTC_a6b54.dir/CheckIncludeFile.c.o
/usr/bin/cc   -pthread    -o CMakeFiles/cmTC_a6b54.dir/CheckIncludeFile.c.o   -c /home/buildbot/builder/monero-static-ubuntu-amd64/build/build/release/CMakeFiles/CMakeTmp/CheckIncludeFile.c
/home/buildbot/builder/monero-static-ubuntu-amd64/build/build/release/CMakeFiles/CMakeTmp/CheckIncludeFile.c:1:10: fatal error: sys/sha2.h: No such file or directory
 #include <sys/sha2.h>
          ^~~~~~~~~~~~
compilation terminated.
CMakeFiles/cmTC_a6b54.dir/build.make:65: recipe for target 'CMakeFiles/cmTC_a6b54.dir/CheckIncludeFile.c.o' failed
make[2]: *** [CMakeFiles/cmTC_a6b54.dir/CheckIncludeFile.c.o] Error 1
make[2]: Leaving directory '/home/buildbot/builder/monero-static-ubuntu-amd64/build/build/release/CMakeFiles/CMakeTmp'
Makefile:126: recipe for target 'cmTC_a6b54/fast' failed
make[1]: *** [cmTC_a6b54/fast] Error 2
make[1]: Leaving directory '/home/buildbot/builder/monero-static-ubuntu-amd64/build/build/release/CMakeFiles/CMakeTmp'


Determining if the include file vfork.h exists failed with the following output:
Change Dir: /home/buildbot/builder/monero-static-ubuntu-amd64/build/build/release/CMakeFiles/CMakeTmp

Run Build Command:"/usr/bin/make" "cmTC_c3228/fast"
make[1]: Entering directory '/home/buildbot/builder/monero-static-ubuntu-amd64/build/build/release/CMakeFiles/CMakeTmp'
/usr/bin/make -f CMakeFiles/cmTC_c3228.dir/build.make CMakeFiles/cmTC_c3228.dir/build
make[2]: Entering directory '/home/buildbot/builder/monero-static-ubuntu-amd64/build/build/release/CMakeFiles/CMakeTmp'
Building C object CMakeFiles/cmTC_c3228.dir/CheckIncludeFile.c.o
/usr/bin/cc   -pthread    -o CMakeFiles/cmTC_c3228.dir/CheckIncludeFile.c.o   -c /home/buildbot/builder/monero-static-ubuntu-amd64/build/build/release/CMakeFiles/CMakeTmp/CheckIncludeFile.c
/home/buildbot/builder/monero-static-ubuntu-amd64/build/build/release/CMakeFiles/CMakeTmp/CheckIncludeFile.c:1:10: fatal error: vfork.h: No such file or directory
 #include <vfork.h>
          ^~~~~~~~~
compilation terminated.
CMakeFiles/cmTC_c3228.dir/build.make:65: recipe for target 'CMakeFiles/cmTC_c3228.dir/CheckIncludeFile.c.o' failed
make[2]: *** [CMakeFiles/cmTC_c3228.dir/CheckIncludeFile.c.o] Error 1
make[2]: Leaving directory '/home/buildbot/builder/monero-static-ubuntu-amd64/build/build/release/CMakeFiles/CMakeTmp'
Makefile:126: recipe for target 'cmTC_c3228/fast' failed
make[1]: *** [cmTC_c3228/fast] Error 2
make[1]: Leaving directory '/home/buildbot/builder/monero-static-ubuntu-amd64/build/build/release/CMakeFiles/CMakeTmp'


Determining if the include file windows.h exists failed with the following output:
Change Dir: /home/buildbot/builder/monero-static-ubuntu-amd64/build/build/release/CMakeFiles/CMakeTmp

Run Build Command:"/usr/bin/make" "cmTC_83e40/fast"
make[1]: Entering directory '/home/buildbot/builder/monero-static-ubuntu-amd64/build/build/release/CMakeFiles/CMakeTmp'
/usr/bin/make -f CMakeFiles/cmTC_83e40.dir/build.make CMakeFiles/cmTC_83e40.dir/build
make[2]: Entering directory '/home/buildbot/builder/monero-static-ubuntu-amd64/build/build/release/CMakeFiles/CMakeTmp'
Building C object CMakeFiles/cmTC_83e40.dir/CheckIncludeFile.c.o
/usr/bin/cc   -pthread    -o CMakeFiles/cmTC_83e40.dir/CheckIncludeFile.c.o   -c /home/buildbot/builder/monero-static-ubuntu-amd64/build/build/release/CMakeFiles/CMakeTmp/CheckIncludeFile.c
/home/buildbot/builder/monero-static-ubuntu-amd64/build/build/release/CMakeFiles/CMakeTmp/CheckIncludeFile.c:1:10: fatal error: windows.h: No such file or directory
 #include <windows.h>
          ^~~~~~~~~~~
compilation terminated.
CMakeFiles/cmTC_83e40.dir/build.make:65: recipe for target 'CMakeFiles/cmTC_83e40.dir/CheckIncludeFile.c.o' failed
make[2]: *** [CMakeFiles/cmTC_83e40.dir/CheckIncludeFile.c.o] Error 1
make[2]: Leaving directory '/home/buildbot/builder/monero-static-ubuntu-amd64/build/build/release/CMakeFiles/CMakeTmp'
Makefile:126: recipe for target 'cmTC_83e40/fast' failed
make[1]: *** [cmTC_83e40/fast] Error 2
make[1]: Leaving directory '/home/buildbot/builder/monero-static-ubuntu-amd64/build/build/release/CMakeFiles/CMakeTmp'


Determining if the include file winsock2.h exists failed with the following output:
Change Dir: /home/buildbot/builder/monero-static-ubuntu-amd64/build/build/release/CMakeFiles/CMakeTmp

Run Build Command:"/usr/bin/make" "cmTC_95761/fast"
make[1]: Entering directory '/home/buildbot/builder/monero-static-ubuntu-amd64/build/build/release/CMakeFiles/CMakeTmp'
/usr/bin/make -f CMakeFiles/cmTC_95761.dir/build.make CMakeFiles/cmTC_95761.dir/build
make[2]: Entering directory '/home/buildbot/builder/monero-static-ubuntu-amd64/build/build/release/CMakeFiles/CMakeTmp'
Building C object CMakeFiles/cmTC_95761.dir/CheckIncludeFile.c.o
/usr/bin/cc   -pthread    -o CMakeFiles/cmTC_95761.dir/CheckIncludeFile.c.o   -c /home/buildbot/builder/monero-static-ubuntu-amd64/build/build/release/CMakeFiles/CMakeTmp/CheckIncludeFile.c
/home/buildbot/builder/monero-static-ubuntu-amd64/build/build/release/CMakeFiles/CMakeTmp/CheckIncludeFile.c:1:10: fatal error: winsock2.h: No such file or directory
 #include <winsock2.h>
          ^~~~~~~~~~~~
compilation terminated.
CMakeFiles/cmTC_95761.dir/build.make:65: recipe for target 'CMakeFiles/cmTC_95761.dir/CheckIncludeFile.c.o' failed
make[2]: *** [CMakeFiles/cmTC_95761.dir/CheckIncludeFile.c.o] Error 1
make[2]: Leaving directory '/home/buildbot/builder/monero-static-ubuntu-amd64/build/build/release/CMakeFiles/CMakeTmp'
Makefile:126: recipe for target 'cmTC_95761/fast' failed
make[1]: *** [cmTC_95761/fast] Error 2
make[1]: Leaving directory '/home/buildbot/builder/monero-static-ubuntu-amd64/build/build/release/CMakeFiles/CMakeTmp'


Determining if the include file ws2tcpip.h exists failed with the following output:
Change Dir: /home/buildbot/builder/monero-static-ubuntu-amd64/build/build/release/CMakeFiles/CMakeTmp

Run Build Command:"/usr/bin/make" "cmTC_4a238/fast"
make[1]: Entering directory '/home/buildbot/builder/monero-static-ubuntu-amd64/build/build/release/CMakeFiles/CMakeTmp'
/usr/bin/make -f CMakeFiles/cmTC_4a238.dir/build.make CMakeFiles/cmTC_4a238.dir/build
make[2]: Entering directory '/home/buildbot/builder/monero-static-ubuntu-amd64/build/build/release/CMakeFiles/CMakeTmp'
Building C object CMakeFiles/cmTC_4a238.dir/CheckIncludeFile.c.o
/usr/bin/cc   -pthread    -o CMakeFiles/cmTC_4a238.dir/CheckIncludeFile.c.o   -c /home/buildbot/builder/monero-static-ubuntu-amd64/build/build/release/CMakeFiles/CMakeTmp/CheckIncludeFile.c
/home/buildbot/builder/monero-static-ubuntu-amd64/build/build/release/CMakeFiles/CMakeTmp/CheckIncludeFile.c:1:10: fatal error: ws2tcpip.h: No such file or directory
 #include <ws2tcpip.h>
          ^~~~~~~~~~~~
compilation terminated.
CMakeFiles/cmTC_4a238.dir/build.make:65: recipe for target 'CMakeFiles/cmTC_4a238.dir/CheckIncludeFile.c.o' failed
make[2]: *** [CMakeFiles/cmTC_4a238.dir/CheckIncludeFile.c.o] Error 1
make[2]: Leaving directory '/home/buildbot/builder/monero-static-ubuntu-amd64/build/build/release/CMakeFiles/CMakeTmp'
Makefile:126: recipe for target 'cmTC_4a238/fast' failed
make[1]: *** [cmTC_4a238/fast] Error 2
make[1]: Leaving directory '/home/buildbot/builder/monero-static-ubuntu-amd64/build/build/release/CMakeFiles/CMakeTmp'


Determining if the function _beginthreadex exists failed with the following output:
Change Dir: /home/buildbot/builder/monero-static-ubuntu-amd64/build/build/release/CMakeFiles/CMakeTmp

Run Build Command:"/usr/bin/make" "cmTC_16bb6/fast"
make[1]: Entering directory '/home/buildbot/builder/monero-static-ubuntu-amd64/build/build/release/CMakeFiles/CMakeTmp'
/usr/bin/make -f CMakeFiles/cmTC_16bb6.dir/build.make CMakeFiles/cmTC_16bb6.dir/build
make[2]: Entering directory '/home/buildbot/builder/monero-static-ubuntu-amd64/build/build/release/CMakeFiles/CMakeTmp'
Building C object CMakeFiles/cmTC_16bb6.dir/CheckFunctionExists.c.o
/usr/bin/cc   -pthread -DCHECK_FUNCTION_EXISTS=_beginthreadex   -o CMakeFiles/cmTC_16bb6.dir/CheckFunctionExists.c.o   -c /usr/share/cmake-3.10/Modules/CheckFunctionExists.c
Linking C executable cmTC_16bb6
/usr/bin/cmake -E cmake_link_script CMakeFiles/cmTC_16bb6.dir/link.txt --verbose=1
/usr/bin/cc  -pthread -DCHECK_FUNCTION_EXISTS=_beginthreadex    -rdynamic CMakeFiles/cmTC_16bb6.dir/CheckFunctionExists.c.o  -o cmTC_16bb6 
CMakeFiles/cmTC_16bb6.dir/CheckFunctionExists.c.o: In function `main':
CheckFunctionExists.c:(.text+0x10): undefined reference to `_beginthreadex'
collect2: error: ld returned 1 exit status
CMakeFiles/cmTC_16bb6.dir/build.make:97: recipe for target 'cmTC_16bb6' failed
make[2]: *** [cmTC_16bb6] Error 1
make[2]: Leaving directory '/home/buildbot/builder/monero-static-ubuntu-amd64/build/build/release/CMakeFiles/CMakeTmp'
Makefile:126: recipe for target 'cmTC_16bb6/fast' failed
make[1]: *** [cmTC_16bb6/fast] Error 2
make[1]: Leaving directory '/home/buildbot/builder/monero-static-ubuntu-amd64/build/build/release/CMakeFiles/CMakeTmp'


Determining if the function arc4random exists failed with the following output:
Change Dir: /home/buildbot/builder/monero-static-ubuntu-amd64/build/build/release/CMakeFiles/CMakeTmp

Run Build Command:"/usr/bin/make" "cmTC_7f1f0/fast"
make[1]: Entering directory '/home/buildbot/builder/monero-static-ubuntu-amd64/build/build/release/CMakeFiles/CMakeTmp'
/usr/bin/make -f CMakeFiles/cmTC_7f1f0.dir/build.make CMakeFiles/cmTC_7f1f0.dir/build
make[2]: Entering directory '/home/buildbot/builder/monero-static-ubuntu-amd64/build/build/release/CMakeFiles/CMakeTmp'
Building C object CMakeFiles/cmTC_7f1f0.dir/CheckFunctionExists.c.o
/usr/bin/cc   -pthread -DCHECK_FUNCTION_EXISTS=arc4random   -o CMakeFiles/cmTC_7f1f0.dir/CheckFunctionExists.c.o   -c /usr/share/cmake-3.10/Modules/CheckFunctionExists.c
Linking C executable cmTC_7f1f0
/usr/bin/cmake -E cmake_link_script CMakeFiles/cmTC_7f1f0.dir/link.txt --verbose=1
/usr/bin/cc  -pthread -DCHECK_FUNCTION_EXISTS=arc4random    -rdynamic CMakeFiles/cmTC_7f1f0.dir/CheckFunctionExists.c.o  -o cmTC_7f1f0 
CMakeFiles/cmTC_7f1f0.dir/CheckFunctionExists.c.o: In function `main':
CheckFunctionExists.c:(.text+0x10): undefined reference to `arc4random'
collect2: error: ld returned 1 exit status
CMakeFiles/cmTC_7f1f0.dir/build.make:97: recipe for target 'cmTC_7f1f0' failed
make[2]: *** [cmTC_7f1f0] Error 1
make[2]: Leaving directory '/home/buildbot/builder/monero-static-ubuntu-amd64/build/build/release/CMakeFiles/CMakeTmp'
Makefile:126: recipe for target 'cmTC_7f1f0/fast' failed
make[1]: *** [cmTC_7f1f0/fast] Error 2
make[1]: Leaving directory '/home/buildbot/builder/monero-static-ubuntu-amd64/build/build/release/CMakeFiles/CMakeTmp'


Determining if the function arc4random_uniform exists failed with the following output:
Change Dir: /home/buildbot/builder/monero-static-ubuntu-amd64/build/build/release/CMakeFiles/CMakeTmp

Run Build Command:"/usr/bin/make" "cmTC_2d1cf/fast"
make[1]: Entering directory '/home/buildbot/builder/monero-static-ubuntu-amd64/build/build/release/CMakeFiles/CMakeTmp'
/usr/bin/make -f CMakeFiles/cmTC_2d1cf.dir/build.make CMakeFiles/cmTC_2d1cf.dir/build
make[2]: Entering directory '/home/buildbot/builder/monero-static-ubuntu-amd64/build/build/release/CMakeFiles/CMakeTmp'
Building C object CMakeFiles/cmTC_2d1cf.dir/CheckFunctionExists.c.o
/usr/bin/cc   -pthread -DCHECK_FUNCTION_EXISTS=arc4random_uniform   -o CMakeFiles/cmTC_2d1cf.dir/CheckFunctionExists.c.o   -c /usr/share/cmake-3.10/Modules/CheckFunctionExists.c
Linking C executable cmTC_2d1cf
/usr/bin/cmake -E cmake_link_script CMakeFiles/cmTC_2d1cf.dir/link.txt --verbose=1
/usr/bin/cc  -pthread -DCHECK_FUNCTION_EXISTS=arc4random_uniform    -rdynamic CMakeFiles/cmTC_2d1cf.dir/CheckFunctionExists.c.o  -o cmTC_2d1cf 
CMakeFiles/cmTC_2d1cf.dir/CheckFunctionExists.c.o: In function `main':
CheckFunctionExists.c:(.text+0x10): undefined reference to `arc4random_uniform'
collect2: error: ld returned 1 exit status
CMakeFiles/cmTC_2d1cf.dir/build.make:97: recipe for target 'cmTC_2d1cf' failed
make[2]: *** [cmTC_2d1cf] Error 1
make[2]: Leaving directory '/home/buildbot/builder/monero-static-ubuntu-amd64/build/build/release/CMakeFiles/CMakeTmp'
Makefile:126: recipe for target 'cmTC_2d1cf/fast' failed
make[1]: *** [cmTC_2d1cf/fast] Error 2
make[1]: Leaving directory '/home/buildbot/builder/monero-static-ubuntu-amd64/build/build/release/CMakeFiles/CMakeTmp'


Determining if the function ioctlsocket exists failed with the following output:
Change Dir: /home/buildbot/builder/monero-static-ubuntu-amd64/build/build/release/CMakeFiles/CMakeTmp

Run Build Command:"/usr/bin/make" "cmTC_94ecd/fast"
make[1]: Entering directory '/home/buildbot/builder/monero-static-ubuntu-amd64/build/build/release/CMakeFiles/CMakeTmp'
/usr/bin/make -f CMakeFiles/cmTC_94ecd.dir/build.make CMakeFiles/cmTC_94ecd.dir/build
make[2]: Entering directory '/home/buildbot/builder/monero-static-ubuntu-amd64/build/build/release/CMakeFiles/CMakeTmp'
Building C object CMakeFiles/cmTC_94ecd.dir/CheckFunctionExists.c.o
/usr/bin/cc   -pthread -DCHECK_FUNCTION_EXISTS=ioctlsocket   -o CMakeFiles/cmTC_94ecd.dir/CheckFunctionExists.c.o   -c /usr/share/cmake-3.10/Modules/CheckFunctionExists.c
Linking C executable cmTC_94ecd
/usr/bin/cmake -E cmake_link_script CMakeFiles/cmTC_94ecd.dir/link.txt --verbose=1
/usr/bin/cc  -pthread -DCHECK_FUNCTION_EXISTS=ioctlsocket    -rdynamic CMakeFiles/cmTC_94ecd.dir/CheckFunctionExists.c.o  -o cmTC_94ecd 
CMakeFiles/cmTC_94ecd.dir/CheckFunctionExists.c.o: In function `main':
CheckFunctionExists.c:(.text+0x10): undefined reference to `ioctlsocket'
collect2: error: ld returned 1 exit status
CMakeFiles/cmTC_94ecd.dir/build.make:97: recipe for target 'cmTC_94ecd' failed
make[2]: *** [cmTC_94ecd] Error 1
make[2]: Leaving directory '/home/buildbot/builder/monero-static-ubuntu-amd64/build/build/release/CMakeFiles/CMakeTmp'
Makefile:126: recipe for target 'cmTC_94ecd/fast' failed
make[1]: *** [cmTC_94ecd/fast] Error 2
make[1]: Leaving directory '/home/buildbot/builder/monero-static-ubuntu-amd64/build/build/release/CMakeFiles/CMakeTmp'


Determining if the function setusercontent exists failed with the following output:
Change Dir: /home/buildbot/builder/monero-static-ubuntu-amd64/build/build/release/CMakeFiles/CMakeTmp

Run Build Command:"/usr/bin/make" "cmTC_ddfc6/fast"
make[1]: Entering directory '/home/buildbot/builder/monero-static-ubuntu-amd64/build/build/release/CMakeFiles/CMakeTmp'
/usr/bin/make -f CMakeFiles/cmTC_ddfc6.dir/build.make CMakeFiles/cmTC_ddfc6.dir/build
make[2]: Entering directory '/home/buildbot/builder/monero-static-ubuntu-amd64/build/build/release/CMakeFiles/CMakeTmp'
Building C object CMakeFiles/cmTC_ddfc6.dir/CheckFunctionExists.c.o
/usr/bin/cc   -pthread -DCHECK_FUNCTION_EXISTS=setusercontent   -o CMakeFiles/cmTC_ddfc6.dir/CheckFunctionExists.c.o   -c /usr/share/cmake-3.10/Modules/CheckFunctionExists.c
Linking C executable cmTC_ddfc6
/usr/bin/cmake -E cmake_link_script CMakeFiles/cmTC_ddfc6.dir/link.txt --verbose=1
/usr/bin/cc  -pthread -DCHECK_FUNCTION_EXISTS=setusercontent    -rdynamic CMakeFiles/cmTC_ddfc6.dir/CheckFunctionExists.c.o  -o cmTC_ddfc6 
CMakeFiles/cmTC_ddfc6.dir/CheckFunctionExists.c.o: In function `main':
CheckFunctionExists.c:(.text+0x10): undefined reference to `setusercontent'
collect2: error: ld returned 1 exit status
CMakeFiles/cmTC_ddfc6.dir/build.make:97: recipe for target 'cmTC_ddfc6' failed
make[2]: *** [cmTC_ddfc6] Error 1
make[2]: Leaving directory '/home/buildbot/builder/monero-static-ubuntu-amd64/build/build/release/CMakeFiles/CMakeTmp'
Makefile:126: recipe for target 'cmTC_ddfc6/fast' failed
make[1]: *** [cmTC_ddfc6/fast] Error 2
make[1]: Leaving directory '/home/buildbot/builder/monero-static-ubuntu-amd64/build/build/release/CMakeFiles/CMakeTmp'


Determining if the function strlcat exists failed with the following output:
Change Dir: /home/buildbot/builder/monero-static-ubuntu-amd64/build/build/release/CMakeFiles/CMakeTmp

Run Build Command:"/usr/bin/make" "cmTC_5cb0a/fast"
make[1]: Entering directory '/home/buildbot/builder/monero-static-ubuntu-amd64/build/build/release/CMakeFiles/CMakeTmp'
/usr/bin/make -f CMakeFiles/cmTC_5cb0a.dir/build.make CMakeFiles/cmTC_5cb0a.dir/build
make[2]: Entering directory '/home/buildbot/builder/monero-static-ubuntu-amd64/build/build/release/CMakeFiles/CMakeTmp'
Building C object CMakeFiles/cmTC_5cb0a.dir/CheckFunctionExists.c.o
/usr/bin/cc   -pthread -DCHECK_FUNCTION_EXISTS=strlcat   -o CMakeFiles/cmTC_5cb0a.dir/CheckFunctionExists.c.o   -c /usr/share/cmake-3.10/Modules/CheckFunctionExists.c
Linking C executable cmTC_5cb0a
/usr/bin/cmake -E cmake_link_script CMakeFiles/cmTC_5cb0a.dir/link.txt --verbose=1
/usr/bin/cc  -pthread -DCHECK_FUNCTION_EXISTS=strlcat    -rdynamic CMakeFiles/cmTC_5cb0a.dir/CheckFunctionExists.c.o  -o cmTC_5cb0a 
CMakeFiles/cmTC_5cb0a.dir/CheckFunctionExists.c.o: In function `main':
CheckFunctionExists.c:(.text+0x10): undefined reference to `strlcat'
collect2: error: ld returned 1 exit status
CMakeFiles/cmTC_5cb0a.dir/build.make:97: recipe for target 'cmTC_5cb0a' failed
make[2]: *** [cmTC_5cb0a] Error 1
make[2]: Leaving directory '/home/buildbot/builder/monero-static-ubuntu-amd64/build/build/release/CMakeFiles/CMakeTmp'
Makefile:126: recipe for target 'cmTC_5cb0a/fast' failed
make[1]: *** [cmTC_5cb0a/fast] Error 2
make[1]: Leaving directory '/home/buildbot/builder/monero-static-ubuntu-amd64/build/build/release/CMakeFiles/CMakeTmp'


Determining if the function strlcpy exists failed with the following output:
Change Dir: /home/buildbot/builder/monero-static-ubuntu-amd64/build/build/release/CMakeFiles/CMakeTmp

Run Build Command:"/usr/bin/make" "cmTC_98b71/fast"
make[1]: Entering directory '/home/buildbot/builder/monero-static-ubuntu-amd64/build/build/release/CMakeFiles/CMakeTmp'
/usr/bin/make -f CMakeFiles/cmTC_98b71.dir/build.make CMakeFiles/cmTC_98b71.dir/build
make[2]: Entering directory '/home/buildbot/builder/monero-static-ubuntu-amd64/build/build/release/CMakeFiles/CMakeTmp'
Building C object CMakeFiles/cmTC_98b71.dir/CheckFunctionExists.c.o
/usr/bin/cc   -pthread -DCHECK_FUNCTION_EXISTS=strlcpy   -o CMakeFiles/cmTC_98b71.dir/CheckFunctionExists.c.o   -c /usr/share/cmake-3.10/Modules/CheckFunctionExists.c
Linking C executable cmTC_98b71
/usr/bin/cmake -E cmake_link_script CMakeFiles/cmTC_98b71.dir/link.txt --verbose=1
/usr/bin/cc  -pthread -DCHECK_FUNCTION_EXISTS=strlcpy    -rdynamic CMakeFiles/cmTC_98b71.dir/CheckFunctionExists.c.o  -o cmTC_98b71 
CMakeFiles/cmTC_98b71.dir/CheckFunctionExists.c.o: In function `main':
CheckFunctionExists.c:(.text+0x10): undefined reference to `strlcpy'
collect2: error: ld returned 1 exit status
CMakeFiles/cmTC_98b71.dir/build.make:97: recipe for target 'cmTC_98b71' failed
make[2]: *** [cmTC_98b71] Error 1
make[2]: Leaving directory '/home/buildbot/builder/monero-static-ubuntu-amd64/build/build/release/CMakeFiles/CMakeTmp'
Makefile:126: recipe for target 'cmTC_98b71/fast' failed
make[1]: *** [cmTC_98b71/fast] Error 2
make[1]: Leaving directory '/home/buildbot/builder/monero-static-ubuntu-amd64/build/build/release/CMakeFiles/CMakeTmp'


Determining if the PTHREAD_PRIO_INHERIT exist failed with the following output:
Change Dir: /home/buildbot/builder/monero-static-ubuntu-amd64/build/build/release/CMakeFiles/CMakeTmp

Run Build Command:"/usr/bin/make" "cmTC_18499/fast"
make[1]: Entering directory '/home/buildbot/builder/monero-static-ubuntu-amd64/build/build/release/CMakeFiles/CMakeTmp'
/usr/bin/make -f CMakeFiles/cmTC_18499.dir/build.make CMakeFiles/cmTC_18499.dir/build
make[2]: Entering directory '/home/buildbot/builder/monero-static-ubuntu-amd64/build/build/release/CMakeFiles/CMakeTmp'
Building C object CMakeFiles/cmTC_18499.dir/CheckSymbolExists.c.o
/usr/bin/cc   -pthread    -o CMakeFiles/cmTC_18499.dir/CheckSymbolExists.c.o   -c /home/buildbot/builder/monero-static-ubuntu-amd64/build/build/release/CMakeFiles/CMakeTmp/CheckSymbolExists.c
/home/buildbot/builder/monero-static-ubuntu-amd64/build/build/release/CMakeFiles/CMakeTmp/CheckSymbolExists.c: In function 'main':
/home/buildbot/builder/monero-static-ubuntu-amd64/build/build/release/CMakeFiles/CMakeTmp/CheckSymbolExists.c:8:18: error: lvalue required as unary '&' operand
   return ((int*)(&PTHREAD_PRIO_INHERIT))[argc];
                  ^
CMakeFiles/cmTC_18499.dir/build.make:65: recipe for target 'CMakeFiles/cmTC_18499.dir/CheckSymbolExists.c.o' failed
make[2]: *** [CMakeFiles/cmTC_18499.dir/CheckSymbolExists.c.o] Error 1
make[2]: Leaving directory '/home/buildbot/builder/monero-static-ubuntu-amd64/build/build/release/CMakeFiles/CMakeTmp'
Makefile:126: recipe for target 'cmTC_18499/fast' failed
make[1]: *** [cmTC_18499/fast] Error 2
make[1]: Leaving directory '/home/buildbot/builder/monero-static-ubuntu-amd64/build/build/release/CMakeFiles/CMakeTmp'

File /home/buildbot/builder/monero-static-ubuntu-amd64/build/build/release/CMakeFiles/CMakeTmp/CheckSymbolExists.c:
/* */
#include <pthread.h>

int main(int argc, char** argv)
{
  (void)argv;
#ifndef PTHREAD_PRIO_INHERIT
  return ((int*)(&PTHREAD_PRIO_INHERIT))[argc];
#else
  (void)argc;
  return 0;
#endif
}

Determining if the pthread_rwlock_t exist failed with the following output:
Change Dir: /home/buildbot/builder/monero-static-ubuntu-amd64/build/build/release/CMakeFiles/CMakeTmp

Run Build Command:"/usr/bin/make" "cmTC_42507/fast"
make[1]: Entering directory '/home/buildbot/builder/monero-static-ubuntu-amd64/build/build/release/CMakeFiles/CMakeTmp'
/usr/bin/make -f CMakeFiles/cmTC_42507.dir/build.make CMakeFiles/cmTC_42507.dir/build
make[2]: Entering directory '/home/buildbot/builder/monero-static-ubuntu-amd64/build/build/release/CMakeFiles/CMakeTmp'
Building C object CMakeFiles/cmTC_42507.dir/CheckSymbolExists.c.o
/usr/bin/cc   -pthread    -o CMakeFiles/cmTC_42507.dir/CheckSymbolExists.c.o   -c /home/buildbot/builder/monero-static-ubuntu-amd64/build/build/release/CMakeFiles/CMakeTmp/CheckSymbolExists.c
/home/buildbot/builder/monero-static-ubuntu-amd64/build/build/release/CMakeFiles/CMakeTmp/CheckSymbolExists.c: In function 'main':
/home/buildbot/builder/monero-static-ubuntu-amd64/build/build/release/CMakeFiles/CMakeTmp/CheckSymbolExists.c:8:19: error: expected expression before 'pthread_rwlock_t'
   return ((int*)(&pthread_rwlock_t))[argc];
                   ^~~~~~~~~~~~~~~~
CMakeFiles/cmTC_42507.dir/build.make:65: recipe for target 'CMakeFiles/cmTC_42507.dir/CheckSymbolExists.c.o' failed
make[2]: *** [CMakeFiles/cmTC_42507.dir/CheckSymbolExists.c.o] Error 1
make[2]: Leaving directory '/home/buildbot/builder/monero-static-ubuntu-amd64/build/build/release/CMakeFiles/CMakeTmp'
Makefile:126: recipe for target 'cmTC_42507/fast' failed
make[1]: *** [cmTC_42507/fast] Error 2
make[1]: Leaving directory '/home/buildbot/builder/monero-static-ubuntu-amd64/build/build/release/CMakeFiles/CMakeTmp'

File /home/buildbot/builder/monero-static-ubuntu-amd64/build/build/release/CMakeFiles/CMakeTmp/CheckSymbolExists.c:
/* */
#include <pthread.h>

int main(int argc, char** argv)
{
  (void)argv;
#ifndef pthread_rwlock_t
  return ((int*)(&pthread_rwlock_t))[argc];
#else
  (void)argc;
  return 0;
#endif
}

Determining if the pthread_spinlock_t exist failed with the following output:
Change Dir: /home/buildbot/builder/monero-static-ubuntu-amd64/build/build/release/CMakeFiles/CMakeTmp

Run Build Command:"/usr/bin/make" "cmTC_f34f7/fast"
make[1]: Entering directory '/home/buildbot/builder/monero-static-ubuntu-amd64/build/build/release/CMakeFiles/CMakeTmp'
/usr/bin/make -f CMakeFiles/cmTC_f34f7.dir/build.make CMakeFiles/cmTC_f34f7.dir/build
make[2]: Entering directory '/home/buildbot/builder/monero-static-ubuntu-amd64/build/build/release/CMakeFiles/CMakeTmp'
Building C object CMakeFiles/cmTC_f34f7.dir/CheckSymbolExists.c.o
/usr/bin/cc   -pthread    -o CMakeFiles/cmTC_f34f7.dir/CheckSymbolExists.c.o   -c /home/buildbot/builder/monero-static-ubuntu-amd64/build/build/release/CMakeFiles/CMakeTmp/CheckSymbolExists.c
/home/buildbot/builder/monero-static-ubuntu-amd64/build/build/release/CMakeFiles/CMakeTmp/CheckSymbolExists.c: In function 'main':
/home/buildbot/builder/monero-static-ubuntu-amd64/build/build/release/CMakeFiles/CMakeTmp/CheckSymbolExists.c:8:19: error: expected expression before 'pthread_spinlock_t'
   return ((int*)(&pthread_spinlock_t))[argc];
                   ^~~~~~~~~~~~~~~~~~
CMakeFiles/cmTC_f34f7.dir/build.make:65: recipe for target 'CMakeFiles/cmTC_f34f7.dir/CheckSymbolExists.c.o' failed
make[2]: *** [CMakeFiles/cmTC_f34f7.dir/CheckSymbolExists.c.o] Error 1
make[2]: Leaving directory '/home/buildbot/builder/monero-static-ubuntu-amd64/build/build/release/CMakeFiles/CMakeTmp'
Makefile:126: recipe for target 'cmTC_f34f7/fast' failed
make[1]: *** [cmTC_f34f7/fast] Error 2
make[1]: Leaving directory '/home/buildbot/builder/monero-static-ubuntu-amd64/build/build/release/CMakeFiles/CMakeTmp'

File /home/buildbot/builder/monero-static-ubuntu-amd64/build/build/release/CMakeFiles/CMakeTmp/CheckSymbolExists.c:
/* */
#include <pthread.h>

int main(int argc, char** argv)
{
  (void)argv;
#ifndef pthread_spinlock_t
  return ((int*)(&pthread_spinlock_t))[argc];
#else
  (void)argc;
  return 0;
#endif
}

Determining if the LIBRESSL_VERSION_TEXT exist failed with the following output:
Change Dir: /home/buildbot/builder/monero-static-ubuntu-amd64/build/build/release/CMakeFiles/CMakeTmp

Run Build Command:"/usr/bin/make" "cmTC_bced3/fast"
make[1]: Entering directory '/home/buildbot/builder/monero-static-ubuntu-amd64/build/build/release/CMakeFiles/CMakeTmp'
/usr/bin/make -f CMakeFiles/cmTC_bced3.dir/build.make CMakeFiles/cmTC_bced3.dir/build
make[2]: Entering directory '/home/buildbot/builder/monero-static-ubuntu-amd64/build/build/release/CMakeFiles/CMakeTmp'
Building C object CMakeFiles/cmTC_bced3.dir/CheckSymbolExists.c.o
/usr/bin/cc   -pthread    -o CMakeFiles/cmTC_bced3.dir/CheckSymbolExists.c.o   -c /home/buildbot/builder/monero-static-ubuntu-amd64/build/build/release/CMakeFiles/CMakeTmp/CheckSymbolExists.c
/home/buildbot/builder/monero-static-ubuntu-amd64/build/build/release/CMakeFiles/CMakeTmp/CheckSymbolExists.c: In function 'main':
/home/buildbot/builder/monero-static-ubuntu-amd64/build/build/release/CMakeFiles/CMakeTmp/CheckSymbolExists.c:8:19: error: 'LIBRESSL_VERSION_TEXT' undeclared (first use in this function); did you mean 'OPENSSL_VERSION_TEXT'?
   return ((int*)(&LIBRESSL_VERSION_TEXT))[argc];
                   ^~~~~~~~~~~~~~~~~~~~~
                   OPENSSL_VERSION_TEXT
/home/buildbot/builder/monero-static-ubuntu-amd64/build/build/release/CMakeFiles/CMakeTmp/CheckSymbolExists.c:8:19: note: each undeclared identifier is reported only once for each function it appears in
CMakeFiles/cmTC_bced3.dir/build.make:65: recipe for target 'CMakeFiles/cmTC_bced3.dir/CheckSymbolExists.c.o' failed
make[2]: *** [CMakeFiles/cmTC_bced3.dir/CheckSymbolExists.c.o] Error 1
make[2]: Leaving directory '/home/buildbot/builder/monero-static-ubuntu-amd64/build/build/release/CMakeFiles/CMakeTmp'
Makefile:126: recipe for target 'cmTC_bced3/fast' failed
make[1]: *** [cmTC_bced3/fast] Error 2
make[1]: Leaving directory '/home/buildbot/builder/monero-static-ubuntu-amd64/build/build/release/CMakeFiles/CMakeTmp'

File /home/buildbot/builder/monero-static-ubuntu-amd64/build/build/release/CMakeFiles/CMakeTmp/CheckSymbolExists.c:
/* */
#include <openssl/opensslv.h>

int main(int argc, char** argv)
{
  (void)argv;
#ifndef LIBRESSL_VERSION_TEXT
  return ((int*)(&LIBRESSL_VERSION_TEXT))[argc];
#else
  (void)argc;
  return 0;
#endif
}

Performing C SOURCE FILE Test _fcf_protection=full_c failed with the following output:
Change Dir: /home/buildbot/builder/monero-static-ubuntu-amd64/build/build/release/CMakeFiles/CMakeTmp

Run Build Command:"/usr/bin/make" "cmTC_246a8/fast"
make[1]: Entering directory '/home/buildbot/builder/monero-static-ubuntu-amd64/build/build/release/CMakeFiles/CMakeTmp'
/usr/bin/make -f CMakeFiles/cmTC_246a8.dir/build.make CMakeFiles/cmTC_246a8.dir/build
make[2]: Entering directory '/home/buildbot/builder/monero-static-ubuntu-amd64/build/build/release/CMakeFiles/CMakeTmp'
Building C object CMakeFiles/cmTC_246a8.dir/src.c.o
/usr/bin/cc   -pthread -maes -march=x86-64 -fno-strict-aliasing -D_fcf_protection=full_c   -fcf-protection=full -o CMakeFiles/cmTC_246a8.dir/src.c.o   -c /home/buildbot/builder/monero-static-ubuntu-amd64/build/build/release/CMakeFiles/CMakeTmp/src.c
cc: error: unrecognized command line option '-fcf-protection=full'; did you mean '-fstack-protector-all'?
CMakeFiles/cmTC_246a8.dir/build.make:65: recipe for target 'CMakeFiles/cmTC_246a8.dir/src.c.o' failed
make[2]: *** [CMakeFiles/cmTC_246a8.dir/src.c.o] Error 1
make[2]: Leaving directory '/home/buildbot/builder/monero-static-ubuntu-amd64/build/build/release/CMakeFiles/CMakeTmp'
Makefile:126: recipe for target 'cmTC_246a8/fast' failed
make[1]: *** [cmTC_246a8/fast] Error 2
make[1]: Leaving directory '/home/buildbot/builder/monero-static-ubuntu-amd64/build/build/release/CMakeFiles/CMakeTmp'

Source file was:
int main(void) { return 0; }
Performing C++ SOURCE FILE Test _fcf_protection=full_cxx failed with the following output:
Change Dir: /home/buildbot/builder/monero-static-ubuntu-amd64/build/build/release/CMakeFiles/CMakeTmp

Run Build Command:"/usr/bin/make" "cmTC_37ca3/fast"
make[1]: Entering directory '/home/buildbot/builder/monero-static-ubuntu-amd64/build/build/release/CMakeFiles/CMakeTmp'
/usr/bin/make -f CMakeFiles/cmTC_37ca3.dir/build.make CMakeFiles/cmTC_37ca3.dir/build
make[2]: Entering directory '/home/buildbot/builder/monero-static-ubuntu-amd64/build/build/release/CMakeFiles/CMakeTmp'
Building CXX object CMakeFiles/cmTC_37ca3.dir/src.cxx.o
/usr/bin/c++    -DZMQ_STATIC -pthread -maes -march=x86-64 -fno-strict-aliasing -D_fcf_protection=full_cxx   -fcf-protection=full -o CMakeFiles/cmTC_37ca3.dir/src.cxx.o -c /home/buildbot/builder/monero-static-ubuntu-amd64/build/build/release/CMakeFiles/CMakeTmp/src.cxx
c++: error: unrecognized command line option '-fcf-protection=full'; did you mean '-fstack-protector-all'?
CMakeFiles/cmTC_37ca3.dir/build.make:65: recipe for target 'CMakeFiles/cmTC_37ca3.dir/src.cxx.o' failed
make[2]: *** [CMakeFiles/cmTC_37ca3.dir/src.cxx.o] Error 1
make[2]: Leaving directory '/home/buildbot/builder/monero-static-ubuntu-amd64/build/build/release/CMakeFiles/CMakeTmp'
Makefile:126: recipe for target 'cmTC_37ca3/fast' failed
make[1]: *** [cmTC_37ca3/fast] Error 2
make[1]: Leaving directory '/home/buildbot/builder/monero-static-ubuntu-amd64/build/build/release/CMakeFiles/CMakeTmp'

Source file was:
int main() { return 0; }
Performing C SOURCE FILE Test _fstack_clash_protection_c failed with the following output:
Change Dir: /home/buildbot/builder/monero-static-ubuntu-amd64/build/build/release/CMakeFiles/CMakeTmp

Run Build Command:"/usr/bin/make" "cmTC_00d28/fast"
make[1]: Entering directory '/home/buildbot/builder/monero-static-ubuntu-amd64/build/build/release/CMakeFiles/CMakeTmp'
/usr/bin/make -f CMakeFiles/cmTC_00d28.dir/build.make CMakeFiles/cmTC_00d28.dir/build
make[2]: Entering directory '/home/buildbot/builder/monero-static-ubuntu-amd64/build/build/release/CMakeFiles/CMakeTmp'
Building C object CMakeFiles/cmTC_00d28.dir/src.c.o
/usr/bin/cc   -pthread -maes -march=x86-64 -fno-strict-aliasing -D_fstack_clash_protection_c   -fstack-clash-protection -o CMakeFiles/cmTC_00d28.dir/src.c.o   -c /home/buildbot/builder/monero-static-ubuntu-amd64/build/build/release/CMakeFiles/CMakeTmp/src.c
cc: error: unrecognized command line option '-fstack-clash-protection'; did you mean '-fstack-protector'?
CMakeFiles/cmTC_00d28.dir/build.make:65: recipe for target 'CMakeFiles/cmTC_00d28.dir/src.c.o' failed
make[2]: *** [CMakeFiles/cmTC_00d28.dir/src.c.o] Error 1
make[2]: Leaving directory '/home/buildbot/builder/monero-static-ubuntu-amd64/build/build/release/CMakeFiles/CMakeTmp'
Makefile:126: recipe for target 'cmTC_00d28/fast' failed
make[1]: *** [cmTC_00d28/fast] Error 2
make[1]: Leaving directory '/home/buildbot/builder/monero-static-ubuntu-amd64/build/build/release/CMakeFiles/CMakeTmp'

Source file was:
int main(void) { return 0; }
Performing C++ SOURCE FILE Test _fstack_clash_protection_cxx failed with the following output:
Change Dir: /home/buildbot/builder/monero-static-ubuntu-amd64/build/build/release/CMakeFiles/CMakeTmp

Run Build Command:"/usr/bin/make" "cmTC_65329/fast"
make[1]: Entering directory '/home/buildbot/builder/monero-static-ubuntu-amd64/build/build/release/CMakeFiles/CMakeTmp'
/usr/bin/make -f CMakeFiles/cmTC_65329.dir/build.make CMakeFiles/cmTC_65329.dir/build
make[2]: Entering directory '/home/buildbot/builder/monero-static-ubuntu-amd64/build/build/release/CMakeFiles/CMakeTmp'
Building CXX object CMakeFiles/cmTC_65329.dir/src.cxx.o
/usr/bin/c++    -DZMQ_STATIC -pthread -maes -march=x86-64 -fno-strict-aliasing -D_fstack_clash_protection_cxx   -fstack-clash-protection -o CMakeFiles/cmTC_65329.dir/src.cxx.o -c /home/buildbot/builder/monero-static-ubuntu-amd64/build/build/release/CMakeFiles/CMakeTmp/src.cxx
c++: error: unrecognized command line option '-fstack-clash-protection'; did you mean '-fstack-protector'?
CMakeFiles/cmTC_65329.dir/build.make:65: recipe for target 'CMakeFiles/cmTC_65329.dir/src.cxx.o' failed
make[2]: *** [CMakeFiles/cmTC_65329.dir/src.cxx.o] Error 1
make[2]: Leaving directory '/home/buildbot/builder/monero-static-ubuntu-amd64/build/build/release/CMakeFiles/CMakeTmp'
Makefile:126: recipe for target 'cmTC_65329/fast' failed
make[1]: *** [cmTC_65329/fast] Error 2
make[1]: Leaving directory '/home/buildbot/builder/monero-static-ubuntu-amd64/build/build/release/CMakeFiles/CMakeTmp'

Source file was:
int main() { return 0; }
Determining if the -Wl,-z,noexecheap linker flag is supported failed with the following output:
Change Dir: /home/buildbot/builder/monero-static-ubuntu-amd64/build/build/release/CMakeFiles/CMakeTmp

Run Build Command:"/usr/bin/make" "cmTC_6b731/fast"
make[1]: Entering directory '/home/buildbot/builder/monero-static-ubuntu-amd64/build/build/release/CMakeFiles/CMakeTmp'
/usr/bin/make -f CMakeFiles/cmTC_6b731.dir/build.make CMakeFiles/cmTC_6b731.dir/build
make[2]: Entering directory '/home/buildbot/builder/monero-static-ubuntu-amd64/build/build/release/CMakeFiles/CMakeTmp'
Building C object CMakeFiles/cmTC_6b731.dir/CheckLinkerFlag.c.o
/usr/bin/cc   -Wl,-z,noexecheap    -Wl,-z,noexecheap -o CMakeFiles/cmTC_6b731.dir/CheckLinkerFlag.c.o   -c /home/buildbot/builder/monero-static-ubuntu-amd64/build/cmake/CheckLinkerFlag.c
Linking C executable cmTC_6b731
/usr/bin/cmake -E cmake_link_script CMakeFiles/cmTC_6b731.dir/link.txt --verbose=1
/usr/bin/cc -Wl,-z,noexecheap     -rdynamic CMakeFiles/cmTC_6b731.dir/CheckLinkerFlag.c.o  -o cmTC_6b731 
/usr/bin/ld: warning: -z noexecheap ignored.
make[2]: Leaving directory '/home/buildbot/builder/monero-static-ubuntu-amd64/build/build/release/CMakeFiles/CMakeTmp'
make[1]: Leaving directory '/home/buildbot/builder/monero-static-ubuntu-amd64/build/build/release/CMakeFiles/CMakeTmp'


Determining if the function rl_copy_text exists failed with the following output:
Change Dir: /home/buildbot/builder/monero-static-ubuntu-amd64/build/build/release/CMakeFiles/CMakeTmp

Run Build Command:"/usr/bin/make" "cmTC_0d611/fast"
make[1]: Entering directory '/home/buildbot/builder/monero-static-ubuntu-amd64/build/build/release/CMakeFiles/CMakeTmp'
/usr/bin/make -f CMakeFiles/cmTC_0d611.dir/build.make CMakeFiles/cmTC_0d611.dir/build
make[2]: Entering directory '/home/buildbot/builder/monero-static-ubuntu-amd64/build/build/release/CMakeFiles/CMakeTmp'
Building C object CMakeFiles/cmTC_0d611.dir/CheckFunctionExists.c.o
/usr/bin/cc   -pthread -maes -march=x86-64 -fno-strict-aliasing -std=c11 -D_GNU_SOURCE   -Wall -Wextra -Wpointer-arith -Wundef -Wvla -Wwrite-strings -Wno-error=extra -Wno-error=deprecated-declarations -Wno-unused-parameter -Wno-unused-variable -Wno-error=unused-variable -Wno-error=undef -Wno-error=uninitialized -Wlogical-op -Wno-error=maybe-uninitialized -Wno-error=cpp -Waggregate-return -Wnested-externs -Wold-style-definition -Wstrict-prototypes  -fPIC  -Wformat -Wformat-security -fstack-protector -fstack-protector-strong -mmitigate-rop -fno-strict-aliasing -DCHECK_FUNCTION_EXISTS=rl_copy_text   -o CMakeFiles/cmTC_0d611.dir/CheckFunctionExists.c.o   -c /usr/share/cmake-3.10/Modules/CheckFunctionExists.c
Linking C executable cmTC_0d611
/usr/bin/cmake -E cmake_link_script CMakeFiles/cmTC_0d611.dir/link.txt --verbose=1
/usr/bin/cc  -pthread -maes -march=x86-64 -fno-strict-aliasing -std=c11 -D_GNU_SOURCE   -Wall -Wextra -Wpointer-arith -Wundef -Wvla -Wwrite-strings -Wno-error=extra -Wno-error=deprecated-declarations -Wno-unused-parameter -Wno-unused-variable -Wno-error=unused-variable -Wno-error=undef -Wno-error=uninitialized -Wlogical-op -Wno-error=maybe-uninitialized -Wno-error=cpp -Waggregate-return -Wnested-externs -Wold-style-definition -Wstrict-prototypes  -fPIC  -Wformat -Wformat-security -fstack-protector -fstack-protector-strong -mmitigate-rop -fno-strict-aliasing -DCHECK_FUNCTION_EXISTS=rl_copy_text    -rdynamic CMakeFiles/cmTC_0d611.dir/CheckFunctionExists.c.o  -o cmTC_0d611 /usr/lib/x86_64-linux-gnu/libreadline.a 
/usr/lib/x86_64-linux-gnu/libreadline.a(terminal.o): In function `_rl_get_screen_size':
(.text+0x186): undefined reference to `tgetnum'
(.text+0x2be): undefined reference to `tgetnum'
/usr/lib/x86_64-linux-gnu/libreadline.a(terminal.o): In function `_rl_init_terminal_io':
(.text+0x678): undefined reference to `PC'
(.text+0x687): undefined reference to `BC'
(.text+0x68e): undefined reference to `UP'
(.text+0x728): undefined reference to `tgetent'
(.text+0x76f): undefined reference to `tgetstr'
(.text+0x799): undefined reference to `PC'
(.text+0x7af): undefined reference to `BC'
(.text+0x7bd): undefined reference to `UP'
(.text+0x7cf): undefined reference to `tgetflag'
(.text+0x81e): undefined reference to `tgetflag'
(.text+0x938): undefined reference to `tgetflag'
/usr/lib/x86_64-linux-gnu/libreadline.a(terminal.o): In function `_rl_backspace':
(.text+0xb4b): undefined reference to `tputs'
/usr/lib/x86_64-linux-gnu/libreadline.a(terminal.o): In function `rl_ding':
(.text+0xc1d): undefined reference to `tputs'
/usr/lib/x86_64-linux-gnu/libreadline.a(terminal.o): In function `_rl_enable_meta_key':
(.text+0xc67): undefined reference to `tputs'
/usr/lib/x86_64-linux-gnu/libreadline.a(terminal.o): In function `_rl_disable_meta_key':
(.text+0xcc9): undefined reference to `tputs'
/usr/lib/x86_64-linux-gnu/libreadline.a(terminal.o): In function `_rl_control_keypad':
(.text+0xcfd): undefined reference to `tputs'
/usr/lib/x86_64-linux-gnu/libreadline.a(terminal.o):(.text+0xd50): more undefined references to `tputs' follow
/usr/lib/x86_64-linux-gnu/libreadline.a(display.o): In function `update_line':
(.text+0x301f): undefined reference to `tgoto'
(.text+0x3033): undefined reference to `tputs'
(.text+0x31cc): undefined reference to `tputs'
(.text+0x32bf): undefined reference to `tputs'
(.text+0x34b8): undefined reference to `tputs'
(.text+0x3513): undefined reference to `tputs'
(.text+0x3546): undefined reference to `tgoto'
(.text+0x3557): undefined reference to `tputs'
/usr/lib/x86_64-linux-gnu/libreadline.a(display.o): In function `rl_redisplay':
(.text+0x4591): undefined reference to `tputs'
(.text+0x50be): undefined reference to `tputs'
/usr/lib/x86_64-linux-gnu/libreadline.a(display.o): In function `rl_clear_visible_line':
(.text+0x5265): undefined reference to `tputs'
/usr/lib/x86_64-linux-gnu/libreadline.a(display.o): In function `_rl_redisplay_after_sigwinch':
(.text+0x53f1): undefined reference to `tputs'
/usr/lib/x86_64-linux-gnu/libreadline.a(display.o):(.text+0x5414): more undefined references to `tputs' follow
collect2: error: ld returned 1 exit status
CMakeFiles/cmTC_0d611.dir/build.make:98: recipe for target 'cmTC_0d611' failed
make[2]: *** [cmTC_0d611] Error 1
make[2]: Leaving directory '/home/buildbot/builder/monero-static-ubuntu-amd64/build/build/release/CMakeFiles/CMakeTmp'
Makefile:126: recipe for target 'cmTC_0d611/fast' failed
make[1]: *** [cmTC_0d611/fast] Error 2
make[1]: Leaving directory '/home/buildbot/builder/monero-static-ubuntu-amd64/build/build/release/CMakeFiles/CMakeTmp'


Determining if the function rl_filename_completion_function exists failed with the following output:
Change Dir: /home/buildbot/builder/monero-static-ubuntu-amd64/build/build/release/CMakeFiles/CMakeTmp

Run Build Command:"/usr/bin/make" "cmTC_5e7ce/fast"
make[1]: Entering directory '/home/buildbot/builder/monero-static-ubuntu-amd64/build/build/release/CMakeFiles/CMakeTmp'
/usr/bin/make -f CMakeFiles/cmTC_5e7ce.dir/build.make CMakeFiles/cmTC_5e7ce.dir/build
make[2]: Entering directory '/home/buildbot/builder/monero-static-ubuntu-amd64/build/build/release/CMakeFiles/CMakeTmp'
Building C object CMakeFiles/cmTC_5e7ce.dir/CheckFunctionExists.c.o
/usr/bin/cc   -pthread -maes -march=x86-64 -fno-strict-aliasing -std=c11 -D_GNU_SOURCE   -Wall -Wextra -Wpointer-arith -Wundef -Wvla -Wwrite-strings -Wno-error=extra -Wno-error=deprecated-declarations -Wno-unused-parameter -Wno-unused-variable -Wno-error=unused-variable -Wno-error=undef -Wno-error=uninitialized -Wlogical-op -Wno-error=maybe-uninitialized -Wno-error=cpp -Waggregate-return -Wnested-externs -Wold-style-definition -Wstrict-prototypes  -fPIC  -Wformat -Wformat-security -fstack-protector -fstack-protector-strong -mmitigate-rop -fno-strict-aliasing -DCHECK_FUNCTION_EXISTS=rl_filename_completion_function   -o CMakeFiles/cmTC_5e7ce.dir/CheckFunctionExists.c.o   -c /usr/share/cmake-3.10/Modules/CheckFunctionExists.c
Linking C executable cmTC_5e7ce
/usr/bin/cmake -E cmake_link_script CMakeFiles/cmTC_5e7ce.dir/link.txt --verbose=1
/usr/bin/cc  -pthread -maes -march=x86-64 -fno-strict-aliasing -std=c11 -D_GNU_SOURCE   -Wall -Wextra -Wpointer-arith -Wundef -Wvla -Wwrite-strings -Wno-error=extra -Wno-error=deprecated-declarations -Wno-unused-parameter -Wno-unused-variable -Wno-error=unused-variable -Wno-error=undef -Wno-error=uninitialized -Wlogical-op -Wno-error=maybe-uninitialized -Wno-error=cpp -Waggregate-return -Wnested-externs -Wold-style-definition -Wstrict-prototypes  -fPIC  -Wformat -Wformat-security -fstack-protector -fstack-protector-strong -mmitigate-rop -fno-strict-aliasing -DCHECK_FUNCTION_EXISTS=rl_filename_completion_function    -rdynamic CMakeFiles/cmTC_5e7ce.dir/CheckFunctionExists.c.o  -o cmTC_5e7ce /usr/lib/x86_64-linux-gnu/libreadline.a 
/usr/lib/x86_64-linux-gnu/libreadline.a(display.o): In function `_rl_move_cursor_relative':
(.text+0xf86): undefined reference to `tputs'
(.text+0xfec): undefined reference to `tputs'
(.text+0x11ac): undefined reference to `tputs'
/usr/lib/x86_64-linux-gnu/libreadline.a(display.o): In function `_rl_move_vert':
(.text+0x123d): undefined reference to `tputs'
(.text+0x12a3): undefined reference to `tputs'
/usr/lib/x86_64-linux-gnu/libreadline.a(display.o):(.text+0x2117): more undefined references to `tputs' follow
/usr/lib/x86_64-linux-gnu/libreadline.a(display.o): In function `update_line':
(.text+0x301f): undefined reference to `tgoto'
(.text+0x3033): undefined reference to `tputs'
(.text+0x31cc): undefined reference to `tputs'
(.text+0x32bf): undefined reference to `tputs'
(.text+0x34b8): undefined reference to `tputs'
(.text+0x3513): undefined reference to `tputs'
(.text+0x3546): undefined reference to `tgoto'
(.text+0x3557): undefined reference to `tputs'
/usr/lib/x86_64-linux-gnu/libreadline.a(display.o): In function `rl_redisplay':
(.text+0x4591): undefined reference to `tputs'
(.text+0x50be): undefined reference to `tputs'
/usr/lib/x86_64-linux-gnu/libreadline.a(display.o): In function `rl_clear_visible_line':
(.text+0x5265): undefined reference to `tputs'
/usr/lib/x86_64-linux-gnu/libreadline.a(display.o): In function `_rl_redisplay_after_sigwinch':
(.text+0x53f1): undefined reference to `tputs'
/usr/lib/x86_64-linux-gnu/libreadline.a(display.o):(.text+0x5414): more undefined references to `tputs' follow
/usr/lib/x86_64-linux-gnu/libreadline.a(terminal.o): In function `_rl_get_screen_size':
(.text+0x186): undefined reference to `tgetnum'
(.text+0x2be): undefined reference to `tgetnum'
/usr/lib/x86_64-linux-gnu/libreadline.a(terminal.o): In function `_rl_init_terminal_io':
(.text+0x678): undefined reference to `PC'
(.text+0x687): undefined reference to `BC'
(.text+0x68e): undefined reference to `UP'
(.text+0x728): undefined reference to `tgetent'
(.text+0x76f): undefined reference to `tgetstr'
(.text+0x799): undefined reference to `PC'
(.text+0x7af): undefined reference to `BC'
(.text+0x7bd): undefined reference to `UP'
(.text+0x7cf): undefined reference to `tgetflag'
(.text+0x81e): undefined reference to `tgetflag'
(.text+0x938): undefined reference to `tgetflag'
/usr/lib/x86_64-linux-gnu/libreadline.a(terminal.o): In function `_rl_backspace':
(.text+0xb4b): undefined reference to `tputs'
/usr/lib/x86_64-linux-gnu/libreadline.a(terminal.o): In function `rl_ding':
(.text+0xc1d): undefined reference to `tputs'
/usr/lib/x86_64-linux-gnu/libreadline.a(terminal.o): In function `_rl_enable_meta_key':
(.text+0xc67): undefined reference to `tputs'
/usr/lib/x86_64-linux-gnu/libreadline.a(terminal.o): In function `_rl_disable_meta_key':
(.text+0xcc9): undefined reference to `tputs'
/usr/lib/x86_64-linux-gnu/libreadline.a(terminal.o): In function `_rl_control_keypad':
(.text+0xcfd): undefined reference to `tputs'
/usr/lib/x86_64-linux-gnu/libreadline.a(terminal.o):(.text+0xd50): more undefined references to `tputs' follow
collect2: error: ld returned 1 exit status
CMakeFiles/cmTC_5e7ce.dir/build.make:98: recipe for target 'cmTC_5e7ce' failed
make[2]: *** [cmTC_5e7ce] Error 1
make[2]: Leaving directory '/home/buildbot/builder/monero-static-ubuntu-amd64/build/build/release/CMakeFiles/CMakeTmp'
Makefile:126: recipe for target 'cmTC_5e7ce/fast' failed
make[1]: *** [cmTC_5e7ce/fast] Error 2
make[1]: Leaving directory '/home/buildbot/builder/monero-static-ubuntu-amd64/build/build/release/CMakeFiles/CMakeTmp'