(view as text)
Determining if the pthread_create exist failed with the following output:
Change Dir: /home/buildbot/builder/monero-static-ubuntu-amd64/build/build/release/CMakeFiles/CMakeTmp

Run Build Command:"/usr/bin/make" "cmTC_463c0/fast"
make[1]: Entering directory '/home/buildbot/builder/monero-static-ubuntu-amd64/build/build/release/CMakeFiles/CMakeTmp'
/usr/bin/make -f CMakeFiles/cmTC_463c0.dir/build.make CMakeFiles/cmTC_463c0.dir/build
make[2]: Entering directory '/home/buildbot/builder/monero-static-ubuntu-amd64/build/build/release/CMakeFiles/CMakeTmp'
Building C object CMakeFiles/cmTC_463c0.dir/CheckSymbolExists.c.o
/usr/bin/cc    -o CMakeFiles/cmTC_463c0.dir/CheckSymbolExists.c.o   -c /home/buildbot/builder/monero-static-ubuntu-amd64/build/build/release/CMakeFiles/CMakeTmp/CheckSymbolExists.c
Linking C executable cmTC_463c0
/usr/bin/cmake -E cmake_link_script CMakeFiles/cmTC_463c0.dir/link.txt --verbose=1
/usr/bin/cc      -rdynamic CMakeFiles/cmTC_463c0.dir/CheckSymbolExists.c.o  -o cmTC_463c0 
CMakeFiles/cmTC_463c0.dir/CheckSymbolExists.c.o: In function `main':
CheckSymbolExists.c:(.text+0x1b): undefined reference to `pthread_create'
collect2: error: ld returned 1 exit status
CMakeFiles/cmTC_463c0.dir/build.make:97: recipe for target 'cmTC_463c0' failed
make[2]: *** [cmTC_463c0] Error 1
make[2]: Leaving directory '/home/buildbot/builder/monero-static-ubuntu-amd64/build/build/release/CMakeFiles/CMakeTmp'
Makefile:126: recipe for target 'cmTC_463c0/fast' failed
make[1]: *** [cmTC_463c0/fast] Error 2
make[1]: Leaving directory '/home/buildbot/builder/monero-static-ubuntu-amd64/build/build/release/CMakeFiles/CMakeTmp'

File /home/buildbot/builder/monero-static-ubuntu-amd64/build/build/release/CMakeFiles/CMakeTmp/CheckSymbolExists.c:
/* */
#include <pthread.h>

int main(int argc, char** argv)
{
  (void)argv;
#ifndef pthread_create
  return ((int*)(&pthread_create))[argc];
#else
  (void)argc;
  return 0;
#endif
}

Determining if the function memset_s exists in the c failed with the following output:
Change Dir: /home/buildbot/builder/monero-static-ubuntu-amd64/build/build/release/CMakeFiles/CMakeTmp

Run Build Command:"/usr/bin/make" "cmTC_ea12f/fast"
make[1]: Entering directory '/home/buildbot/builder/monero-static-ubuntu-amd64/build/build/release/CMakeFiles/CMakeTmp'
/usr/bin/make -f CMakeFiles/cmTC_ea12f.dir/build.make CMakeFiles/cmTC_ea12f.dir/build
make[2]: Entering directory '/home/buildbot/builder/monero-static-ubuntu-amd64/build/build/release/CMakeFiles/CMakeTmp'
Building C object CMakeFiles/cmTC_ea12f.dir/CheckFunctionExists.c.o
/usr/bin/cc   -pthread -DCHECK_FUNCTION_EXISTS=memset_s   -o CMakeFiles/cmTC_ea12f.dir/CheckFunctionExists.c.o   -c /usr/share/cmake-3.10/Modules/CheckFunctionExists.c
Linking C executable cmTC_ea12f
/usr/bin/cmake -E cmake_link_script CMakeFiles/cmTC_ea12f.dir/link.txt --verbose=1
/usr/bin/cc  -pthread -DCHECK_FUNCTION_EXISTS=memset_s    -rdynamic CMakeFiles/cmTC_ea12f.dir/CheckFunctionExists.c.o  -o cmTC_ea12f  -L/home/buildbot/builder/monero-static-ubuntu-amd64/build/build/release/CMakeFiles/CMakeTmp/string.h -Wl,-rpath,/home/buildbot/builder/monero-static-ubuntu-amd64/build/build/release/CMakeFiles/CMakeTmp/string.h -lc 
CMakeFiles/cmTC_ea12f.dir/CheckFunctionExists.c.o: In function `main':
CheckFunctionExists.c:(.text+0x10): undefined reference to `memset_s'
collect2: error: ld returned 1 exit status
CMakeFiles/cmTC_ea12f.dir/build.make:97: recipe for target 'cmTC_ea12f' failed
make[2]: *** [cmTC_ea12f] Error 1
make[2]: Leaving directory '/home/buildbot/builder/monero-static-ubuntu-amd64/build/build/release/CMakeFiles/CMakeTmp'
Makefile:126: recipe for target 'cmTC_ea12f/fast' failed
make[1]: *** [cmTC_ea12f/fast] Error 2
make[1]: Leaving directory '/home/buildbot/builder/monero-static-ubuntu-amd64/build/build/release/CMakeFiles/CMakeTmp'


Determining if the include file event.h exists failed with the following output:
Change Dir: /home/buildbot/builder/monero-static-ubuntu-amd64/build/build/release/CMakeFiles/CMakeTmp

Run Build Command:"/usr/bin/make" "cmTC_63b22/fast"
make[1]: Entering directory '/home/buildbot/builder/monero-static-ubuntu-amd64/build/build/release/CMakeFiles/CMakeTmp'
/usr/bin/make -f CMakeFiles/cmTC_63b22.dir/build.make CMakeFiles/cmTC_63b22.dir/build
make[2]: Entering directory '/home/buildbot/builder/monero-static-ubuntu-amd64/build/build/release/CMakeFiles/CMakeTmp'
Building C object CMakeFiles/cmTC_63b22.dir/CheckIncludeFile.c.o
/usr/bin/cc   -pthread    -o CMakeFiles/cmTC_63b22.dir/CheckIncludeFile.c.o   -c /home/buildbot/builder/monero-static-ubuntu-amd64/build/build/release/CMakeFiles/CMakeTmp/CheckIncludeFile.c
/home/buildbot/builder/monero-static-ubuntu-amd64/build/build/release/CMakeFiles/CMakeTmp/CheckIncludeFile.c:1:10: fatal error: event.h: No such file or directory
 #include <event.h>
          ^~~~~~~~~
compilation terminated.
CMakeFiles/cmTC_63b22.dir/build.make:65: recipe for target 'CMakeFiles/cmTC_63b22.dir/CheckIncludeFile.c.o' failed
make[2]: *** [CMakeFiles/cmTC_63b22.dir/CheckIncludeFile.c.o] Error 1
make[2]: Leaving directory '/home/buildbot/builder/monero-static-ubuntu-amd64/build/build/release/CMakeFiles/CMakeTmp'
Makefile:126: recipe for target 'cmTC_63b22/fast' failed
make[1]: *** [cmTC_63b22/fast] Error 2
make[1]: Leaving directory '/home/buildbot/builder/monero-static-ubuntu-amd64/build/build/release/CMakeFiles/CMakeTmp'


Determining if the include file iphlpapi.h exists failed with the following output:
Change Dir: /home/buildbot/builder/monero-static-ubuntu-amd64/build/build/release/CMakeFiles/CMakeTmp

Run Build Command:"/usr/bin/make" "cmTC_ff796/fast"
make[1]: Entering directory '/home/buildbot/builder/monero-static-ubuntu-amd64/build/build/release/CMakeFiles/CMakeTmp'
/usr/bin/make -f CMakeFiles/cmTC_ff796.dir/build.make CMakeFiles/cmTC_ff796.dir/build
make[2]: Entering directory '/home/buildbot/builder/monero-static-ubuntu-amd64/build/build/release/CMakeFiles/CMakeTmp'
Building C object CMakeFiles/cmTC_ff796.dir/CheckIncludeFile.c.o
/usr/bin/cc   -pthread    -o CMakeFiles/cmTC_ff796.dir/CheckIncludeFile.c.o   -c /home/buildbot/builder/monero-static-ubuntu-amd64/build/build/release/CMakeFiles/CMakeTmp/CheckIncludeFile.c
/home/buildbot/builder/monero-static-ubuntu-amd64/build/build/release/CMakeFiles/CMakeTmp/CheckIncludeFile.c:1:10: fatal error: iphlpapi.h: No such file or directory
 #include <iphlpapi.h>
          ^~~~~~~~~~~~
compilation terminated.
CMakeFiles/cmTC_ff796.dir/build.make:65: recipe for target 'CMakeFiles/cmTC_ff796.dir/CheckIncludeFile.c.o' failed
make[2]: *** [CMakeFiles/cmTC_ff796.dir/CheckIncludeFile.c.o] Error 1
make[2]: Leaving directory '/home/buildbot/builder/monero-static-ubuntu-amd64/build/build/release/CMakeFiles/CMakeTmp'
Makefile:126: recipe for target 'cmTC_ff796/fast' failed
make[1]: *** [cmTC_ff796/fast] Error 2
make[1]: Leaving directory '/home/buildbot/builder/monero-static-ubuntu-amd64/build/build/release/CMakeFiles/CMakeTmp'


Determining if the include file login_cap.h exists failed with the following output:
Change Dir: /home/buildbot/builder/monero-static-ubuntu-amd64/build/build/release/CMakeFiles/CMakeTmp

Run Build Command:"/usr/bin/make" "cmTC_f0179/fast"
make[1]: Entering directory '/home/buildbot/builder/monero-static-ubuntu-amd64/build/build/release/CMakeFiles/CMakeTmp'
/usr/bin/make -f CMakeFiles/cmTC_f0179.dir/build.make CMakeFiles/cmTC_f0179.dir/build
make[2]: Entering directory '/home/buildbot/builder/monero-static-ubuntu-amd64/build/build/release/CMakeFiles/CMakeTmp'
Building C object CMakeFiles/cmTC_f0179.dir/CheckIncludeFile.c.o
/usr/bin/cc   -pthread    -o CMakeFiles/cmTC_f0179.dir/CheckIncludeFile.c.o   -c /home/buildbot/builder/monero-static-ubuntu-amd64/build/build/release/CMakeFiles/CMakeTmp/CheckIncludeFile.c
/home/buildbot/builder/monero-static-ubuntu-amd64/build/build/release/CMakeFiles/CMakeTmp/CheckIncludeFile.c:1:10: fatal error: login_cap.h: No such file or directory
 #include <login_cap.h>
          ^~~~~~~~~~~~~
compilation terminated.
CMakeFiles/cmTC_f0179.dir/build.make:65: recipe for target 'CMakeFiles/cmTC_f0179.dir/CheckIncludeFile.c.o' failed
make[2]: *** [CMakeFiles/cmTC_f0179.dir/CheckIncludeFile.c.o] Error 1
make[2]: Leaving directory '/home/buildbot/builder/monero-static-ubuntu-amd64/build/build/release/CMakeFiles/CMakeTmp'
Makefile:126: recipe for target 'cmTC_f0179/fast' failed
make[1]: *** [cmTC_f0179/fast] Error 2
make[1]: Leaving directory '/home/buildbot/builder/monero-static-ubuntu-amd64/build/build/release/CMakeFiles/CMakeTmp'


Determining if the include file sys/sha2.h exists failed with the following output:
Change Dir: /home/buildbot/builder/monero-static-ubuntu-amd64/build/build/release/CMakeFiles/CMakeTmp

Run Build Command:"/usr/bin/make" "cmTC_e243b/fast"
make[1]: Entering directory '/home/buildbot/builder/monero-static-ubuntu-amd64/build/build/release/CMakeFiles/CMakeTmp'
/usr/bin/make -f CMakeFiles/cmTC_e243b.dir/build.make CMakeFiles/cmTC_e243b.dir/build
make[2]: Entering directory '/home/buildbot/builder/monero-static-ubuntu-amd64/build/build/release/CMakeFiles/CMakeTmp'
Building C object CMakeFiles/cmTC_e243b.dir/CheckIncludeFile.c.o
/usr/bin/cc   -pthread    -o CMakeFiles/cmTC_e243b.dir/CheckIncludeFile.c.o   -c /home/buildbot/builder/monero-static-ubuntu-amd64/build/build/release/CMakeFiles/CMakeTmp/CheckIncludeFile.c
/home/buildbot/builder/monero-static-ubuntu-amd64/build/build/release/CMakeFiles/CMakeTmp/CheckIncludeFile.c:1:10: fatal error: sys/sha2.h: No such file or directory
 #include <sys/sha2.h>
          ^~~~~~~~~~~~
compilation terminated.
CMakeFiles/cmTC_e243b.dir/build.make:65: recipe for target 'CMakeFiles/cmTC_e243b.dir/CheckIncludeFile.c.o' failed
make[2]: *** [CMakeFiles/cmTC_e243b.dir/CheckIncludeFile.c.o] Error 1
make[2]: Leaving directory '/home/buildbot/builder/monero-static-ubuntu-amd64/build/build/release/CMakeFiles/CMakeTmp'
Makefile:126: recipe for target 'cmTC_e243b/fast' failed
make[1]: *** [cmTC_e243b/fast] Error 2
make[1]: Leaving directory '/home/buildbot/builder/monero-static-ubuntu-amd64/build/build/release/CMakeFiles/CMakeTmp'


Determining if the include file vfork.h exists failed with the following output:
Change Dir: /home/buildbot/builder/monero-static-ubuntu-amd64/build/build/release/CMakeFiles/CMakeTmp

Run Build Command:"/usr/bin/make" "cmTC_18095/fast"
make[1]: Entering directory '/home/buildbot/builder/monero-static-ubuntu-amd64/build/build/release/CMakeFiles/CMakeTmp'
/usr/bin/make -f CMakeFiles/cmTC_18095.dir/build.make CMakeFiles/cmTC_18095.dir/build
make[2]: Entering directory '/home/buildbot/builder/monero-static-ubuntu-amd64/build/build/release/CMakeFiles/CMakeTmp'
Building C object CMakeFiles/cmTC_18095.dir/CheckIncludeFile.c.o
/usr/bin/cc   -pthread    -o CMakeFiles/cmTC_18095.dir/CheckIncludeFile.c.o   -c /home/buildbot/builder/monero-static-ubuntu-amd64/build/build/release/CMakeFiles/CMakeTmp/CheckIncludeFile.c
/home/buildbot/builder/monero-static-ubuntu-amd64/build/build/release/CMakeFiles/CMakeTmp/CheckIncludeFile.c:1:10: fatal error: vfork.h: No such file or directory
 #include <vfork.h>
          ^~~~~~~~~
compilation terminated.
CMakeFiles/cmTC_18095.dir/build.make:65: recipe for target 'CMakeFiles/cmTC_18095.dir/CheckIncludeFile.c.o' failed
make[2]: *** [CMakeFiles/cmTC_18095.dir/CheckIncludeFile.c.o] Error 1
make[2]: Leaving directory '/home/buildbot/builder/monero-static-ubuntu-amd64/build/build/release/CMakeFiles/CMakeTmp'
Makefile:126: recipe for target 'cmTC_18095/fast' failed
make[1]: *** [cmTC_18095/fast] Error 2
make[1]: Leaving directory '/home/buildbot/builder/monero-static-ubuntu-amd64/build/build/release/CMakeFiles/CMakeTmp'


Determining if the include file windows.h exists failed with the following output:
Change Dir: /home/buildbot/builder/monero-static-ubuntu-amd64/build/build/release/CMakeFiles/CMakeTmp

Run Build Command:"/usr/bin/make" "cmTC_8887e/fast"
make[1]: Entering directory '/home/buildbot/builder/monero-static-ubuntu-amd64/build/build/release/CMakeFiles/CMakeTmp'
/usr/bin/make -f CMakeFiles/cmTC_8887e.dir/build.make CMakeFiles/cmTC_8887e.dir/build
make[2]: Entering directory '/home/buildbot/builder/monero-static-ubuntu-amd64/build/build/release/CMakeFiles/CMakeTmp'
Building C object CMakeFiles/cmTC_8887e.dir/CheckIncludeFile.c.o
/usr/bin/cc   -pthread    -o CMakeFiles/cmTC_8887e.dir/CheckIncludeFile.c.o   -c /home/buildbot/builder/monero-static-ubuntu-amd64/build/build/release/CMakeFiles/CMakeTmp/CheckIncludeFile.c
/home/buildbot/builder/monero-static-ubuntu-amd64/build/build/release/CMakeFiles/CMakeTmp/CheckIncludeFile.c:1:10: fatal error: windows.h: No such file or directory
 #include <windows.h>
          ^~~~~~~~~~~
compilation terminated.
CMakeFiles/cmTC_8887e.dir/build.make:65: recipe for target 'CMakeFiles/cmTC_8887e.dir/CheckIncludeFile.c.o' failed
make[2]: *** [CMakeFiles/cmTC_8887e.dir/CheckIncludeFile.c.o] Error 1
make[2]: Leaving directory '/home/buildbot/builder/monero-static-ubuntu-amd64/build/build/release/CMakeFiles/CMakeTmp'
Makefile:126: recipe for target 'cmTC_8887e/fast' failed
make[1]: *** [cmTC_8887e/fast] Error 2
make[1]: Leaving directory '/home/buildbot/builder/monero-static-ubuntu-amd64/build/build/release/CMakeFiles/CMakeTmp'


Determining if the include file winsock2.h exists failed with the following output:
Change Dir: /home/buildbot/builder/monero-static-ubuntu-amd64/build/build/release/CMakeFiles/CMakeTmp

Run Build Command:"/usr/bin/make" "cmTC_f7c24/fast"
make[1]: Entering directory '/home/buildbot/builder/monero-static-ubuntu-amd64/build/build/release/CMakeFiles/CMakeTmp'
/usr/bin/make -f CMakeFiles/cmTC_f7c24.dir/build.make CMakeFiles/cmTC_f7c24.dir/build
make[2]: Entering directory '/home/buildbot/builder/monero-static-ubuntu-amd64/build/build/release/CMakeFiles/CMakeTmp'
Building C object CMakeFiles/cmTC_f7c24.dir/CheckIncludeFile.c.o
/usr/bin/cc   -pthread    -o CMakeFiles/cmTC_f7c24.dir/CheckIncludeFile.c.o   -c /home/buildbot/builder/monero-static-ubuntu-amd64/build/build/release/CMakeFiles/CMakeTmp/CheckIncludeFile.c
/home/buildbot/builder/monero-static-ubuntu-amd64/build/build/release/CMakeFiles/CMakeTmp/CheckIncludeFile.c:1:10: fatal error: winsock2.h: No such file or directory
 #include <winsock2.h>
          ^~~~~~~~~~~~
compilation terminated.
CMakeFiles/cmTC_f7c24.dir/build.make:65: recipe for target 'CMakeFiles/cmTC_f7c24.dir/CheckIncludeFile.c.o' failed
make[2]: *** [CMakeFiles/cmTC_f7c24.dir/CheckIncludeFile.c.o] Error 1
make[2]: Leaving directory '/home/buildbot/builder/monero-static-ubuntu-amd64/build/build/release/CMakeFiles/CMakeTmp'
Makefile:126: recipe for target 'cmTC_f7c24/fast' failed
make[1]: *** [cmTC_f7c24/fast] Error 2
make[1]: Leaving directory '/home/buildbot/builder/monero-static-ubuntu-amd64/build/build/release/CMakeFiles/CMakeTmp'


Determining if the include file ws2tcpip.h exists failed with the following output:
Change Dir: /home/buildbot/builder/monero-static-ubuntu-amd64/build/build/release/CMakeFiles/CMakeTmp

Run Build Command:"/usr/bin/make" "cmTC_0d3da/fast"
make[1]: Entering directory '/home/buildbot/builder/monero-static-ubuntu-amd64/build/build/release/CMakeFiles/CMakeTmp'
/usr/bin/make -f CMakeFiles/cmTC_0d3da.dir/build.make CMakeFiles/cmTC_0d3da.dir/build
make[2]: Entering directory '/home/buildbot/builder/monero-static-ubuntu-amd64/build/build/release/CMakeFiles/CMakeTmp'
Building C object CMakeFiles/cmTC_0d3da.dir/CheckIncludeFile.c.o
/usr/bin/cc   -pthread    -o CMakeFiles/cmTC_0d3da.dir/CheckIncludeFile.c.o   -c /home/buildbot/builder/monero-static-ubuntu-amd64/build/build/release/CMakeFiles/CMakeTmp/CheckIncludeFile.c
/home/buildbot/builder/monero-static-ubuntu-amd64/build/build/release/CMakeFiles/CMakeTmp/CheckIncludeFile.c:1:10: fatal error: ws2tcpip.h: No such file or directory
 #include <ws2tcpip.h>
          ^~~~~~~~~~~~
compilation terminated.
CMakeFiles/cmTC_0d3da.dir/build.make:65: recipe for target 'CMakeFiles/cmTC_0d3da.dir/CheckIncludeFile.c.o' failed
make[2]: *** [CMakeFiles/cmTC_0d3da.dir/CheckIncludeFile.c.o] Error 1
make[2]: Leaving directory '/home/buildbot/builder/monero-static-ubuntu-amd64/build/build/release/CMakeFiles/CMakeTmp'
Makefile:126: recipe for target 'cmTC_0d3da/fast' failed
make[1]: *** [cmTC_0d3da/fast] Error 2
make[1]: Leaving directory '/home/buildbot/builder/monero-static-ubuntu-amd64/build/build/release/CMakeFiles/CMakeTmp'


Determining if the function _beginthreadex exists failed with the following output:
Change Dir: /home/buildbot/builder/monero-static-ubuntu-amd64/build/build/release/CMakeFiles/CMakeTmp

Run Build Command:"/usr/bin/make" "cmTC_64a9f/fast"
make[1]: Entering directory '/home/buildbot/builder/monero-static-ubuntu-amd64/build/build/release/CMakeFiles/CMakeTmp'
/usr/bin/make -f CMakeFiles/cmTC_64a9f.dir/build.make CMakeFiles/cmTC_64a9f.dir/build
make[2]: Entering directory '/home/buildbot/builder/monero-static-ubuntu-amd64/build/build/release/CMakeFiles/CMakeTmp'
Building C object CMakeFiles/cmTC_64a9f.dir/CheckFunctionExists.c.o
/usr/bin/cc   -pthread -DCHECK_FUNCTION_EXISTS=_beginthreadex   -o CMakeFiles/cmTC_64a9f.dir/CheckFunctionExists.c.o   -c /usr/share/cmake-3.10/Modules/CheckFunctionExists.c
Linking C executable cmTC_64a9f
/usr/bin/cmake -E cmake_link_script CMakeFiles/cmTC_64a9f.dir/link.txt --verbose=1
/usr/bin/cc  -pthread -DCHECK_FUNCTION_EXISTS=_beginthreadex    -rdynamic CMakeFiles/cmTC_64a9f.dir/CheckFunctionExists.c.o  -o cmTC_64a9f 
CMakeFiles/cmTC_64a9f.dir/CheckFunctionExists.c.o: In function `main':
CheckFunctionExists.c:(.text+0x10): undefined reference to `_beginthreadex'
collect2: error: ld returned 1 exit status
CMakeFiles/cmTC_64a9f.dir/build.make:97: recipe for target 'cmTC_64a9f' failed
make[2]: *** [cmTC_64a9f] Error 1
make[2]: Leaving directory '/home/buildbot/builder/monero-static-ubuntu-amd64/build/build/release/CMakeFiles/CMakeTmp'
Makefile:126: recipe for target 'cmTC_64a9f/fast' failed
make[1]: *** [cmTC_64a9f/fast] Error 2
make[1]: Leaving directory '/home/buildbot/builder/monero-static-ubuntu-amd64/build/build/release/CMakeFiles/CMakeTmp'


Determining if the function arc4random exists failed with the following output:
Change Dir: /home/buildbot/builder/monero-static-ubuntu-amd64/build/build/release/CMakeFiles/CMakeTmp

Run Build Command:"/usr/bin/make" "cmTC_c6e82/fast"
make[1]: Entering directory '/home/buildbot/builder/monero-static-ubuntu-amd64/build/build/release/CMakeFiles/CMakeTmp'
/usr/bin/make -f CMakeFiles/cmTC_c6e82.dir/build.make CMakeFiles/cmTC_c6e82.dir/build
make[2]: Entering directory '/home/buildbot/builder/monero-static-ubuntu-amd64/build/build/release/CMakeFiles/CMakeTmp'
Building C object CMakeFiles/cmTC_c6e82.dir/CheckFunctionExists.c.o
/usr/bin/cc   -pthread -DCHECK_FUNCTION_EXISTS=arc4random   -o CMakeFiles/cmTC_c6e82.dir/CheckFunctionExists.c.o   -c /usr/share/cmake-3.10/Modules/CheckFunctionExists.c
Linking C executable cmTC_c6e82
/usr/bin/cmake -E cmake_link_script CMakeFiles/cmTC_c6e82.dir/link.txt --verbose=1
/usr/bin/cc  -pthread -DCHECK_FUNCTION_EXISTS=arc4random    -rdynamic CMakeFiles/cmTC_c6e82.dir/CheckFunctionExists.c.o  -o cmTC_c6e82 
CMakeFiles/cmTC_c6e82.dir/CheckFunctionExists.c.o: In function `main':
CheckFunctionExists.c:(.text+0x10): undefined reference to `arc4random'
collect2: error: ld returned 1 exit status
CMakeFiles/cmTC_c6e82.dir/build.make:97: recipe for target 'cmTC_c6e82' failed
make[2]: *** [cmTC_c6e82] Error 1
make[2]: Leaving directory '/home/buildbot/builder/monero-static-ubuntu-amd64/build/build/release/CMakeFiles/CMakeTmp'
Makefile:126: recipe for target 'cmTC_c6e82/fast' failed
make[1]: *** [cmTC_c6e82/fast] Error 2
make[1]: Leaving directory '/home/buildbot/builder/monero-static-ubuntu-amd64/build/build/release/CMakeFiles/CMakeTmp'


Determining if the function arc4random_uniform exists failed with the following output:
Change Dir: /home/buildbot/builder/monero-static-ubuntu-amd64/build/build/release/CMakeFiles/CMakeTmp

Run Build Command:"/usr/bin/make" "cmTC_8b589/fast"
make[1]: Entering directory '/home/buildbot/builder/monero-static-ubuntu-amd64/build/build/release/CMakeFiles/CMakeTmp'
/usr/bin/make -f CMakeFiles/cmTC_8b589.dir/build.make CMakeFiles/cmTC_8b589.dir/build
make[2]: Entering directory '/home/buildbot/builder/monero-static-ubuntu-amd64/build/build/release/CMakeFiles/CMakeTmp'
Building C object CMakeFiles/cmTC_8b589.dir/CheckFunctionExists.c.o
/usr/bin/cc   -pthread -DCHECK_FUNCTION_EXISTS=arc4random_uniform   -o CMakeFiles/cmTC_8b589.dir/CheckFunctionExists.c.o   -c /usr/share/cmake-3.10/Modules/CheckFunctionExists.c
Linking C executable cmTC_8b589
/usr/bin/cmake -E cmake_link_script CMakeFiles/cmTC_8b589.dir/link.txt --verbose=1
/usr/bin/cc  -pthread -DCHECK_FUNCTION_EXISTS=arc4random_uniform    -rdynamic CMakeFiles/cmTC_8b589.dir/CheckFunctionExists.c.o  -o cmTC_8b589 
CMakeFiles/cmTC_8b589.dir/CheckFunctionExists.c.o: In function `main':
CheckFunctionExists.c:(.text+0x10): undefined reference to `arc4random_uniform'
collect2: error: ld returned 1 exit status
CMakeFiles/cmTC_8b589.dir/build.make:97: recipe for target 'cmTC_8b589' failed
make[2]: *** [cmTC_8b589] Error 1
make[2]: Leaving directory '/home/buildbot/builder/monero-static-ubuntu-amd64/build/build/release/CMakeFiles/CMakeTmp'
Makefile:126: recipe for target 'cmTC_8b589/fast' failed
make[1]: *** [cmTC_8b589/fast] Error 2
make[1]: Leaving directory '/home/buildbot/builder/monero-static-ubuntu-amd64/build/build/release/CMakeFiles/CMakeTmp'


Determining if the function ioctlsocket exists failed with the following output:
Change Dir: /home/buildbot/builder/monero-static-ubuntu-amd64/build/build/release/CMakeFiles/CMakeTmp

Run Build Command:"/usr/bin/make" "cmTC_10935/fast"
make[1]: Entering directory '/home/buildbot/builder/monero-static-ubuntu-amd64/build/build/release/CMakeFiles/CMakeTmp'
/usr/bin/make -f CMakeFiles/cmTC_10935.dir/build.make CMakeFiles/cmTC_10935.dir/build
make[2]: Entering directory '/home/buildbot/builder/monero-static-ubuntu-amd64/build/build/release/CMakeFiles/CMakeTmp'
Building C object CMakeFiles/cmTC_10935.dir/CheckFunctionExists.c.o
/usr/bin/cc   -pthread -DCHECK_FUNCTION_EXISTS=ioctlsocket   -o CMakeFiles/cmTC_10935.dir/CheckFunctionExists.c.o   -c /usr/share/cmake-3.10/Modules/CheckFunctionExists.c
Linking C executable cmTC_10935
/usr/bin/cmake -E cmake_link_script CMakeFiles/cmTC_10935.dir/link.txt --verbose=1
/usr/bin/cc  -pthread -DCHECK_FUNCTION_EXISTS=ioctlsocket    -rdynamic CMakeFiles/cmTC_10935.dir/CheckFunctionExists.c.o  -o cmTC_10935 
CMakeFiles/cmTC_10935.dir/CheckFunctionExists.c.o: In function `main':
CheckFunctionExists.c:(.text+0x10): undefined reference to `ioctlsocket'
collect2: error: ld returned 1 exit status
CMakeFiles/cmTC_10935.dir/build.make:97: recipe for target 'cmTC_10935' failed
make[2]: *** [cmTC_10935] Error 1
make[2]: Leaving directory '/home/buildbot/builder/monero-static-ubuntu-amd64/build/build/release/CMakeFiles/CMakeTmp'
Makefile:126: recipe for target 'cmTC_10935/fast' failed
make[1]: *** [cmTC_10935/fast] Error 2
make[1]: Leaving directory '/home/buildbot/builder/monero-static-ubuntu-amd64/build/build/release/CMakeFiles/CMakeTmp'


Determining if the function setusercontent exists failed with the following output:
Change Dir: /home/buildbot/builder/monero-static-ubuntu-amd64/build/build/release/CMakeFiles/CMakeTmp

Run Build Command:"/usr/bin/make" "cmTC_2b293/fast"
make[1]: Entering directory '/home/buildbot/builder/monero-static-ubuntu-amd64/build/build/release/CMakeFiles/CMakeTmp'
/usr/bin/make -f CMakeFiles/cmTC_2b293.dir/build.make CMakeFiles/cmTC_2b293.dir/build
make[2]: Entering directory '/home/buildbot/builder/monero-static-ubuntu-amd64/build/build/release/CMakeFiles/CMakeTmp'
Building C object CMakeFiles/cmTC_2b293.dir/CheckFunctionExists.c.o
/usr/bin/cc   -pthread -DCHECK_FUNCTION_EXISTS=setusercontent   -o CMakeFiles/cmTC_2b293.dir/CheckFunctionExists.c.o   -c /usr/share/cmake-3.10/Modules/CheckFunctionExists.c
Linking C executable cmTC_2b293
/usr/bin/cmake -E cmake_link_script CMakeFiles/cmTC_2b293.dir/link.txt --verbose=1
/usr/bin/cc  -pthread -DCHECK_FUNCTION_EXISTS=setusercontent    -rdynamic CMakeFiles/cmTC_2b293.dir/CheckFunctionExists.c.o  -o cmTC_2b293 
CMakeFiles/cmTC_2b293.dir/CheckFunctionExists.c.o: In function `main':
CheckFunctionExists.c:(.text+0x10): undefined reference to `setusercontent'
collect2: error: ld returned 1 exit status
CMakeFiles/cmTC_2b293.dir/build.make:97: recipe for target 'cmTC_2b293' failed
make[2]: *** [cmTC_2b293] Error 1
make[2]: Leaving directory '/home/buildbot/builder/monero-static-ubuntu-amd64/build/build/release/CMakeFiles/CMakeTmp'
Makefile:126: recipe for target 'cmTC_2b293/fast' failed
make[1]: *** [cmTC_2b293/fast] Error 2
make[1]: Leaving directory '/home/buildbot/builder/monero-static-ubuntu-amd64/build/build/release/CMakeFiles/CMakeTmp'


Determining if the function strlcat exists failed with the following output:
Change Dir: /home/buildbot/builder/monero-static-ubuntu-amd64/build/build/release/CMakeFiles/CMakeTmp

Run Build Command:"/usr/bin/make" "cmTC_983ce/fast"
make[1]: Entering directory '/home/buildbot/builder/monero-static-ubuntu-amd64/build/build/release/CMakeFiles/CMakeTmp'
/usr/bin/make -f CMakeFiles/cmTC_983ce.dir/build.make CMakeFiles/cmTC_983ce.dir/build
make[2]: Entering directory '/home/buildbot/builder/monero-static-ubuntu-amd64/build/build/release/CMakeFiles/CMakeTmp'
Building C object CMakeFiles/cmTC_983ce.dir/CheckFunctionExists.c.o
/usr/bin/cc   -pthread -DCHECK_FUNCTION_EXISTS=strlcat   -o CMakeFiles/cmTC_983ce.dir/CheckFunctionExists.c.o   -c /usr/share/cmake-3.10/Modules/CheckFunctionExists.c
Linking C executable cmTC_983ce
/usr/bin/cmake -E cmake_link_script CMakeFiles/cmTC_983ce.dir/link.txt --verbose=1
/usr/bin/cc  -pthread -DCHECK_FUNCTION_EXISTS=strlcat    -rdynamic CMakeFiles/cmTC_983ce.dir/CheckFunctionExists.c.o  -o cmTC_983ce 
CMakeFiles/cmTC_983ce.dir/CheckFunctionExists.c.o: In function `main':
CheckFunctionExists.c:(.text+0x10): undefined reference to `strlcat'
collect2: error: ld returned 1 exit status
CMakeFiles/cmTC_983ce.dir/build.make:97: recipe for target 'cmTC_983ce' failed
make[2]: *** [cmTC_983ce] Error 1
make[2]: Leaving directory '/home/buildbot/builder/monero-static-ubuntu-amd64/build/build/release/CMakeFiles/CMakeTmp'
Makefile:126: recipe for target 'cmTC_983ce/fast' failed
make[1]: *** [cmTC_983ce/fast] Error 2
make[1]: Leaving directory '/home/buildbot/builder/monero-static-ubuntu-amd64/build/build/release/CMakeFiles/CMakeTmp'


Determining if the function strlcpy exists failed with the following output:
Change Dir: /home/buildbot/builder/monero-static-ubuntu-amd64/build/build/release/CMakeFiles/CMakeTmp

Run Build Command:"/usr/bin/make" "cmTC_f3987/fast"
make[1]: Entering directory '/home/buildbot/builder/monero-static-ubuntu-amd64/build/build/release/CMakeFiles/CMakeTmp'
/usr/bin/make -f CMakeFiles/cmTC_f3987.dir/build.make CMakeFiles/cmTC_f3987.dir/build
make[2]: Entering directory '/home/buildbot/builder/monero-static-ubuntu-amd64/build/build/release/CMakeFiles/CMakeTmp'
Building C object CMakeFiles/cmTC_f3987.dir/CheckFunctionExists.c.o
/usr/bin/cc   -pthread -DCHECK_FUNCTION_EXISTS=strlcpy   -o CMakeFiles/cmTC_f3987.dir/CheckFunctionExists.c.o   -c /usr/share/cmake-3.10/Modules/CheckFunctionExists.c
Linking C executable cmTC_f3987
/usr/bin/cmake -E cmake_link_script CMakeFiles/cmTC_f3987.dir/link.txt --verbose=1
/usr/bin/cc  -pthread -DCHECK_FUNCTION_EXISTS=strlcpy    -rdynamic CMakeFiles/cmTC_f3987.dir/CheckFunctionExists.c.o  -o cmTC_f3987 
CMakeFiles/cmTC_f3987.dir/CheckFunctionExists.c.o: In function `main':
CheckFunctionExists.c:(.text+0x10): undefined reference to `strlcpy'
collect2: error: ld returned 1 exit status
CMakeFiles/cmTC_f3987.dir/build.make:97: recipe for target 'cmTC_f3987' failed
make[2]: *** [cmTC_f3987] Error 1
make[2]: Leaving directory '/home/buildbot/builder/monero-static-ubuntu-amd64/build/build/release/CMakeFiles/CMakeTmp'
Makefile:126: recipe for target 'cmTC_f3987/fast' failed
make[1]: *** [cmTC_f3987/fast] Error 2
make[1]: Leaving directory '/home/buildbot/builder/monero-static-ubuntu-amd64/build/build/release/CMakeFiles/CMakeTmp'


Determining if the PTHREAD_PRIO_INHERIT exist failed with the following output:
Change Dir: /home/buildbot/builder/monero-static-ubuntu-amd64/build/build/release/CMakeFiles/CMakeTmp

Run Build Command:"/usr/bin/make" "cmTC_e3956/fast"
make[1]: Entering directory '/home/buildbot/builder/monero-static-ubuntu-amd64/build/build/release/CMakeFiles/CMakeTmp'
/usr/bin/make -f CMakeFiles/cmTC_e3956.dir/build.make CMakeFiles/cmTC_e3956.dir/build
make[2]: Entering directory '/home/buildbot/builder/monero-static-ubuntu-amd64/build/build/release/CMakeFiles/CMakeTmp'
Building C object CMakeFiles/cmTC_e3956.dir/CheckSymbolExists.c.o
/usr/bin/cc   -pthread    -o CMakeFiles/cmTC_e3956.dir/CheckSymbolExists.c.o   -c /home/buildbot/builder/monero-static-ubuntu-amd64/build/build/release/CMakeFiles/CMakeTmp/CheckSymbolExists.c
/home/buildbot/builder/monero-static-ubuntu-amd64/build/build/release/CMakeFiles/CMakeTmp/CheckSymbolExists.c: In function 'main':
/home/buildbot/builder/monero-static-ubuntu-amd64/build/build/release/CMakeFiles/CMakeTmp/CheckSymbolExists.c:8:18: error: lvalue required as unary '&' operand
   return ((int*)(&PTHREAD_PRIO_INHERIT))[argc];
                  ^
CMakeFiles/cmTC_e3956.dir/build.make:65: recipe for target 'CMakeFiles/cmTC_e3956.dir/CheckSymbolExists.c.o' failed
make[2]: *** [CMakeFiles/cmTC_e3956.dir/CheckSymbolExists.c.o] Error 1
make[2]: Leaving directory '/home/buildbot/builder/monero-static-ubuntu-amd64/build/build/release/CMakeFiles/CMakeTmp'
Makefile:126: recipe for target 'cmTC_e3956/fast' failed
make[1]: *** [cmTC_e3956/fast] Error 2
make[1]: Leaving directory '/home/buildbot/builder/monero-static-ubuntu-amd64/build/build/release/CMakeFiles/CMakeTmp'

File /home/buildbot/builder/monero-static-ubuntu-amd64/build/build/release/CMakeFiles/CMakeTmp/CheckSymbolExists.c:
/* */
#include <pthread.h>

int main(int argc, char** argv)
{
  (void)argv;
#ifndef PTHREAD_PRIO_INHERIT
  return ((int*)(&PTHREAD_PRIO_INHERIT))[argc];
#else
  (void)argc;
  return 0;
#endif
}

Determining if the pthread_rwlock_t exist failed with the following output:
Change Dir: /home/buildbot/builder/monero-static-ubuntu-amd64/build/build/release/CMakeFiles/CMakeTmp

Run Build Command:"/usr/bin/make" "cmTC_09190/fast"
make[1]: Entering directory '/home/buildbot/builder/monero-static-ubuntu-amd64/build/build/release/CMakeFiles/CMakeTmp'
/usr/bin/make -f CMakeFiles/cmTC_09190.dir/build.make CMakeFiles/cmTC_09190.dir/build
make[2]: Entering directory '/home/buildbot/builder/monero-static-ubuntu-amd64/build/build/release/CMakeFiles/CMakeTmp'
Building C object CMakeFiles/cmTC_09190.dir/CheckSymbolExists.c.o
/usr/bin/cc   -pthread    -o CMakeFiles/cmTC_09190.dir/CheckSymbolExists.c.o   -c /home/buildbot/builder/monero-static-ubuntu-amd64/build/build/release/CMakeFiles/CMakeTmp/CheckSymbolExists.c
/home/buildbot/builder/monero-static-ubuntu-amd64/build/build/release/CMakeFiles/CMakeTmp/CheckSymbolExists.c: In function 'main':
/home/buildbot/builder/monero-static-ubuntu-amd64/build/build/release/CMakeFiles/CMakeTmp/CheckSymbolExists.c:8:19: error: expected expression before 'pthread_rwlock_t'
   return ((int*)(&pthread_rwlock_t))[argc];
                   ^~~~~~~~~~~~~~~~
CMakeFiles/cmTC_09190.dir/build.make:65: recipe for target 'CMakeFiles/cmTC_09190.dir/CheckSymbolExists.c.o' failed
make[2]: *** [CMakeFiles/cmTC_09190.dir/CheckSymbolExists.c.o] Error 1
make[2]: Leaving directory '/home/buildbot/builder/monero-static-ubuntu-amd64/build/build/release/CMakeFiles/CMakeTmp'
Makefile:126: recipe for target 'cmTC_09190/fast' failed
make[1]: *** [cmTC_09190/fast] Error 2
make[1]: Leaving directory '/home/buildbot/builder/monero-static-ubuntu-amd64/build/build/release/CMakeFiles/CMakeTmp'

File /home/buildbot/builder/monero-static-ubuntu-amd64/build/build/release/CMakeFiles/CMakeTmp/CheckSymbolExists.c:
/* */
#include <pthread.h>

int main(int argc, char** argv)
{
  (void)argv;
#ifndef pthread_rwlock_t
  return ((int*)(&pthread_rwlock_t))[argc];
#else
  (void)argc;
  return 0;
#endif
}

Determining if the pthread_spinlock_t exist failed with the following output:
Change Dir: /home/buildbot/builder/monero-static-ubuntu-amd64/build/build/release/CMakeFiles/CMakeTmp

Run Build Command:"/usr/bin/make" "cmTC_59a2e/fast"
make[1]: Entering directory '/home/buildbot/builder/monero-static-ubuntu-amd64/build/build/release/CMakeFiles/CMakeTmp'
/usr/bin/make -f CMakeFiles/cmTC_59a2e.dir/build.make CMakeFiles/cmTC_59a2e.dir/build
make[2]: Entering directory '/home/buildbot/builder/monero-static-ubuntu-amd64/build/build/release/CMakeFiles/CMakeTmp'
Building C object CMakeFiles/cmTC_59a2e.dir/CheckSymbolExists.c.o
/usr/bin/cc   -pthread    -o CMakeFiles/cmTC_59a2e.dir/CheckSymbolExists.c.o   -c /home/buildbot/builder/monero-static-ubuntu-amd64/build/build/release/CMakeFiles/CMakeTmp/CheckSymbolExists.c
/home/buildbot/builder/monero-static-ubuntu-amd64/build/build/release/CMakeFiles/CMakeTmp/CheckSymbolExists.c: In function 'main':
/home/buildbot/builder/monero-static-ubuntu-amd64/build/build/release/CMakeFiles/CMakeTmp/CheckSymbolExists.c:8:19: error: expected expression before 'pthread_spinlock_t'
   return ((int*)(&pthread_spinlock_t))[argc];
                   ^~~~~~~~~~~~~~~~~~
CMakeFiles/cmTC_59a2e.dir/build.make:65: recipe for target 'CMakeFiles/cmTC_59a2e.dir/CheckSymbolExists.c.o' failed
make[2]: *** [CMakeFiles/cmTC_59a2e.dir/CheckSymbolExists.c.o] Error 1
make[2]: Leaving directory '/home/buildbot/builder/monero-static-ubuntu-amd64/build/build/release/CMakeFiles/CMakeTmp'
Makefile:126: recipe for target 'cmTC_59a2e/fast' failed
make[1]: *** [cmTC_59a2e/fast] Error 2
make[1]: Leaving directory '/home/buildbot/builder/monero-static-ubuntu-amd64/build/build/release/CMakeFiles/CMakeTmp'

File /home/buildbot/builder/monero-static-ubuntu-amd64/build/build/release/CMakeFiles/CMakeTmp/CheckSymbolExists.c:
/* */
#include <pthread.h>

int main(int argc, char** argv)
{
  (void)argv;
#ifndef pthread_spinlock_t
  return ((int*)(&pthread_spinlock_t))[argc];
#else
  (void)argc;
  return 0;
#endif
}

Determining if the LIBRESSL_VERSION_TEXT exist failed with the following output:
Change Dir: /home/buildbot/builder/monero-static-ubuntu-amd64/build/build/release/CMakeFiles/CMakeTmp

Run Build Command:"/usr/bin/make" "cmTC_55c7f/fast"
make[1]: Entering directory '/home/buildbot/builder/monero-static-ubuntu-amd64/build/build/release/CMakeFiles/CMakeTmp'
/usr/bin/make -f CMakeFiles/cmTC_55c7f.dir/build.make CMakeFiles/cmTC_55c7f.dir/build
make[2]: Entering directory '/home/buildbot/builder/monero-static-ubuntu-amd64/build/build/release/CMakeFiles/CMakeTmp'
Building C object CMakeFiles/cmTC_55c7f.dir/CheckSymbolExists.c.o
/usr/bin/cc   -pthread    -o CMakeFiles/cmTC_55c7f.dir/CheckSymbolExists.c.o   -c /home/buildbot/builder/monero-static-ubuntu-amd64/build/build/release/CMakeFiles/CMakeTmp/CheckSymbolExists.c
/home/buildbot/builder/monero-static-ubuntu-amd64/build/build/release/CMakeFiles/CMakeTmp/CheckSymbolExists.c: In function 'main':
/home/buildbot/builder/monero-static-ubuntu-amd64/build/build/release/CMakeFiles/CMakeTmp/CheckSymbolExists.c:8:19: error: 'LIBRESSL_VERSION_TEXT' undeclared (first use in this function); did you mean 'OPENSSL_VERSION_TEXT'?
   return ((int*)(&LIBRESSL_VERSION_TEXT))[argc];
                   ^~~~~~~~~~~~~~~~~~~~~
                   OPENSSL_VERSION_TEXT
/home/buildbot/builder/monero-static-ubuntu-amd64/build/build/release/CMakeFiles/CMakeTmp/CheckSymbolExists.c:8:19: note: each undeclared identifier is reported only once for each function it appears in
CMakeFiles/cmTC_55c7f.dir/build.make:65: recipe for target 'CMakeFiles/cmTC_55c7f.dir/CheckSymbolExists.c.o' failed
make[2]: *** [CMakeFiles/cmTC_55c7f.dir/CheckSymbolExists.c.o] Error 1
make[2]: Leaving directory '/home/buildbot/builder/monero-static-ubuntu-amd64/build/build/release/CMakeFiles/CMakeTmp'
Makefile:126: recipe for target 'cmTC_55c7f/fast' failed
make[1]: *** [cmTC_55c7f/fast] Error 2
make[1]: Leaving directory '/home/buildbot/builder/monero-static-ubuntu-amd64/build/build/release/CMakeFiles/CMakeTmp'

File /home/buildbot/builder/monero-static-ubuntu-amd64/build/build/release/CMakeFiles/CMakeTmp/CheckSymbolExists.c:
/* */
#include <openssl/opensslv.h>

int main(int argc, char** argv)
{
  (void)argv;
#ifndef LIBRESSL_VERSION_TEXT
  return ((int*)(&LIBRESSL_VERSION_TEXT))[argc];
#else
  (void)argc;
  return 0;
#endif
}

Performing C SOURCE FILE Test _fcf_protection=full_c failed with the following output:
Change Dir: /home/buildbot/builder/monero-static-ubuntu-amd64/build/build/release/CMakeFiles/CMakeTmp

Run Build Command:"/usr/bin/make" "cmTC_f2b5e/fast"
make[1]: Entering directory '/home/buildbot/builder/monero-static-ubuntu-amd64/build/build/release/CMakeFiles/CMakeTmp'
/usr/bin/make -f CMakeFiles/cmTC_f2b5e.dir/build.make CMakeFiles/cmTC_f2b5e.dir/build
make[2]: Entering directory '/home/buildbot/builder/monero-static-ubuntu-amd64/build/build/release/CMakeFiles/CMakeTmp'
Building C object CMakeFiles/cmTC_f2b5e.dir/src.c.o
/usr/bin/cc   -pthread -maes -march=x86-64 -fno-strict-aliasing -D_fcf_protection=full_c   -fcf-protection=full -o CMakeFiles/cmTC_f2b5e.dir/src.c.o   -c /home/buildbot/builder/monero-static-ubuntu-amd64/build/build/release/CMakeFiles/CMakeTmp/src.c
cc: error: unrecognized command line option '-fcf-protection=full'; did you mean '-fstack-protector-all'?
CMakeFiles/cmTC_f2b5e.dir/build.make:65: recipe for target 'CMakeFiles/cmTC_f2b5e.dir/src.c.o' failed
make[2]: *** [CMakeFiles/cmTC_f2b5e.dir/src.c.o] Error 1
make[2]: Leaving directory '/home/buildbot/builder/monero-static-ubuntu-amd64/build/build/release/CMakeFiles/CMakeTmp'
Makefile:126: recipe for target 'cmTC_f2b5e/fast' failed
make[1]: *** [cmTC_f2b5e/fast] Error 2
make[1]: Leaving directory '/home/buildbot/builder/monero-static-ubuntu-amd64/build/build/release/CMakeFiles/CMakeTmp'

Source file was:
int main(void) { return 0; }
Performing C++ SOURCE FILE Test _fcf_protection=full_cxx failed with the following output:
Change Dir: /home/buildbot/builder/monero-static-ubuntu-amd64/build/build/release/CMakeFiles/CMakeTmp

Run Build Command:"/usr/bin/make" "cmTC_8e5c4/fast"
make[1]: Entering directory '/home/buildbot/builder/monero-static-ubuntu-amd64/build/build/release/CMakeFiles/CMakeTmp'
/usr/bin/make -f CMakeFiles/cmTC_8e5c4.dir/build.make CMakeFiles/cmTC_8e5c4.dir/build
make[2]: Entering directory '/home/buildbot/builder/monero-static-ubuntu-amd64/build/build/release/CMakeFiles/CMakeTmp'
Building CXX object CMakeFiles/cmTC_8e5c4.dir/src.cxx.o
/usr/bin/c++    -DZMQ_STATIC -pthread -maes -march=x86-64 -fno-strict-aliasing -D_fcf_protection=full_cxx   -fcf-protection=full -o CMakeFiles/cmTC_8e5c4.dir/src.cxx.o -c /home/buildbot/builder/monero-static-ubuntu-amd64/build/build/release/CMakeFiles/CMakeTmp/src.cxx
c++: error: unrecognized command line option '-fcf-protection=full'; did you mean '-fstack-protector-all'?
CMakeFiles/cmTC_8e5c4.dir/build.make:65: recipe for target 'CMakeFiles/cmTC_8e5c4.dir/src.cxx.o' failed
make[2]: *** [CMakeFiles/cmTC_8e5c4.dir/src.cxx.o] Error 1
make[2]: Leaving directory '/home/buildbot/builder/monero-static-ubuntu-amd64/build/build/release/CMakeFiles/CMakeTmp'
Makefile:126: recipe for target 'cmTC_8e5c4/fast' failed
make[1]: *** [cmTC_8e5c4/fast] Error 2
make[1]: Leaving directory '/home/buildbot/builder/monero-static-ubuntu-amd64/build/build/release/CMakeFiles/CMakeTmp'

Source file was:
int main() { return 0; }
Performing C SOURCE FILE Test _fstack_clash_protection_c failed with the following output:
Change Dir: /home/buildbot/builder/monero-static-ubuntu-amd64/build/build/release/CMakeFiles/CMakeTmp

Run Build Command:"/usr/bin/make" "cmTC_7e2b7/fast"
make[1]: Entering directory '/home/buildbot/builder/monero-static-ubuntu-amd64/build/build/release/CMakeFiles/CMakeTmp'
/usr/bin/make -f CMakeFiles/cmTC_7e2b7.dir/build.make CMakeFiles/cmTC_7e2b7.dir/build
make[2]: Entering directory '/home/buildbot/builder/monero-static-ubuntu-amd64/build/build/release/CMakeFiles/CMakeTmp'
Building C object CMakeFiles/cmTC_7e2b7.dir/src.c.o
/usr/bin/cc   -pthread -maes -march=x86-64 -fno-strict-aliasing -D_fstack_clash_protection_c   -fstack-clash-protection -o CMakeFiles/cmTC_7e2b7.dir/src.c.o   -c /home/buildbot/builder/monero-static-ubuntu-amd64/build/build/release/CMakeFiles/CMakeTmp/src.c
cc: error: unrecognized command line option '-fstack-clash-protection'; did you mean '-fstack-protector'?
CMakeFiles/cmTC_7e2b7.dir/build.make:65: recipe for target 'CMakeFiles/cmTC_7e2b7.dir/src.c.o' failed
make[2]: *** [CMakeFiles/cmTC_7e2b7.dir/src.c.o] Error 1
make[2]: Leaving directory '/home/buildbot/builder/monero-static-ubuntu-amd64/build/build/release/CMakeFiles/CMakeTmp'
Makefile:126: recipe for target 'cmTC_7e2b7/fast' failed
make[1]: *** [cmTC_7e2b7/fast] Error 2
make[1]: Leaving directory '/home/buildbot/builder/monero-static-ubuntu-amd64/build/build/release/CMakeFiles/CMakeTmp'

Source file was:
int main(void) { return 0; }
Performing C++ SOURCE FILE Test _fstack_clash_protection_cxx failed with the following output:
Change Dir: /home/buildbot/builder/monero-static-ubuntu-amd64/build/build/release/CMakeFiles/CMakeTmp

Run Build Command:"/usr/bin/make" "cmTC_18c34/fast"
make[1]: Entering directory '/home/buildbot/builder/monero-static-ubuntu-amd64/build/build/release/CMakeFiles/CMakeTmp'
/usr/bin/make -f CMakeFiles/cmTC_18c34.dir/build.make CMakeFiles/cmTC_18c34.dir/build
make[2]: Entering directory '/home/buildbot/builder/monero-static-ubuntu-amd64/build/build/release/CMakeFiles/CMakeTmp'
Building CXX object CMakeFiles/cmTC_18c34.dir/src.cxx.o
/usr/bin/c++    -DZMQ_STATIC -pthread -maes -march=x86-64 -fno-strict-aliasing -D_fstack_clash_protection_cxx   -fstack-clash-protection -o CMakeFiles/cmTC_18c34.dir/src.cxx.o -c /home/buildbot/builder/monero-static-ubuntu-amd64/build/build/release/CMakeFiles/CMakeTmp/src.cxx
c++: error: unrecognized command line option '-fstack-clash-protection'; did you mean '-fstack-protector'?
CMakeFiles/cmTC_18c34.dir/build.make:65: recipe for target 'CMakeFiles/cmTC_18c34.dir/src.cxx.o' failed
make[2]: *** [CMakeFiles/cmTC_18c34.dir/src.cxx.o] Error 1
make[2]: Leaving directory '/home/buildbot/builder/monero-static-ubuntu-amd64/build/build/release/CMakeFiles/CMakeTmp'
Makefile:126: recipe for target 'cmTC_18c34/fast' failed
make[1]: *** [cmTC_18c34/fast] Error 2
make[1]: Leaving directory '/home/buildbot/builder/monero-static-ubuntu-amd64/build/build/release/CMakeFiles/CMakeTmp'

Source file was:
int main() { return 0; }
Determining if the -Wl,-z,noexecheap linker flag is supported failed with the following output:
Change Dir: /home/buildbot/builder/monero-static-ubuntu-amd64/build/build/release/CMakeFiles/CMakeTmp

Run Build Command:"/usr/bin/make" "cmTC_bc7ed/fast"
make[1]: Entering directory '/home/buildbot/builder/monero-static-ubuntu-amd64/build/build/release/CMakeFiles/CMakeTmp'
/usr/bin/make -f CMakeFiles/cmTC_bc7ed.dir/build.make CMakeFiles/cmTC_bc7ed.dir/build
make[2]: Entering directory '/home/buildbot/builder/monero-static-ubuntu-amd64/build/build/release/CMakeFiles/CMakeTmp'
Building C object CMakeFiles/cmTC_bc7ed.dir/CheckLinkerFlag.c.o
/usr/bin/cc   -Wl,-z,noexecheap    -Wl,-z,noexecheap -o CMakeFiles/cmTC_bc7ed.dir/CheckLinkerFlag.c.o   -c /home/buildbot/builder/monero-static-ubuntu-amd64/build/cmake/CheckLinkerFlag.c
Linking C executable cmTC_bc7ed
/usr/bin/cmake -E cmake_link_script CMakeFiles/cmTC_bc7ed.dir/link.txt --verbose=1
/usr/bin/cc -Wl,-z,noexecheap     -rdynamic CMakeFiles/cmTC_bc7ed.dir/CheckLinkerFlag.c.o  -o cmTC_bc7ed 
/usr/bin/ld: warning: -z noexecheap ignored.
make[2]: Leaving directory '/home/buildbot/builder/monero-static-ubuntu-amd64/build/build/release/CMakeFiles/CMakeTmp'
make[1]: Leaving directory '/home/buildbot/builder/monero-static-ubuntu-amd64/build/build/release/CMakeFiles/CMakeTmp'


Determining if the function rl_copy_text exists failed with the following output:
Change Dir: /home/buildbot/builder/monero-static-ubuntu-amd64/build/build/release/CMakeFiles/CMakeTmp

Run Build Command:"/usr/bin/make" "cmTC_ee8c5/fast"
make[1]: Entering directory '/home/buildbot/builder/monero-static-ubuntu-amd64/build/build/release/CMakeFiles/CMakeTmp'
/usr/bin/make -f CMakeFiles/cmTC_ee8c5.dir/build.make CMakeFiles/cmTC_ee8c5.dir/build
make[2]: Entering directory '/home/buildbot/builder/monero-static-ubuntu-amd64/build/build/release/CMakeFiles/CMakeTmp'
Building C object CMakeFiles/cmTC_ee8c5.dir/CheckFunctionExists.c.o
/usr/bin/cc   -pthread -maes -march=x86-64 -fno-strict-aliasing -std=c11 -D_GNU_SOURCE   -Wall -Wextra -Wpointer-arith -Wundef -Wvla -Wwrite-strings -Wno-error=extra -Wno-error=deprecated-declarations -Wno-unused-parameter -Wno-unused-variable -Wno-error=unused-variable -Wno-error=undef -Wno-error=uninitialized -Wlogical-op -Wno-error=maybe-uninitialized -Wno-error=cpp -Waggregate-return -Wnested-externs -Wold-style-definition -Wstrict-prototypes  -fPIC  -Wformat -Wformat-security -fstack-protector -fstack-protector-strong -mmitigate-rop -fno-strict-aliasing -DCHECK_FUNCTION_EXISTS=rl_copy_text   -o CMakeFiles/cmTC_ee8c5.dir/CheckFunctionExists.c.o   -c /usr/share/cmake-3.10/Modules/CheckFunctionExists.c
Linking C executable cmTC_ee8c5
/usr/bin/cmake -E cmake_link_script CMakeFiles/cmTC_ee8c5.dir/link.txt --verbose=1
/usr/bin/cc  -pthread -maes -march=x86-64 -fno-strict-aliasing -std=c11 -D_GNU_SOURCE   -Wall -Wextra -Wpointer-arith -Wundef -Wvla -Wwrite-strings -Wno-error=extra -Wno-error=deprecated-declarations -Wno-unused-parameter -Wno-unused-variable -Wno-error=unused-variable -Wno-error=undef -Wno-error=uninitialized -Wlogical-op -Wno-error=maybe-uninitialized -Wno-error=cpp -Waggregate-return -Wnested-externs -Wold-style-definition -Wstrict-prototypes  -fPIC  -Wformat -Wformat-security -fstack-protector -fstack-protector-strong -mmitigate-rop -fno-strict-aliasing -DCHECK_FUNCTION_EXISTS=rl_copy_text    -rdynamic CMakeFiles/cmTC_ee8c5.dir/CheckFunctionExists.c.o  -o cmTC_ee8c5 /usr/lib/x86_64-linux-gnu/libreadline.a 
/usr/lib/x86_64-linux-gnu/libreadline.a(terminal.o): In function `_rl_get_screen_size':
(.text+0x186): undefined reference to `tgetnum'
(.text+0x2be): undefined reference to `tgetnum'
/usr/lib/x86_64-linux-gnu/libreadline.a(terminal.o): In function `_rl_init_terminal_io':
(.text+0x678): undefined reference to `PC'
(.text+0x687): undefined reference to `BC'
(.text+0x68e): undefined reference to `UP'
(.text+0x728): undefined reference to `tgetent'
(.text+0x76f): undefined reference to `tgetstr'
(.text+0x799): undefined reference to `PC'
(.text+0x7af): undefined reference to `BC'
(.text+0x7bd): undefined reference to `UP'
(.text+0x7cf): undefined reference to `tgetflag'
(.text+0x81e): undefined reference to `tgetflag'
(.text+0x938): undefined reference to `tgetflag'
/usr/lib/x86_64-linux-gnu/libreadline.a(terminal.o): In function `_rl_backspace':
(.text+0xb4b): undefined reference to `tputs'
/usr/lib/x86_64-linux-gnu/libreadline.a(terminal.o): In function `rl_ding':
(.text+0xc1d): undefined reference to `tputs'
/usr/lib/x86_64-linux-gnu/libreadline.a(terminal.o): In function `_rl_enable_meta_key':
(.text+0xc67): undefined reference to `tputs'
/usr/lib/x86_64-linux-gnu/libreadline.a(terminal.o): In function `_rl_disable_meta_key':
(.text+0xcc9): undefined reference to `tputs'
/usr/lib/x86_64-linux-gnu/libreadline.a(terminal.o): In function `_rl_control_keypad':
(.text+0xcfd): undefined reference to `tputs'
/usr/lib/x86_64-linux-gnu/libreadline.a(terminal.o):(.text+0xd50): more undefined references to `tputs' follow
/usr/lib/x86_64-linux-gnu/libreadline.a(display.o): In function `update_line':
(.text+0x301f): undefined reference to `tgoto'
(.text+0x3033): undefined reference to `tputs'
(.text+0x31cc): undefined reference to `tputs'
(.text+0x32bf): undefined reference to `tputs'
(.text+0x34b8): undefined reference to `tputs'
(.text+0x3513): undefined reference to `tputs'
(.text+0x3546): undefined reference to `tgoto'
(.text+0x3557): undefined reference to `tputs'
/usr/lib/x86_64-linux-gnu/libreadline.a(display.o): In function `rl_redisplay':
(.text+0x4591): undefined reference to `tputs'
(.text+0x50be): undefined reference to `tputs'
/usr/lib/x86_64-linux-gnu/libreadline.a(display.o): In function `rl_clear_visible_line':
(.text+0x5265): undefined reference to `tputs'
/usr/lib/x86_64-linux-gnu/libreadline.a(display.o): In function `_rl_redisplay_after_sigwinch':
(.text+0x53f1): undefined reference to `tputs'
/usr/lib/x86_64-linux-gnu/libreadline.a(display.o):(.text+0x5414): more undefined references to `tputs' follow
collect2: error: ld returned 1 exit status
CMakeFiles/cmTC_ee8c5.dir/build.make:98: recipe for target 'cmTC_ee8c5' failed
make[2]: *** [cmTC_ee8c5] Error 1
make[2]: Leaving directory '/home/buildbot/builder/monero-static-ubuntu-amd64/build/build/release/CMakeFiles/CMakeTmp'
Makefile:126: recipe for target 'cmTC_ee8c5/fast' failed
make[1]: *** [cmTC_ee8c5/fast] Error 2
make[1]: Leaving directory '/home/buildbot/builder/monero-static-ubuntu-amd64/build/build/release/CMakeFiles/CMakeTmp'


Determining if the function rl_filename_completion_function exists failed with the following output:
Change Dir: /home/buildbot/builder/monero-static-ubuntu-amd64/build/build/release/CMakeFiles/CMakeTmp

Run Build Command:"/usr/bin/make" "cmTC_be4de/fast"
make[1]: Entering directory '/home/buildbot/builder/monero-static-ubuntu-amd64/build/build/release/CMakeFiles/CMakeTmp'
/usr/bin/make -f CMakeFiles/cmTC_be4de.dir/build.make CMakeFiles/cmTC_be4de.dir/build
make[2]: Entering directory '/home/buildbot/builder/monero-static-ubuntu-amd64/build/build/release/CMakeFiles/CMakeTmp'
Building C object CMakeFiles/cmTC_be4de.dir/CheckFunctionExists.c.o
/usr/bin/cc   -pthread -maes -march=x86-64 -fno-strict-aliasing -std=c11 -D_GNU_SOURCE   -Wall -Wextra -Wpointer-arith -Wundef -Wvla -Wwrite-strings -Wno-error=extra -Wno-error=deprecated-declarations -Wno-unused-parameter -Wno-unused-variable -Wno-error=unused-variable -Wno-error=undef -Wno-error=uninitialized -Wlogical-op -Wno-error=maybe-uninitialized -Wno-error=cpp -Waggregate-return -Wnested-externs -Wold-style-definition -Wstrict-prototypes  -fPIC  -Wformat -Wformat-security -fstack-protector -fstack-protector-strong -mmitigate-rop -fno-strict-aliasing -DCHECK_FUNCTION_EXISTS=rl_filename_completion_function   -o CMakeFiles/cmTC_be4de.dir/CheckFunctionExists.c.o   -c /usr/share/cmake-3.10/Modules/CheckFunctionExists.c
Linking C executable cmTC_be4de
/usr/bin/cmake -E cmake_link_script CMakeFiles/cmTC_be4de.dir/link.txt --verbose=1
/usr/bin/cc  -pthread -maes -march=x86-64 -fno-strict-aliasing -std=c11 -D_GNU_SOURCE   -Wall -Wextra -Wpointer-arith -Wundef -Wvla -Wwrite-strings -Wno-error=extra -Wno-error=deprecated-declarations -Wno-unused-parameter -Wno-unused-variable -Wno-error=unused-variable -Wno-error=undef -Wno-error=uninitialized -Wlogical-op -Wno-error=maybe-uninitialized -Wno-error=cpp -Waggregate-return -Wnested-externs -Wold-style-definition -Wstrict-prototypes  -fPIC  -Wformat -Wformat-security -fstack-protector -fstack-protector-strong -mmitigate-rop -fno-strict-aliasing -DCHECK_FUNCTION_EXISTS=rl_filename_completion_function    -rdynamic CMakeFiles/cmTC_be4de.dir/CheckFunctionExists.c.o  -o cmTC_be4de /usr/lib/x86_64-linux-gnu/libreadline.a 
/usr/lib/x86_64-linux-gnu/libreadline.a(display.o): In function `_rl_move_cursor_relative':
(.text+0xf86): undefined reference to `tputs'
(.text+0xfec): undefined reference to `tputs'
(.text+0x11ac): undefined reference to `tputs'
/usr/lib/x86_64-linux-gnu/libreadline.a(display.o): In function `_rl_move_vert':
(.text+0x123d): undefined reference to `tputs'
(.text+0x12a3): undefined reference to `tputs'
/usr/lib/x86_64-linux-gnu/libreadline.a(display.o):(.text+0x2117): more undefined references to `tputs' follow
/usr/lib/x86_64-linux-gnu/libreadline.a(display.o): In function `update_line':
(.text+0x301f): undefined reference to `tgoto'
(.text+0x3033): undefined reference to `tputs'
(.text+0x31cc): undefined reference to `tputs'
(.text+0x32bf): undefined reference to `tputs'
(.text+0x34b8): undefined reference to `tputs'
(.text+0x3513): undefined reference to `tputs'
(.text+0x3546): undefined reference to `tgoto'
(.text+0x3557): undefined reference to `tputs'
/usr/lib/x86_64-linux-gnu/libreadline.a(display.o): In function `rl_redisplay':
(.text+0x4591): undefined reference to `tputs'
(.text+0x50be): undefined reference to `tputs'
/usr/lib/x86_64-linux-gnu/libreadline.a(display.o): In function `rl_clear_visible_line':
(.text+0x5265): undefined reference to `tputs'
/usr/lib/x86_64-linux-gnu/libreadline.a(display.o): In function `_rl_redisplay_after_sigwinch':
(.text+0x53f1): undefined reference to `tputs'
/usr/lib/x86_64-linux-gnu/libreadline.a(display.o):(.text+0x5414): more undefined references to `tputs' follow
/usr/lib/x86_64-linux-gnu/libreadline.a(terminal.o): In function `_rl_get_screen_size':
(.text+0x186): undefined reference to `tgetnum'
(.text+0x2be): undefined reference to `tgetnum'
/usr/lib/x86_64-linux-gnu/libreadline.a(terminal.o): In function `_rl_init_terminal_io':
(.text+0x678): undefined reference to `PC'
(.text+0x687): undefined reference to `BC'
(.text+0x68e): undefined reference to `UP'
(.text+0x728): undefined reference to `tgetent'
(.text+0x76f): undefined reference to `tgetstr'
(.text+0x799): undefined reference to `PC'
(.text+0x7af): undefined reference to `BC'
(.text+0x7bd): undefined reference to `UP'
(.text+0x7cf): undefined reference to `tgetflag'
(.text+0x81e): undefined reference to `tgetflag'
(.text+0x938): undefined reference to `tgetflag'
/usr/lib/x86_64-linux-gnu/libreadline.a(terminal.o): In function `_rl_backspace':
(.text+0xb4b): undefined reference to `tputs'
/usr/lib/x86_64-linux-gnu/libreadline.a(terminal.o): In function `rl_ding':
(.text+0xc1d): undefined reference to `tputs'
/usr/lib/x86_64-linux-gnu/libreadline.a(terminal.o): In function `_rl_enable_meta_key':
(.text+0xc67): undefined reference to `tputs'
/usr/lib/x86_64-linux-gnu/libreadline.a(terminal.o): In function `_rl_disable_meta_key':
(.text+0xcc9): undefined reference to `tputs'
/usr/lib/x86_64-linux-gnu/libreadline.a(terminal.o): In function `_rl_control_keypad':
(.text+0xcfd): undefined reference to `tputs'
/usr/lib/x86_64-linux-gnu/libreadline.a(terminal.o):(.text+0xd50): more undefined references to `tputs' follow
collect2: error: ld returned 1 exit status
CMakeFiles/cmTC_be4de.dir/build.make:98: recipe for target 'cmTC_be4de' failed
make[2]: *** [cmTC_be4de] Error 1
make[2]: Leaving directory '/home/buildbot/builder/monero-static-ubuntu-amd64/build/build/release/CMakeFiles/CMakeTmp'
Makefile:126: recipe for target 'cmTC_be4de/fast' failed
make[1]: *** [cmTC_be4de/fast] Error 2
make[1]: Leaving directory '/home/buildbot/builder/monero-static-ubuntu-amd64/build/build/release/CMakeFiles/CMakeTmp'