(view as text)
Determining if the pthread_create exist failed with the following output:
Change Dir: /home/buildbot/builder/monero-static-ubuntu-amd64/build/build/release/CMakeFiles/CMakeTmp

Run Build Command:"/usr/bin/make" "cmTC_b0ebf/fast"
make[1]: Entering directory '/home/buildbot/builder/monero-static-ubuntu-amd64/build/build/release/CMakeFiles/CMakeTmp'
/usr/bin/make -f CMakeFiles/cmTC_b0ebf.dir/build.make CMakeFiles/cmTC_b0ebf.dir/build
make[2]: Entering directory '/home/buildbot/builder/monero-static-ubuntu-amd64/build/build/release/CMakeFiles/CMakeTmp'
Building C object CMakeFiles/cmTC_b0ebf.dir/CheckSymbolExists.c.o
/usr/bin/cc    -o CMakeFiles/cmTC_b0ebf.dir/CheckSymbolExists.c.o   -c /home/buildbot/builder/monero-static-ubuntu-amd64/build/build/release/CMakeFiles/CMakeTmp/CheckSymbolExists.c
Linking C executable cmTC_b0ebf
/usr/bin/cmake -E cmake_link_script CMakeFiles/cmTC_b0ebf.dir/link.txt --verbose=1
/usr/bin/cc      -rdynamic CMakeFiles/cmTC_b0ebf.dir/CheckSymbolExists.c.o  -o cmTC_b0ebf 
CMakeFiles/cmTC_b0ebf.dir/CheckSymbolExists.c.o: In function `main':
CheckSymbolExists.c:(.text+0x1b): undefined reference to `pthread_create'
collect2: error: ld returned 1 exit status
CMakeFiles/cmTC_b0ebf.dir/build.make:97: recipe for target 'cmTC_b0ebf' failed
make[2]: *** [cmTC_b0ebf] Error 1
make[2]: Leaving directory '/home/buildbot/builder/monero-static-ubuntu-amd64/build/build/release/CMakeFiles/CMakeTmp'
Makefile:126: recipe for target 'cmTC_b0ebf/fast' failed
make[1]: *** [cmTC_b0ebf/fast] Error 2
make[1]: Leaving directory '/home/buildbot/builder/monero-static-ubuntu-amd64/build/build/release/CMakeFiles/CMakeTmp'

File /home/buildbot/builder/monero-static-ubuntu-amd64/build/build/release/CMakeFiles/CMakeTmp/CheckSymbolExists.c:
/* */
#include <pthread.h>

int main(int argc, char** argv)
{
  (void)argv;
#ifndef pthread_create
  return ((int*)(&pthread_create))[argc];
#else
  (void)argc;
  return 0;
#endif
}

Determining if the function memset_s exists in the c failed with the following output:
Change Dir: /home/buildbot/builder/monero-static-ubuntu-amd64/build/build/release/CMakeFiles/CMakeTmp

Run Build Command:"/usr/bin/make" "cmTC_21d89/fast"
make[1]: Entering directory '/home/buildbot/builder/monero-static-ubuntu-amd64/build/build/release/CMakeFiles/CMakeTmp'
/usr/bin/make -f CMakeFiles/cmTC_21d89.dir/build.make CMakeFiles/cmTC_21d89.dir/build
make[2]: Entering directory '/home/buildbot/builder/monero-static-ubuntu-amd64/build/build/release/CMakeFiles/CMakeTmp'
Building C object CMakeFiles/cmTC_21d89.dir/CheckFunctionExists.c.o
/usr/bin/cc   -pthread -DCHECK_FUNCTION_EXISTS=memset_s   -o CMakeFiles/cmTC_21d89.dir/CheckFunctionExists.c.o   -c /usr/share/cmake-3.10/Modules/CheckFunctionExists.c
Linking C executable cmTC_21d89
/usr/bin/cmake -E cmake_link_script CMakeFiles/cmTC_21d89.dir/link.txt --verbose=1
/usr/bin/cc  -pthread -DCHECK_FUNCTION_EXISTS=memset_s    -rdynamic CMakeFiles/cmTC_21d89.dir/CheckFunctionExists.c.o  -o cmTC_21d89  -L/home/buildbot/builder/monero-static-ubuntu-amd64/build/build/release/CMakeFiles/CMakeTmp/string.h -Wl,-rpath,/home/buildbot/builder/monero-static-ubuntu-amd64/build/build/release/CMakeFiles/CMakeTmp/string.h -lc 
CMakeFiles/cmTC_21d89.dir/CheckFunctionExists.c.o: In function `main':
CheckFunctionExists.c:(.text+0x10): undefined reference to `memset_s'
collect2: error: ld returned 1 exit status
CMakeFiles/cmTC_21d89.dir/build.make:97: recipe for target 'cmTC_21d89' failed
make[2]: *** [cmTC_21d89] Error 1
make[2]: Leaving directory '/home/buildbot/builder/monero-static-ubuntu-amd64/build/build/release/CMakeFiles/CMakeTmp'
Makefile:126: recipe for target 'cmTC_21d89/fast' failed
make[1]: *** [cmTC_21d89/fast] Error 2
make[1]: Leaving directory '/home/buildbot/builder/monero-static-ubuntu-amd64/build/build/release/CMakeFiles/CMakeTmp'


Determining if the include file event.h exists failed with the following output:
Change Dir: /home/buildbot/builder/monero-static-ubuntu-amd64/build/build/release/CMakeFiles/CMakeTmp

Run Build Command:"/usr/bin/make" "cmTC_c1e89/fast"
make[1]: Entering directory '/home/buildbot/builder/monero-static-ubuntu-amd64/build/build/release/CMakeFiles/CMakeTmp'
/usr/bin/make -f CMakeFiles/cmTC_c1e89.dir/build.make CMakeFiles/cmTC_c1e89.dir/build
make[2]: Entering directory '/home/buildbot/builder/monero-static-ubuntu-amd64/build/build/release/CMakeFiles/CMakeTmp'
Building C object CMakeFiles/cmTC_c1e89.dir/CheckIncludeFile.c.o
/usr/bin/cc   -pthread    -o CMakeFiles/cmTC_c1e89.dir/CheckIncludeFile.c.o   -c /home/buildbot/builder/monero-static-ubuntu-amd64/build/build/release/CMakeFiles/CMakeTmp/CheckIncludeFile.c
/home/buildbot/builder/monero-static-ubuntu-amd64/build/build/release/CMakeFiles/CMakeTmp/CheckIncludeFile.c:1:10: fatal error: event.h: No such file or directory
 #include <event.h>
          ^~~~~~~~~
compilation terminated.
CMakeFiles/cmTC_c1e89.dir/build.make:65: recipe for target 'CMakeFiles/cmTC_c1e89.dir/CheckIncludeFile.c.o' failed
make[2]: *** [CMakeFiles/cmTC_c1e89.dir/CheckIncludeFile.c.o] Error 1
make[2]: Leaving directory '/home/buildbot/builder/monero-static-ubuntu-amd64/build/build/release/CMakeFiles/CMakeTmp'
Makefile:126: recipe for target 'cmTC_c1e89/fast' failed
make[1]: *** [cmTC_c1e89/fast] Error 2
make[1]: Leaving directory '/home/buildbot/builder/monero-static-ubuntu-amd64/build/build/release/CMakeFiles/CMakeTmp'


Determining if the include file iphlpapi.h exists failed with the following output:
Change Dir: /home/buildbot/builder/monero-static-ubuntu-amd64/build/build/release/CMakeFiles/CMakeTmp

Run Build Command:"/usr/bin/make" "cmTC_8262e/fast"
make[1]: Entering directory '/home/buildbot/builder/monero-static-ubuntu-amd64/build/build/release/CMakeFiles/CMakeTmp'
/usr/bin/make -f CMakeFiles/cmTC_8262e.dir/build.make CMakeFiles/cmTC_8262e.dir/build
make[2]: Entering directory '/home/buildbot/builder/monero-static-ubuntu-amd64/build/build/release/CMakeFiles/CMakeTmp'
Building C object CMakeFiles/cmTC_8262e.dir/CheckIncludeFile.c.o
/usr/bin/cc   -pthread    -o CMakeFiles/cmTC_8262e.dir/CheckIncludeFile.c.o   -c /home/buildbot/builder/monero-static-ubuntu-amd64/build/build/release/CMakeFiles/CMakeTmp/CheckIncludeFile.c
/home/buildbot/builder/monero-static-ubuntu-amd64/build/build/release/CMakeFiles/CMakeTmp/CheckIncludeFile.c:1:10: fatal error: iphlpapi.h: No such file or directory
 #include <iphlpapi.h>
          ^~~~~~~~~~~~
compilation terminated.
CMakeFiles/cmTC_8262e.dir/build.make:65: recipe for target 'CMakeFiles/cmTC_8262e.dir/CheckIncludeFile.c.o' failed
make[2]: *** [CMakeFiles/cmTC_8262e.dir/CheckIncludeFile.c.o] Error 1
make[2]: Leaving directory '/home/buildbot/builder/monero-static-ubuntu-amd64/build/build/release/CMakeFiles/CMakeTmp'
Makefile:126: recipe for target 'cmTC_8262e/fast' failed
make[1]: *** [cmTC_8262e/fast] Error 2
make[1]: Leaving directory '/home/buildbot/builder/monero-static-ubuntu-amd64/build/build/release/CMakeFiles/CMakeTmp'


Determining if the include file login_cap.h exists failed with the following output:
Change Dir: /home/buildbot/builder/monero-static-ubuntu-amd64/build/build/release/CMakeFiles/CMakeTmp

Run Build Command:"/usr/bin/make" "cmTC_0b3fa/fast"
make[1]: Entering directory '/home/buildbot/builder/monero-static-ubuntu-amd64/build/build/release/CMakeFiles/CMakeTmp'
/usr/bin/make -f CMakeFiles/cmTC_0b3fa.dir/build.make CMakeFiles/cmTC_0b3fa.dir/build
make[2]: Entering directory '/home/buildbot/builder/monero-static-ubuntu-amd64/build/build/release/CMakeFiles/CMakeTmp'
Building C object CMakeFiles/cmTC_0b3fa.dir/CheckIncludeFile.c.o
/usr/bin/cc   -pthread    -o CMakeFiles/cmTC_0b3fa.dir/CheckIncludeFile.c.o   -c /home/buildbot/builder/monero-static-ubuntu-amd64/build/build/release/CMakeFiles/CMakeTmp/CheckIncludeFile.c
/home/buildbot/builder/monero-static-ubuntu-amd64/build/build/release/CMakeFiles/CMakeTmp/CheckIncludeFile.c:1:10: fatal error: login_cap.h: No such file or directory
 #include <login_cap.h>
          ^~~~~~~~~~~~~
compilation terminated.
CMakeFiles/cmTC_0b3fa.dir/build.make:65: recipe for target 'CMakeFiles/cmTC_0b3fa.dir/CheckIncludeFile.c.o' failed
make[2]: *** [CMakeFiles/cmTC_0b3fa.dir/CheckIncludeFile.c.o] Error 1
make[2]: Leaving directory '/home/buildbot/builder/monero-static-ubuntu-amd64/build/build/release/CMakeFiles/CMakeTmp'
Makefile:126: recipe for target 'cmTC_0b3fa/fast' failed
make[1]: *** [cmTC_0b3fa/fast] Error 2
make[1]: Leaving directory '/home/buildbot/builder/monero-static-ubuntu-amd64/build/build/release/CMakeFiles/CMakeTmp'


Determining if the include file sys/sha2.h exists failed with the following output:
Change Dir: /home/buildbot/builder/monero-static-ubuntu-amd64/build/build/release/CMakeFiles/CMakeTmp

Run Build Command:"/usr/bin/make" "cmTC_0d4a1/fast"
make[1]: Entering directory '/home/buildbot/builder/monero-static-ubuntu-amd64/build/build/release/CMakeFiles/CMakeTmp'
/usr/bin/make -f CMakeFiles/cmTC_0d4a1.dir/build.make CMakeFiles/cmTC_0d4a1.dir/build
make[2]: Entering directory '/home/buildbot/builder/monero-static-ubuntu-amd64/build/build/release/CMakeFiles/CMakeTmp'
Building C object CMakeFiles/cmTC_0d4a1.dir/CheckIncludeFile.c.o
/usr/bin/cc   -pthread    -o CMakeFiles/cmTC_0d4a1.dir/CheckIncludeFile.c.o   -c /home/buildbot/builder/monero-static-ubuntu-amd64/build/build/release/CMakeFiles/CMakeTmp/CheckIncludeFile.c
/home/buildbot/builder/monero-static-ubuntu-amd64/build/build/release/CMakeFiles/CMakeTmp/CheckIncludeFile.c:1:10: fatal error: sys/sha2.h: No such file or directory
 #include <sys/sha2.h>
          ^~~~~~~~~~~~
compilation terminated.
CMakeFiles/cmTC_0d4a1.dir/build.make:65: recipe for target 'CMakeFiles/cmTC_0d4a1.dir/CheckIncludeFile.c.o' failed
make[2]: *** [CMakeFiles/cmTC_0d4a1.dir/CheckIncludeFile.c.o] Error 1
make[2]: Leaving directory '/home/buildbot/builder/monero-static-ubuntu-amd64/build/build/release/CMakeFiles/CMakeTmp'
Makefile:126: recipe for target 'cmTC_0d4a1/fast' failed
make[1]: *** [cmTC_0d4a1/fast] Error 2
make[1]: Leaving directory '/home/buildbot/builder/monero-static-ubuntu-amd64/build/build/release/CMakeFiles/CMakeTmp'


Determining if the include file vfork.h exists failed with the following output:
Change Dir: /home/buildbot/builder/monero-static-ubuntu-amd64/build/build/release/CMakeFiles/CMakeTmp

Run Build Command:"/usr/bin/make" "cmTC_53189/fast"
make[1]: Entering directory '/home/buildbot/builder/monero-static-ubuntu-amd64/build/build/release/CMakeFiles/CMakeTmp'
/usr/bin/make -f CMakeFiles/cmTC_53189.dir/build.make CMakeFiles/cmTC_53189.dir/build
make[2]: Entering directory '/home/buildbot/builder/monero-static-ubuntu-amd64/build/build/release/CMakeFiles/CMakeTmp'
Building C object CMakeFiles/cmTC_53189.dir/CheckIncludeFile.c.o
/usr/bin/cc   -pthread    -o CMakeFiles/cmTC_53189.dir/CheckIncludeFile.c.o   -c /home/buildbot/builder/monero-static-ubuntu-amd64/build/build/release/CMakeFiles/CMakeTmp/CheckIncludeFile.c
/home/buildbot/builder/monero-static-ubuntu-amd64/build/build/release/CMakeFiles/CMakeTmp/CheckIncludeFile.c:1:10: fatal error: vfork.h: No such file or directory
 #include <vfork.h>
          ^~~~~~~~~
compilation terminated.
CMakeFiles/cmTC_53189.dir/build.make:65: recipe for target 'CMakeFiles/cmTC_53189.dir/CheckIncludeFile.c.o' failed
make[2]: *** [CMakeFiles/cmTC_53189.dir/CheckIncludeFile.c.o] Error 1
make[2]: Leaving directory '/home/buildbot/builder/monero-static-ubuntu-amd64/build/build/release/CMakeFiles/CMakeTmp'
Makefile:126: recipe for target 'cmTC_53189/fast' failed
make[1]: *** [cmTC_53189/fast] Error 2
make[1]: Leaving directory '/home/buildbot/builder/monero-static-ubuntu-amd64/build/build/release/CMakeFiles/CMakeTmp'


Determining if the include file windows.h exists failed with the following output:
Change Dir: /home/buildbot/builder/monero-static-ubuntu-amd64/build/build/release/CMakeFiles/CMakeTmp

Run Build Command:"/usr/bin/make" "cmTC_dfaef/fast"
make[1]: Entering directory '/home/buildbot/builder/monero-static-ubuntu-amd64/build/build/release/CMakeFiles/CMakeTmp'
/usr/bin/make -f CMakeFiles/cmTC_dfaef.dir/build.make CMakeFiles/cmTC_dfaef.dir/build
make[2]: Entering directory '/home/buildbot/builder/monero-static-ubuntu-amd64/build/build/release/CMakeFiles/CMakeTmp'
Building C object CMakeFiles/cmTC_dfaef.dir/CheckIncludeFile.c.o
/usr/bin/cc   -pthread    -o CMakeFiles/cmTC_dfaef.dir/CheckIncludeFile.c.o   -c /home/buildbot/builder/monero-static-ubuntu-amd64/build/build/release/CMakeFiles/CMakeTmp/CheckIncludeFile.c
/home/buildbot/builder/monero-static-ubuntu-amd64/build/build/release/CMakeFiles/CMakeTmp/CheckIncludeFile.c:1:10: fatal error: windows.h: No such file or directory
 #include <windows.h>
          ^~~~~~~~~~~
compilation terminated.
CMakeFiles/cmTC_dfaef.dir/build.make:65: recipe for target 'CMakeFiles/cmTC_dfaef.dir/CheckIncludeFile.c.o' failed
make[2]: *** [CMakeFiles/cmTC_dfaef.dir/CheckIncludeFile.c.o] Error 1
make[2]: Leaving directory '/home/buildbot/builder/monero-static-ubuntu-amd64/build/build/release/CMakeFiles/CMakeTmp'
Makefile:126: recipe for target 'cmTC_dfaef/fast' failed
make[1]: *** [cmTC_dfaef/fast] Error 2
make[1]: Leaving directory '/home/buildbot/builder/monero-static-ubuntu-amd64/build/build/release/CMakeFiles/CMakeTmp'


Determining if the include file winsock2.h exists failed with the following output:
Change Dir: /home/buildbot/builder/monero-static-ubuntu-amd64/build/build/release/CMakeFiles/CMakeTmp

Run Build Command:"/usr/bin/make" "cmTC_c40c7/fast"
make[1]: Entering directory '/home/buildbot/builder/monero-static-ubuntu-amd64/build/build/release/CMakeFiles/CMakeTmp'
/usr/bin/make -f CMakeFiles/cmTC_c40c7.dir/build.make CMakeFiles/cmTC_c40c7.dir/build
make[2]: Entering directory '/home/buildbot/builder/monero-static-ubuntu-amd64/build/build/release/CMakeFiles/CMakeTmp'
Building C object CMakeFiles/cmTC_c40c7.dir/CheckIncludeFile.c.o
/usr/bin/cc   -pthread    -o CMakeFiles/cmTC_c40c7.dir/CheckIncludeFile.c.o   -c /home/buildbot/builder/monero-static-ubuntu-amd64/build/build/release/CMakeFiles/CMakeTmp/CheckIncludeFile.c
/home/buildbot/builder/monero-static-ubuntu-amd64/build/build/release/CMakeFiles/CMakeTmp/CheckIncludeFile.c:1:10: fatal error: winsock2.h: No such file or directory
 #include <winsock2.h>
          ^~~~~~~~~~~~
compilation terminated.
CMakeFiles/cmTC_c40c7.dir/build.make:65: recipe for target 'CMakeFiles/cmTC_c40c7.dir/CheckIncludeFile.c.o' failed
make[2]: *** [CMakeFiles/cmTC_c40c7.dir/CheckIncludeFile.c.o] Error 1
make[2]: Leaving directory '/home/buildbot/builder/monero-static-ubuntu-amd64/build/build/release/CMakeFiles/CMakeTmp'
Makefile:126: recipe for target 'cmTC_c40c7/fast' failed
make[1]: *** [cmTC_c40c7/fast] Error 2
make[1]: Leaving directory '/home/buildbot/builder/monero-static-ubuntu-amd64/build/build/release/CMakeFiles/CMakeTmp'


Determining if the include file ws2tcpip.h exists failed with the following output:
Change Dir: /home/buildbot/builder/monero-static-ubuntu-amd64/build/build/release/CMakeFiles/CMakeTmp

Run Build Command:"/usr/bin/make" "cmTC_d239c/fast"
make[1]: Entering directory '/home/buildbot/builder/monero-static-ubuntu-amd64/build/build/release/CMakeFiles/CMakeTmp'
/usr/bin/make -f CMakeFiles/cmTC_d239c.dir/build.make CMakeFiles/cmTC_d239c.dir/build
make[2]: Entering directory '/home/buildbot/builder/monero-static-ubuntu-amd64/build/build/release/CMakeFiles/CMakeTmp'
Building C object CMakeFiles/cmTC_d239c.dir/CheckIncludeFile.c.o
/usr/bin/cc   -pthread    -o CMakeFiles/cmTC_d239c.dir/CheckIncludeFile.c.o   -c /home/buildbot/builder/monero-static-ubuntu-amd64/build/build/release/CMakeFiles/CMakeTmp/CheckIncludeFile.c
/home/buildbot/builder/monero-static-ubuntu-amd64/build/build/release/CMakeFiles/CMakeTmp/CheckIncludeFile.c:1:10: fatal error: ws2tcpip.h: No such file or directory
 #include <ws2tcpip.h>
          ^~~~~~~~~~~~
compilation terminated.
CMakeFiles/cmTC_d239c.dir/build.make:65: recipe for target 'CMakeFiles/cmTC_d239c.dir/CheckIncludeFile.c.o' failed
make[2]: *** [CMakeFiles/cmTC_d239c.dir/CheckIncludeFile.c.o] Error 1
make[2]: Leaving directory '/home/buildbot/builder/monero-static-ubuntu-amd64/build/build/release/CMakeFiles/CMakeTmp'
Makefile:126: recipe for target 'cmTC_d239c/fast' failed
make[1]: *** [cmTC_d239c/fast] Error 2
make[1]: Leaving directory '/home/buildbot/builder/monero-static-ubuntu-amd64/build/build/release/CMakeFiles/CMakeTmp'


Determining if the function _beginthreadex exists failed with the following output:
Change Dir: /home/buildbot/builder/monero-static-ubuntu-amd64/build/build/release/CMakeFiles/CMakeTmp

Run Build Command:"/usr/bin/make" "cmTC_7c1db/fast"
make[1]: Entering directory '/home/buildbot/builder/monero-static-ubuntu-amd64/build/build/release/CMakeFiles/CMakeTmp'
/usr/bin/make -f CMakeFiles/cmTC_7c1db.dir/build.make CMakeFiles/cmTC_7c1db.dir/build
make[2]: Entering directory '/home/buildbot/builder/monero-static-ubuntu-amd64/build/build/release/CMakeFiles/CMakeTmp'
Building C object CMakeFiles/cmTC_7c1db.dir/CheckFunctionExists.c.o
/usr/bin/cc   -pthread -DCHECK_FUNCTION_EXISTS=_beginthreadex   -o CMakeFiles/cmTC_7c1db.dir/CheckFunctionExists.c.o   -c /usr/share/cmake-3.10/Modules/CheckFunctionExists.c
Linking C executable cmTC_7c1db
/usr/bin/cmake -E cmake_link_script CMakeFiles/cmTC_7c1db.dir/link.txt --verbose=1
/usr/bin/cc  -pthread -DCHECK_FUNCTION_EXISTS=_beginthreadex    -rdynamic CMakeFiles/cmTC_7c1db.dir/CheckFunctionExists.c.o  -o cmTC_7c1db 
CMakeFiles/cmTC_7c1db.dir/CheckFunctionExists.c.o: In function `main':
CheckFunctionExists.c:(.text+0x10): undefined reference to `_beginthreadex'
collect2: error: ld returned 1 exit status
CMakeFiles/cmTC_7c1db.dir/build.make:97: recipe for target 'cmTC_7c1db' failed
make[2]: *** [cmTC_7c1db] Error 1
make[2]: Leaving directory '/home/buildbot/builder/monero-static-ubuntu-amd64/build/build/release/CMakeFiles/CMakeTmp'
Makefile:126: recipe for target 'cmTC_7c1db/fast' failed
make[1]: *** [cmTC_7c1db/fast] Error 2
make[1]: Leaving directory '/home/buildbot/builder/monero-static-ubuntu-amd64/build/build/release/CMakeFiles/CMakeTmp'


Determining if the function arc4random exists failed with the following output:
Change Dir: /home/buildbot/builder/monero-static-ubuntu-amd64/build/build/release/CMakeFiles/CMakeTmp

Run Build Command:"/usr/bin/make" "cmTC_03db0/fast"
make[1]: Entering directory '/home/buildbot/builder/monero-static-ubuntu-amd64/build/build/release/CMakeFiles/CMakeTmp'
/usr/bin/make -f CMakeFiles/cmTC_03db0.dir/build.make CMakeFiles/cmTC_03db0.dir/build
make[2]: Entering directory '/home/buildbot/builder/monero-static-ubuntu-amd64/build/build/release/CMakeFiles/CMakeTmp'
Building C object CMakeFiles/cmTC_03db0.dir/CheckFunctionExists.c.o
/usr/bin/cc   -pthread -DCHECK_FUNCTION_EXISTS=arc4random   -o CMakeFiles/cmTC_03db0.dir/CheckFunctionExists.c.o   -c /usr/share/cmake-3.10/Modules/CheckFunctionExists.c
Linking C executable cmTC_03db0
/usr/bin/cmake -E cmake_link_script CMakeFiles/cmTC_03db0.dir/link.txt --verbose=1
/usr/bin/cc  -pthread -DCHECK_FUNCTION_EXISTS=arc4random    -rdynamic CMakeFiles/cmTC_03db0.dir/CheckFunctionExists.c.o  -o cmTC_03db0 
CMakeFiles/cmTC_03db0.dir/CheckFunctionExists.c.o: In function `main':
CheckFunctionExists.c:(.text+0x10): undefined reference to `arc4random'
collect2: error: ld returned 1 exit status
CMakeFiles/cmTC_03db0.dir/build.make:97: recipe for target 'cmTC_03db0' failed
make[2]: *** [cmTC_03db0] Error 1
make[2]: Leaving directory '/home/buildbot/builder/monero-static-ubuntu-amd64/build/build/release/CMakeFiles/CMakeTmp'
Makefile:126: recipe for target 'cmTC_03db0/fast' failed
make[1]: *** [cmTC_03db0/fast] Error 2
make[1]: Leaving directory '/home/buildbot/builder/monero-static-ubuntu-amd64/build/build/release/CMakeFiles/CMakeTmp'


Determining if the function arc4random_uniform exists failed with the following output:
Change Dir: /home/buildbot/builder/monero-static-ubuntu-amd64/build/build/release/CMakeFiles/CMakeTmp

Run Build Command:"/usr/bin/make" "cmTC_bf5ea/fast"
make[1]: Entering directory '/home/buildbot/builder/monero-static-ubuntu-amd64/build/build/release/CMakeFiles/CMakeTmp'
/usr/bin/make -f CMakeFiles/cmTC_bf5ea.dir/build.make CMakeFiles/cmTC_bf5ea.dir/build
make[2]: Entering directory '/home/buildbot/builder/monero-static-ubuntu-amd64/build/build/release/CMakeFiles/CMakeTmp'
Building C object CMakeFiles/cmTC_bf5ea.dir/CheckFunctionExists.c.o
/usr/bin/cc   -pthread -DCHECK_FUNCTION_EXISTS=arc4random_uniform   -o CMakeFiles/cmTC_bf5ea.dir/CheckFunctionExists.c.o   -c /usr/share/cmake-3.10/Modules/CheckFunctionExists.c
Linking C executable cmTC_bf5ea
/usr/bin/cmake -E cmake_link_script CMakeFiles/cmTC_bf5ea.dir/link.txt --verbose=1
/usr/bin/cc  -pthread -DCHECK_FUNCTION_EXISTS=arc4random_uniform    -rdynamic CMakeFiles/cmTC_bf5ea.dir/CheckFunctionExists.c.o  -o cmTC_bf5ea 
CMakeFiles/cmTC_bf5ea.dir/CheckFunctionExists.c.o: In function `main':
CheckFunctionExists.c:(.text+0x10): undefined reference to `arc4random_uniform'
collect2: error: ld returned 1 exit status
CMakeFiles/cmTC_bf5ea.dir/build.make:97: recipe for target 'cmTC_bf5ea' failed
make[2]: *** [cmTC_bf5ea] Error 1
make[2]: Leaving directory '/home/buildbot/builder/monero-static-ubuntu-amd64/build/build/release/CMakeFiles/CMakeTmp'
Makefile:126: recipe for target 'cmTC_bf5ea/fast' failed
make[1]: *** [cmTC_bf5ea/fast] Error 2
make[1]: Leaving directory '/home/buildbot/builder/monero-static-ubuntu-amd64/build/build/release/CMakeFiles/CMakeTmp'


Determining if the function ioctlsocket exists failed with the following output:
Change Dir: /home/buildbot/builder/monero-static-ubuntu-amd64/build/build/release/CMakeFiles/CMakeTmp

Run Build Command:"/usr/bin/make" "cmTC_caddf/fast"
make[1]: Entering directory '/home/buildbot/builder/monero-static-ubuntu-amd64/build/build/release/CMakeFiles/CMakeTmp'
/usr/bin/make -f CMakeFiles/cmTC_caddf.dir/build.make CMakeFiles/cmTC_caddf.dir/build
make[2]: Entering directory '/home/buildbot/builder/monero-static-ubuntu-amd64/build/build/release/CMakeFiles/CMakeTmp'
Building C object CMakeFiles/cmTC_caddf.dir/CheckFunctionExists.c.o
/usr/bin/cc   -pthread -DCHECK_FUNCTION_EXISTS=ioctlsocket   -o CMakeFiles/cmTC_caddf.dir/CheckFunctionExists.c.o   -c /usr/share/cmake-3.10/Modules/CheckFunctionExists.c
Linking C executable cmTC_caddf
/usr/bin/cmake -E cmake_link_script CMakeFiles/cmTC_caddf.dir/link.txt --verbose=1
/usr/bin/cc  -pthread -DCHECK_FUNCTION_EXISTS=ioctlsocket    -rdynamic CMakeFiles/cmTC_caddf.dir/CheckFunctionExists.c.o  -o cmTC_caddf 
CMakeFiles/cmTC_caddf.dir/CheckFunctionExists.c.o: In function `main':
CheckFunctionExists.c:(.text+0x10): undefined reference to `ioctlsocket'
collect2: error: ld returned 1 exit status
CMakeFiles/cmTC_caddf.dir/build.make:97: recipe for target 'cmTC_caddf' failed
make[2]: *** [cmTC_caddf] Error 1
make[2]: Leaving directory '/home/buildbot/builder/monero-static-ubuntu-amd64/build/build/release/CMakeFiles/CMakeTmp'
Makefile:126: recipe for target 'cmTC_caddf/fast' failed
make[1]: *** [cmTC_caddf/fast] Error 2
make[1]: Leaving directory '/home/buildbot/builder/monero-static-ubuntu-amd64/build/build/release/CMakeFiles/CMakeTmp'


Determining if the function setusercontent exists failed with the following output:
Change Dir: /home/buildbot/builder/monero-static-ubuntu-amd64/build/build/release/CMakeFiles/CMakeTmp

Run Build Command:"/usr/bin/make" "cmTC_581db/fast"
make[1]: Entering directory '/home/buildbot/builder/monero-static-ubuntu-amd64/build/build/release/CMakeFiles/CMakeTmp'
/usr/bin/make -f CMakeFiles/cmTC_581db.dir/build.make CMakeFiles/cmTC_581db.dir/build
make[2]: Entering directory '/home/buildbot/builder/monero-static-ubuntu-amd64/build/build/release/CMakeFiles/CMakeTmp'
Building C object CMakeFiles/cmTC_581db.dir/CheckFunctionExists.c.o
/usr/bin/cc   -pthread -DCHECK_FUNCTION_EXISTS=setusercontent   -o CMakeFiles/cmTC_581db.dir/CheckFunctionExists.c.o   -c /usr/share/cmake-3.10/Modules/CheckFunctionExists.c
Linking C executable cmTC_581db
/usr/bin/cmake -E cmake_link_script CMakeFiles/cmTC_581db.dir/link.txt --verbose=1
/usr/bin/cc  -pthread -DCHECK_FUNCTION_EXISTS=setusercontent    -rdynamic CMakeFiles/cmTC_581db.dir/CheckFunctionExists.c.o  -o cmTC_581db 
CMakeFiles/cmTC_581db.dir/CheckFunctionExists.c.o: In function `main':
CheckFunctionExists.c:(.text+0x10): undefined reference to `setusercontent'
collect2: error: ld returned 1 exit status
CMakeFiles/cmTC_581db.dir/build.make:97: recipe for target 'cmTC_581db' failed
make[2]: *** [cmTC_581db] Error 1
make[2]: Leaving directory '/home/buildbot/builder/monero-static-ubuntu-amd64/build/build/release/CMakeFiles/CMakeTmp'
Makefile:126: recipe for target 'cmTC_581db/fast' failed
make[1]: *** [cmTC_581db/fast] Error 2
make[1]: Leaving directory '/home/buildbot/builder/monero-static-ubuntu-amd64/build/build/release/CMakeFiles/CMakeTmp'


Determining if the function strlcat exists failed with the following output:
Change Dir: /home/buildbot/builder/monero-static-ubuntu-amd64/build/build/release/CMakeFiles/CMakeTmp

Run Build Command:"/usr/bin/make" "cmTC_15fa4/fast"
make[1]: Entering directory '/home/buildbot/builder/monero-static-ubuntu-amd64/build/build/release/CMakeFiles/CMakeTmp'
/usr/bin/make -f CMakeFiles/cmTC_15fa4.dir/build.make CMakeFiles/cmTC_15fa4.dir/build
make[2]: Entering directory '/home/buildbot/builder/monero-static-ubuntu-amd64/build/build/release/CMakeFiles/CMakeTmp'
Building C object CMakeFiles/cmTC_15fa4.dir/CheckFunctionExists.c.o
/usr/bin/cc   -pthread -DCHECK_FUNCTION_EXISTS=strlcat   -o CMakeFiles/cmTC_15fa4.dir/CheckFunctionExists.c.o   -c /usr/share/cmake-3.10/Modules/CheckFunctionExists.c
Linking C executable cmTC_15fa4
/usr/bin/cmake -E cmake_link_script CMakeFiles/cmTC_15fa4.dir/link.txt --verbose=1
/usr/bin/cc  -pthread -DCHECK_FUNCTION_EXISTS=strlcat    -rdynamic CMakeFiles/cmTC_15fa4.dir/CheckFunctionExists.c.o  -o cmTC_15fa4 
CMakeFiles/cmTC_15fa4.dir/CheckFunctionExists.c.o: In function `main':
CheckFunctionExists.c:(.text+0x10): undefined reference to `strlcat'
collect2: error: ld returned 1 exit status
CMakeFiles/cmTC_15fa4.dir/build.make:97: recipe for target 'cmTC_15fa4' failed
make[2]: *** [cmTC_15fa4] Error 1
make[2]: Leaving directory '/home/buildbot/builder/monero-static-ubuntu-amd64/build/build/release/CMakeFiles/CMakeTmp'
Makefile:126: recipe for target 'cmTC_15fa4/fast' failed
make[1]: *** [cmTC_15fa4/fast] Error 2
make[1]: Leaving directory '/home/buildbot/builder/monero-static-ubuntu-amd64/build/build/release/CMakeFiles/CMakeTmp'


Determining if the function strlcpy exists failed with the following output:
Change Dir: /home/buildbot/builder/monero-static-ubuntu-amd64/build/build/release/CMakeFiles/CMakeTmp

Run Build Command:"/usr/bin/make" "cmTC_5ba98/fast"
make[1]: Entering directory '/home/buildbot/builder/monero-static-ubuntu-amd64/build/build/release/CMakeFiles/CMakeTmp'
/usr/bin/make -f CMakeFiles/cmTC_5ba98.dir/build.make CMakeFiles/cmTC_5ba98.dir/build
make[2]: Entering directory '/home/buildbot/builder/monero-static-ubuntu-amd64/build/build/release/CMakeFiles/CMakeTmp'
Building C object CMakeFiles/cmTC_5ba98.dir/CheckFunctionExists.c.o
/usr/bin/cc   -pthread -DCHECK_FUNCTION_EXISTS=strlcpy   -o CMakeFiles/cmTC_5ba98.dir/CheckFunctionExists.c.o   -c /usr/share/cmake-3.10/Modules/CheckFunctionExists.c
Linking C executable cmTC_5ba98
/usr/bin/cmake -E cmake_link_script CMakeFiles/cmTC_5ba98.dir/link.txt --verbose=1
/usr/bin/cc  -pthread -DCHECK_FUNCTION_EXISTS=strlcpy    -rdynamic CMakeFiles/cmTC_5ba98.dir/CheckFunctionExists.c.o  -o cmTC_5ba98 
CMakeFiles/cmTC_5ba98.dir/CheckFunctionExists.c.o: In function `main':
CheckFunctionExists.c:(.text+0x10): undefined reference to `strlcpy'
collect2: error: ld returned 1 exit status
CMakeFiles/cmTC_5ba98.dir/build.make:97: recipe for target 'cmTC_5ba98' failed
make[2]: *** [cmTC_5ba98] Error 1
make[2]: Leaving directory '/home/buildbot/builder/monero-static-ubuntu-amd64/build/build/release/CMakeFiles/CMakeTmp'
Makefile:126: recipe for target 'cmTC_5ba98/fast' failed
make[1]: *** [cmTC_5ba98/fast] Error 2
make[1]: Leaving directory '/home/buildbot/builder/monero-static-ubuntu-amd64/build/build/release/CMakeFiles/CMakeTmp'


Determining if the PTHREAD_PRIO_INHERIT exist failed with the following output:
Change Dir: /home/buildbot/builder/monero-static-ubuntu-amd64/build/build/release/CMakeFiles/CMakeTmp

Run Build Command:"/usr/bin/make" "cmTC_921ce/fast"
make[1]: Entering directory '/home/buildbot/builder/monero-static-ubuntu-amd64/build/build/release/CMakeFiles/CMakeTmp'
/usr/bin/make -f CMakeFiles/cmTC_921ce.dir/build.make CMakeFiles/cmTC_921ce.dir/build
make[2]: Entering directory '/home/buildbot/builder/monero-static-ubuntu-amd64/build/build/release/CMakeFiles/CMakeTmp'
Building C object CMakeFiles/cmTC_921ce.dir/CheckSymbolExists.c.o
/usr/bin/cc   -pthread    -o CMakeFiles/cmTC_921ce.dir/CheckSymbolExists.c.o   -c /home/buildbot/builder/monero-static-ubuntu-amd64/build/build/release/CMakeFiles/CMakeTmp/CheckSymbolExists.c
/home/buildbot/builder/monero-static-ubuntu-amd64/build/build/release/CMakeFiles/CMakeTmp/CheckSymbolExists.c: In function 'main':
/home/buildbot/builder/monero-static-ubuntu-amd64/build/build/release/CMakeFiles/CMakeTmp/CheckSymbolExists.c:8:18: error: lvalue required as unary '&' operand
   return ((int*)(&PTHREAD_PRIO_INHERIT))[argc];
                  ^
CMakeFiles/cmTC_921ce.dir/build.make:65: recipe for target 'CMakeFiles/cmTC_921ce.dir/CheckSymbolExists.c.o' failed
make[2]: *** [CMakeFiles/cmTC_921ce.dir/CheckSymbolExists.c.o] Error 1
make[2]: Leaving directory '/home/buildbot/builder/monero-static-ubuntu-amd64/build/build/release/CMakeFiles/CMakeTmp'
Makefile:126: recipe for target 'cmTC_921ce/fast' failed
make[1]: *** [cmTC_921ce/fast] Error 2
make[1]: Leaving directory '/home/buildbot/builder/monero-static-ubuntu-amd64/build/build/release/CMakeFiles/CMakeTmp'

File /home/buildbot/builder/monero-static-ubuntu-amd64/build/build/release/CMakeFiles/CMakeTmp/CheckSymbolExists.c:
/* */
#include <pthread.h>

int main(int argc, char** argv)
{
  (void)argv;
#ifndef PTHREAD_PRIO_INHERIT
  return ((int*)(&PTHREAD_PRIO_INHERIT))[argc];
#else
  (void)argc;
  return 0;
#endif
}

Determining if the pthread_rwlock_t exist failed with the following output:
Change Dir: /home/buildbot/builder/monero-static-ubuntu-amd64/build/build/release/CMakeFiles/CMakeTmp

Run Build Command:"/usr/bin/make" "cmTC_ca80a/fast"
make[1]: Entering directory '/home/buildbot/builder/monero-static-ubuntu-amd64/build/build/release/CMakeFiles/CMakeTmp'
/usr/bin/make -f CMakeFiles/cmTC_ca80a.dir/build.make CMakeFiles/cmTC_ca80a.dir/build
make[2]: Entering directory '/home/buildbot/builder/monero-static-ubuntu-amd64/build/build/release/CMakeFiles/CMakeTmp'
Building C object CMakeFiles/cmTC_ca80a.dir/CheckSymbolExists.c.o
/usr/bin/cc   -pthread    -o CMakeFiles/cmTC_ca80a.dir/CheckSymbolExists.c.o   -c /home/buildbot/builder/monero-static-ubuntu-amd64/build/build/release/CMakeFiles/CMakeTmp/CheckSymbolExists.c
/home/buildbot/builder/monero-static-ubuntu-amd64/build/build/release/CMakeFiles/CMakeTmp/CheckSymbolExists.c: In function 'main':
/home/buildbot/builder/monero-static-ubuntu-amd64/build/build/release/CMakeFiles/CMakeTmp/CheckSymbolExists.c:8:19: error: expected expression before 'pthread_rwlock_t'
   return ((int*)(&pthread_rwlock_t))[argc];
                   ^~~~~~~~~~~~~~~~
CMakeFiles/cmTC_ca80a.dir/build.make:65: recipe for target 'CMakeFiles/cmTC_ca80a.dir/CheckSymbolExists.c.o' failed
make[2]: *** [CMakeFiles/cmTC_ca80a.dir/CheckSymbolExists.c.o] Error 1
make[2]: Leaving directory '/home/buildbot/builder/monero-static-ubuntu-amd64/build/build/release/CMakeFiles/CMakeTmp'
Makefile:126: recipe for target 'cmTC_ca80a/fast' failed
make[1]: *** [cmTC_ca80a/fast] Error 2
make[1]: Leaving directory '/home/buildbot/builder/monero-static-ubuntu-amd64/build/build/release/CMakeFiles/CMakeTmp'

File /home/buildbot/builder/monero-static-ubuntu-amd64/build/build/release/CMakeFiles/CMakeTmp/CheckSymbolExists.c:
/* */
#include <pthread.h>

int main(int argc, char** argv)
{
  (void)argv;
#ifndef pthread_rwlock_t
  return ((int*)(&pthread_rwlock_t))[argc];
#else
  (void)argc;
  return 0;
#endif
}

Determining if the pthread_spinlock_t exist failed with the following output:
Change Dir: /home/buildbot/builder/monero-static-ubuntu-amd64/build/build/release/CMakeFiles/CMakeTmp

Run Build Command:"/usr/bin/make" "cmTC_a825b/fast"
make[1]: Entering directory '/home/buildbot/builder/monero-static-ubuntu-amd64/build/build/release/CMakeFiles/CMakeTmp'
/usr/bin/make -f CMakeFiles/cmTC_a825b.dir/build.make CMakeFiles/cmTC_a825b.dir/build
make[2]: Entering directory '/home/buildbot/builder/monero-static-ubuntu-amd64/build/build/release/CMakeFiles/CMakeTmp'
Building C object CMakeFiles/cmTC_a825b.dir/CheckSymbolExists.c.o
/usr/bin/cc   -pthread    -o CMakeFiles/cmTC_a825b.dir/CheckSymbolExists.c.o   -c /home/buildbot/builder/monero-static-ubuntu-amd64/build/build/release/CMakeFiles/CMakeTmp/CheckSymbolExists.c
/home/buildbot/builder/monero-static-ubuntu-amd64/build/build/release/CMakeFiles/CMakeTmp/CheckSymbolExists.c: In function 'main':
/home/buildbot/builder/monero-static-ubuntu-amd64/build/build/release/CMakeFiles/CMakeTmp/CheckSymbolExists.c:8:19: error: expected expression before 'pthread_spinlock_t'
   return ((int*)(&pthread_spinlock_t))[argc];
                   ^~~~~~~~~~~~~~~~~~
CMakeFiles/cmTC_a825b.dir/build.make:65: recipe for target 'CMakeFiles/cmTC_a825b.dir/CheckSymbolExists.c.o' failed
make[2]: *** [CMakeFiles/cmTC_a825b.dir/CheckSymbolExists.c.o] Error 1
make[2]: Leaving directory '/home/buildbot/builder/monero-static-ubuntu-amd64/build/build/release/CMakeFiles/CMakeTmp'
Makefile:126: recipe for target 'cmTC_a825b/fast' failed
make[1]: *** [cmTC_a825b/fast] Error 2
make[1]: Leaving directory '/home/buildbot/builder/monero-static-ubuntu-amd64/build/build/release/CMakeFiles/CMakeTmp'

File /home/buildbot/builder/monero-static-ubuntu-amd64/build/build/release/CMakeFiles/CMakeTmp/CheckSymbolExists.c:
/* */
#include <pthread.h>

int main(int argc, char** argv)
{
  (void)argv;
#ifndef pthread_spinlock_t
  return ((int*)(&pthread_spinlock_t))[argc];
#else
  (void)argc;
  return 0;
#endif
}

Determining if the LIBRESSL_VERSION_TEXT exist failed with the following output:
Change Dir: /home/buildbot/builder/monero-static-ubuntu-amd64/build/build/release/CMakeFiles/CMakeTmp

Run Build Command:"/usr/bin/make" "cmTC_f5f06/fast"
make[1]: Entering directory '/home/buildbot/builder/monero-static-ubuntu-amd64/build/build/release/CMakeFiles/CMakeTmp'
/usr/bin/make -f CMakeFiles/cmTC_f5f06.dir/build.make CMakeFiles/cmTC_f5f06.dir/build
make[2]: Entering directory '/home/buildbot/builder/monero-static-ubuntu-amd64/build/build/release/CMakeFiles/CMakeTmp'
Building C object CMakeFiles/cmTC_f5f06.dir/CheckSymbolExists.c.o
/usr/bin/cc   -pthread    -o CMakeFiles/cmTC_f5f06.dir/CheckSymbolExists.c.o   -c /home/buildbot/builder/monero-static-ubuntu-amd64/build/build/release/CMakeFiles/CMakeTmp/CheckSymbolExists.c
/home/buildbot/builder/monero-static-ubuntu-amd64/build/build/release/CMakeFiles/CMakeTmp/CheckSymbolExists.c: In function 'main':
/home/buildbot/builder/monero-static-ubuntu-amd64/build/build/release/CMakeFiles/CMakeTmp/CheckSymbolExists.c:8:19: error: 'LIBRESSL_VERSION_TEXT' undeclared (first use in this function); did you mean 'OPENSSL_VERSION_TEXT'?
   return ((int*)(&LIBRESSL_VERSION_TEXT))[argc];
                   ^~~~~~~~~~~~~~~~~~~~~
                   OPENSSL_VERSION_TEXT
/home/buildbot/builder/monero-static-ubuntu-amd64/build/build/release/CMakeFiles/CMakeTmp/CheckSymbolExists.c:8:19: note: each undeclared identifier is reported only once for each function it appears in
CMakeFiles/cmTC_f5f06.dir/build.make:65: recipe for target 'CMakeFiles/cmTC_f5f06.dir/CheckSymbolExists.c.o' failed
make[2]: *** [CMakeFiles/cmTC_f5f06.dir/CheckSymbolExists.c.o] Error 1
make[2]: Leaving directory '/home/buildbot/builder/monero-static-ubuntu-amd64/build/build/release/CMakeFiles/CMakeTmp'
Makefile:126: recipe for target 'cmTC_f5f06/fast' failed
make[1]: *** [cmTC_f5f06/fast] Error 2
make[1]: Leaving directory '/home/buildbot/builder/monero-static-ubuntu-amd64/build/build/release/CMakeFiles/CMakeTmp'

File /home/buildbot/builder/monero-static-ubuntu-amd64/build/build/release/CMakeFiles/CMakeTmp/CheckSymbolExists.c:
/* */
#include <openssl/opensslv.h>

int main(int argc, char** argv)
{
  (void)argv;
#ifndef LIBRESSL_VERSION_TEXT
  return ((int*)(&LIBRESSL_VERSION_TEXT))[argc];
#else
  (void)argc;
  return 0;
#endif
}

Performing C SOURCE FILE Test _fcf_protection=full_c failed with the following output:
Change Dir: /home/buildbot/builder/monero-static-ubuntu-amd64/build/build/release/CMakeFiles/CMakeTmp

Run Build Command:"/usr/bin/make" "cmTC_817a8/fast"
make[1]: Entering directory '/home/buildbot/builder/monero-static-ubuntu-amd64/build/build/release/CMakeFiles/CMakeTmp'
/usr/bin/make -f CMakeFiles/cmTC_817a8.dir/build.make CMakeFiles/cmTC_817a8.dir/build
make[2]: Entering directory '/home/buildbot/builder/monero-static-ubuntu-amd64/build/build/release/CMakeFiles/CMakeTmp'
Building C object CMakeFiles/cmTC_817a8.dir/src.c.o
/usr/bin/cc   -pthread -maes -march=x86-64 -fno-strict-aliasing -D_fcf_protection=full_c   -fcf-protection=full -o CMakeFiles/cmTC_817a8.dir/src.c.o   -c /home/buildbot/builder/monero-static-ubuntu-amd64/build/build/release/CMakeFiles/CMakeTmp/src.c
cc: error: unrecognized command line option '-fcf-protection=full'; did you mean '-fstack-protector-all'?
CMakeFiles/cmTC_817a8.dir/build.make:65: recipe for target 'CMakeFiles/cmTC_817a8.dir/src.c.o' failed
make[2]: *** [CMakeFiles/cmTC_817a8.dir/src.c.o] Error 1
make[2]: Leaving directory '/home/buildbot/builder/monero-static-ubuntu-amd64/build/build/release/CMakeFiles/CMakeTmp'
Makefile:126: recipe for target 'cmTC_817a8/fast' failed
make[1]: *** [cmTC_817a8/fast] Error 2
make[1]: Leaving directory '/home/buildbot/builder/monero-static-ubuntu-amd64/build/build/release/CMakeFiles/CMakeTmp'

Source file was:
int main(void) { return 0; }
Performing C++ SOURCE FILE Test _fcf_protection=full_cxx failed with the following output:
Change Dir: /home/buildbot/builder/monero-static-ubuntu-amd64/build/build/release/CMakeFiles/CMakeTmp

Run Build Command:"/usr/bin/make" "cmTC_58801/fast"
make[1]: Entering directory '/home/buildbot/builder/monero-static-ubuntu-amd64/build/build/release/CMakeFiles/CMakeTmp'
/usr/bin/make -f CMakeFiles/cmTC_58801.dir/build.make CMakeFiles/cmTC_58801.dir/build
make[2]: Entering directory '/home/buildbot/builder/monero-static-ubuntu-amd64/build/build/release/CMakeFiles/CMakeTmp'
Building CXX object CMakeFiles/cmTC_58801.dir/src.cxx.o
/usr/bin/c++    -DZMQ_STATIC -pthread -maes -march=x86-64 -fno-strict-aliasing -D_fcf_protection=full_cxx   -fcf-protection=full -o CMakeFiles/cmTC_58801.dir/src.cxx.o -c /home/buildbot/builder/monero-static-ubuntu-amd64/build/build/release/CMakeFiles/CMakeTmp/src.cxx
c++: error: unrecognized command line option '-fcf-protection=full'; did you mean '-fstack-protector-all'?
CMakeFiles/cmTC_58801.dir/build.make:65: recipe for target 'CMakeFiles/cmTC_58801.dir/src.cxx.o' failed
make[2]: *** [CMakeFiles/cmTC_58801.dir/src.cxx.o] Error 1
make[2]: Leaving directory '/home/buildbot/builder/monero-static-ubuntu-amd64/build/build/release/CMakeFiles/CMakeTmp'
Makefile:126: recipe for target 'cmTC_58801/fast' failed
make[1]: *** [cmTC_58801/fast] Error 2
make[1]: Leaving directory '/home/buildbot/builder/monero-static-ubuntu-amd64/build/build/release/CMakeFiles/CMakeTmp'

Source file was:
int main() { return 0; }
Performing C SOURCE FILE Test _fstack_clash_protection_c failed with the following output:
Change Dir: /home/buildbot/builder/monero-static-ubuntu-amd64/build/build/release/CMakeFiles/CMakeTmp

Run Build Command:"/usr/bin/make" "cmTC_d9afe/fast"
make[1]: Entering directory '/home/buildbot/builder/monero-static-ubuntu-amd64/build/build/release/CMakeFiles/CMakeTmp'
/usr/bin/make -f CMakeFiles/cmTC_d9afe.dir/build.make CMakeFiles/cmTC_d9afe.dir/build
make[2]: Entering directory '/home/buildbot/builder/monero-static-ubuntu-amd64/build/build/release/CMakeFiles/CMakeTmp'
Building C object CMakeFiles/cmTC_d9afe.dir/src.c.o
/usr/bin/cc   -pthread -maes -march=x86-64 -fno-strict-aliasing -D_fstack_clash_protection_c   -fstack-clash-protection -o CMakeFiles/cmTC_d9afe.dir/src.c.o   -c /home/buildbot/builder/monero-static-ubuntu-amd64/build/build/release/CMakeFiles/CMakeTmp/src.c
cc: error: unrecognized command line option '-fstack-clash-protection'; did you mean '-fstack-protector'?
CMakeFiles/cmTC_d9afe.dir/build.make:65: recipe for target 'CMakeFiles/cmTC_d9afe.dir/src.c.o' failed
make[2]: *** [CMakeFiles/cmTC_d9afe.dir/src.c.o] Error 1
make[2]: Leaving directory '/home/buildbot/builder/monero-static-ubuntu-amd64/build/build/release/CMakeFiles/CMakeTmp'
Makefile:126: recipe for target 'cmTC_d9afe/fast' failed
make[1]: *** [cmTC_d9afe/fast] Error 2
make[1]: Leaving directory '/home/buildbot/builder/monero-static-ubuntu-amd64/build/build/release/CMakeFiles/CMakeTmp'

Source file was:
int main(void) { return 0; }
Performing C++ SOURCE FILE Test _fstack_clash_protection_cxx failed with the following output:
Change Dir: /home/buildbot/builder/monero-static-ubuntu-amd64/build/build/release/CMakeFiles/CMakeTmp

Run Build Command:"/usr/bin/make" "cmTC_dd635/fast"
make[1]: Entering directory '/home/buildbot/builder/monero-static-ubuntu-amd64/build/build/release/CMakeFiles/CMakeTmp'
/usr/bin/make -f CMakeFiles/cmTC_dd635.dir/build.make CMakeFiles/cmTC_dd635.dir/build
make[2]: Entering directory '/home/buildbot/builder/monero-static-ubuntu-amd64/build/build/release/CMakeFiles/CMakeTmp'
Building CXX object CMakeFiles/cmTC_dd635.dir/src.cxx.o
/usr/bin/c++    -DZMQ_STATIC -pthread -maes -march=x86-64 -fno-strict-aliasing -D_fstack_clash_protection_cxx   -fstack-clash-protection -o CMakeFiles/cmTC_dd635.dir/src.cxx.o -c /home/buildbot/builder/monero-static-ubuntu-amd64/build/build/release/CMakeFiles/CMakeTmp/src.cxx
c++: error: unrecognized command line option '-fstack-clash-protection'; did you mean '-fstack-protector'?
CMakeFiles/cmTC_dd635.dir/build.make:65: recipe for target 'CMakeFiles/cmTC_dd635.dir/src.cxx.o' failed
make[2]: *** [CMakeFiles/cmTC_dd635.dir/src.cxx.o] Error 1
make[2]: Leaving directory '/home/buildbot/builder/monero-static-ubuntu-amd64/build/build/release/CMakeFiles/CMakeTmp'
Makefile:126: recipe for target 'cmTC_dd635/fast' failed
make[1]: *** [cmTC_dd635/fast] Error 2
make[1]: Leaving directory '/home/buildbot/builder/monero-static-ubuntu-amd64/build/build/release/CMakeFiles/CMakeTmp'

Source file was:
int main() { return 0; }
Determining if the -Wl,-z,noexecheap linker flag is supported failed with the following output:
Change Dir: /home/buildbot/builder/monero-static-ubuntu-amd64/build/build/release/CMakeFiles/CMakeTmp

Run Build Command:"/usr/bin/make" "cmTC_0455b/fast"
make[1]: Entering directory '/home/buildbot/builder/monero-static-ubuntu-amd64/build/build/release/CMakeFiles/CMakeTmp'
/usr/bin/make -f CMakeFiles/cmTC_0455b.dir/build.make CMakeFiles/cmTC_0455b.dir/build
make[2]: Entering directory '/home/buildbot/builder/monero-static-ubuntu-amd64/build/build/release/CMakeFiles/CMakeTmp'
Building C object CMakeFiles/cmTC_0455b.dir/CheckLinkerFlag.c.o
/usr/bin/cc   -Wl,-z,noexecheap    -Wl,-z,noexecheap -o CMakeFiles/cmTC_0455b.dir/CheckLinkerFlag.c.o   -c /home/buildbot/builder/monero-static-ubuntu-amd64/build/cmake/CheckLinkerFlag.c
Linking C executable cmTC_0455b
/usr/bin/cmake -E cmake_link_script CMakeFiles/cmTC_0455b.dir/link.txt --verbose=1
/usr/bin/cc -Wl,-z,noexecheap     -rdynamic CMakeFiles/cmTC_0455b.dir/CheckLinkerFlag.c.o  -o cmTC_0455b 
/usr/bin/ld: warning: -z noexecheap ignored.
make[2]: Leaving directory '/home/buildbot/builder/monero-static-ubuntu-amd64/build/build/release/CMakeFiles/CMakeTmp'
make[1]: Leaving directory '/home/buildbot/builder/monero-static-ubuntu-amd64/build/build/release/CMakeFiles/CMakeTmp'


Determining if the function rl_copy_text exists failed with the following output:
Change Dir: /home/buildbot/builder/monero-static-ubuntu-amd64/build/build/release/CMakeFiles/CMakeTmp

Run Build Command:"/usr/bin/make" "cmTC_8f29b/fast"
make[1]: Entering directory '/home/buildbot/builder/monero-static-ubuntu-amd64/build/build/release/CMakeFiles/CMakeTmp'
/usr/bin/make -f CMakeFiles/cmTC_8f29b.dir/build.make CMakeFiles/cmTC_8f29b.dir/build
make[2]: Entering directory '/home/buildbot/builder/monero-static-ubuntu-amd64/build/build/release/CMakeFiles/CMakeTmp'
Building C object CMakeFiles/cmTC_8f29b.dir/CheckFunctionExists.c.o
/usr/bin/cc   -pthread -maes -march=x86-64 -fno-strict-aliasing -std=c11 -D_GNU_SOURCE   -Wall -Wextra -Wpointer-arith -Wundef -Wvla -Wwrite-strings -Wno-error=extra -Wno-error=deprecated-declarations -Wno-unused-parameter -Wno-unused-variable -Wno-error=unused-variable -Wno-error=undef -Wno-error=uninitialized -Wlogical-op -Wno-error=maybe-uninitialized -Wno-error=cpp -Waggregate-return -Wnested-externs -Wold-style-definition -Wstrict-prototypes  -fPIC  -Wformat -Wformat-security -fstack-protector -fstack-protector-strong -mmitigate-rop -fno-strict-aliasing -DCHECK_FUNCTION_EXISTS=rl_copy_text   -o CMakeFiles/cmTC_8f29b.dir/CheckFunctionExists.c.o   -c /usr/share/cmake-3.10/Modules/CheckFunctionExists.c
Linking C executable cmTC_8f29b
/usr/bin/cmake -E cmake_link_script CMakeFiles/cmTC_8f29b.dir/link.txt --verbose=1
/usr/bin/cc  -pthread -maes -march=x86-64 -fno-strict-aliasing -std=c11 -D_GNU_SOURCE   -Wall -Wextra -Wpointer-arith -Wundef -Wvla -Wwrite-strings -Wno-error=extra -Wno-error=deprecated-declarations -Wno-unused-parameter -Wno-unused-variable -Wno-error=unused-variable -Wno-error=undef -Wno-error=uninitialized -Wlogical-op -Wno-error=maybe-uninitialized -Wno-error=cpp -Waggregate-return -Wnested-externs -Wold-style-definition -Wstrict-prototypes  -fPIC  -Wformat -Wformat-security -fstack-protector -fstack-protector-strong -mmitigate-rop -fno-strict-aliasing -DCHECK_FUNCTION_EXISTS=rl_copy_text    -rdynamic CMakeFiles/cmTC_8f29b.dir/CheckFunctionExists.c.o  -o cmTC_8f29b /usr/lib/x86_64-linux-gnu/libreadline.a 
/usr/lib/x86_64-linux-gnu/libreadline.a(terminal.o): In function `_rl_get_screen_size':
(.text+0x186): undefined reference to `tgetnum'
(.text+0x2be): undefined reference to `tgetnum'
/usr/lib/x86_64-linux-gnu/libreadline.a(terminal.o): In function `_rl_init_terminal_io':
(.text+0x678): undefined reference to `PC'
(.text+0x687): undefined reference to `BC'
(.text+0x68e): undefined reference to `UP'
(.text+0x728): undefined reference to `tgetent'
(.text+0x76f): undefined reference to `tgetstr'
(.text+0x799): undefined reference to `PC'
(.text+0x7af): undefined reference to `BC'
(.text+0x7bd): undefined reference to `UP'
(.text+0x7cf): undefined reference to `tgetflag'
(.text+0x81e): undefined reference to `tgetflag'
(.text+0x938): undefined reference to `tgetflag'
/usr/lib/x86_64-linux-gnu/libreadline.a(terminal.o): In function `_rl_backspace':
(.text+0xb4b): undefined reference to `tputs'
/usr/lib/x86_64-linux-gnu/libreadline.a(terminal.o): In function `rl_ding':
(.text+0xc1d): undefined reference to `tputs'
/usr/lib/x86_64-linux-gnu/libreadline.a(terminal.o): In function `_rl_enable_meta_key':
(.text+0xc67): undefined reference to `tputs'
/usr/lib/x86_64-linux-gnu/libreadline.a(terminal.o): In function `_rl_disable_meta_key':
(.text+0xcc9): undefined reference to `tputs'
/usr/lib/x86_64-linux-gnu/libreadline.a(terminal.o): In function `_rl_control_keypad':
(.text+0xcfd): undefined reference to `tputs'
/usr/lib/x86_64-linux-gnu/libreadline.a(terminal.o):(.text+0xd50): more undefined references to `tputs' follow
/usr/lib/x86_64-linux-gnu/libreadline.a(display.o): In function `update_line':
(.text+0x301f): undefined reference to `tgoto'
(.text+0x3033): undefined reference to `tputs'
(.text+0x31cc): undefined reference to `tputs'
(.text+0x32bf): undefined reference to `tputs'
(.text+0x34b8): undefined reference to `tputs'
(.text+0x3513): undefined reference to `tputs'
(.text+0x3546): undefined reference to `tgoto'
(.text+0x3557): undefined reference to `tputs'
/usr/lib/x86_64-linux-gnu/libreadline.a(display.o): In function `rl_redisplay':
(.text+0x4591): undefined reference to `tputs'
(.text+0x50be): undefined reference to `tputs'
/usr/lib/x86_64-linux-gnu/libreadline.a(display.o): In function `rl_clear_visible_line':
(.text+0x5265): undefined reference to `tputs'
/usr/lib/x86_64-linux-gnu/libreadline.a(display.o): In function `_rl_redisplay_after_sigwinch':
(.text+0x53f1): undefined reference to `tputs'
/usr/lib/x86_64-linux-gnu/libreadline.a(display.o):(.text+0x5414): more undefined references to `tputs' follow
collect2: error: ld returned 1 exit status
CMakeFiles/cmTC_8f29b.dir/build.make:98: recipe for target 'cmTC_8f29b' failed
make[2]: *** [cmTC_8f29b] Error 1
make[2]: Leaving directory '/home/buildbot/builder/monero-static-ubuntu-amd64/build/build/release/CMakeFiles/CMakeTmp'
Makefile:126: recipe for target 'cmTC_8f29b/fast' failed
make[1]: *** [cmTC_8f29b/fast] Error 2
make[1]: Leaving directory '/home/buildbot/builder/monero-static-ubuntu-amd64/build/build/release/CMakeFiles/CMakeTmp'


Determining if the function rl_filename_completion_function exists failed with the following output:
Change Dir: /home/buildbot/builder/monero-static-ubuntu-amd64/build/build/release/CMakeFiles/CMakeTmp

Run Build Command:"/usr/bin/make" "cmTC_c1683/fast"
make[1]: Entering directory '/home/buildbot/builder/monero-static-ubuntu-amd64/build/build/release/CMakeFiles/CMakeTmp'
/usr/bin/make -f CMakeFiles/cmTC_c1683.dir/build.make CMakeFiles/cmTC_c1683.dir/build
make[2]: Entering directory '/home/buildbot/builder/monero-static-ubuntu-amd64/build/build/release/CMakeFiles/CMakeTmp'
Building C object CMakeFiles/cmTC_c1683.dir/CheckFunctionExists.c.o
/usr/bin/cc   -pthread -maes -march=x86-64 -fno-strict-aliasing -std=c11 -D_GNU_SOURCE   -Wall -Wextra -Wpointer-arith -Wundef -Wvla -Wwrite-strings -Wno-error=extra -Wno-error=deprecated-declarations -Wno-unused-parameter -Wno-unused-variable -Wno-error=unused-variable -Wno-error=undef -Wno-error=uninitialized -Wlogical-op -Wno-error=maybe-uninitialized -Wno-error=cpp -Waggregate-return -Wnested-externs -Wold-style-definition -Wstrict-prototypes  -fPIC  -Wformat -Wformat-security -fstack-protector -fstack-protector-strong -mmitigate-rop -fno-strict-aliasing -DCHECK_FUNCTION_EXISTS=rl_filename_completion_function   -o CMakeFiles/cmTC_c1683.dir/CheckFunctionExists.c.o   -c /usr/share/cmake-3.10/Modules/CheckFunctionExists.c
Linking C executable cmTC_c1683
/usr/bin/cmake -E cmake_link_script CMakeFiles/cmTC_c1683.dir/link.txt --verbose=1
/usr/bin/cc  -pthread -maes -march=x86-64 -fno-strict-aliasing -std=c11 -D_GNU_SOURCE   -Wall -Wextra -Wpointer-arith -Wundef -Wvla -Wwrite-strings -Wno-error=extra -Wno-error=deprecated-declarations -Wno-unused-parameter -Wno-unused-variable -Wno-error=unused-variable -Wno-error=undef -Wno-error=uninitialized -Wlogical-op -Wno-error=maybe-uninitialized -Wno-error=cpp -Waggregate-return -Wnested-externs -Wold-style-definition -Wstrict-prototypes  -fPIC  -Wformat -Wformat-security -fstack-protector -fstack-protector-strong -mmitigate-rop -fno-strict-aliasing -DCHECK_FUNCTION_EXISTS=rl_filename_completion_function    -rdynamic CMakeFiles/cmTC_c1683.dir/CheckFunctionExists.c.o  -o cmTC_c1683 /usr/lib/x86_64-linux-gnu/libreadline.a 
/usr/lib/x86_64-linux-gnu/libreadline.a(display.o): In function `_rl_move_cursor_relative':
(.text+0xf86): undefined reference to `tputs'
(.text+0xfec): undefined reference to `tputs'
(.text+0x11ac): undefined reference to `tputs'
/usr/lib/x86_64-linux-gnu/libreadline.a(display.o): In function `_rl_move_vert':
(.text+0x123d): undefined reference to `tputs'
(.text+0x12a3): undefined reference to `tputs'
/usr/lib/x86_64-linux-gnu/libreadline.a(display.o):(.text+0x2117): more undefined references to `tputs' follow
/usr/lib/x86_64-linux-gnu/libreadline.a(display.o): In function `update_line':
(.text+0x301f): undefined reference to `tgoto'
(.text+0x3033): undefined reference to `tputs'
(.text+0x31cc): undefined reference to `tputs'
(.text+0x32bf): undefined reference to `tputs'
(.text+0x34b8): undefined reference to `tputs'
(.text+0x3513): undefined reference to `tputs'
(.text+0x3546): undefined reference to `tgoto'
(.text+0x3557): undefined reference to `tputs'
/usr/lib/x86_64-linux-gnu/libreadline.a(display.o): In function `rl_redisplay':
(.text+0x4591): undefined reference to `tputs'
(.text+0x50be): undefined reference to `tputs'
/usr/lib/x86_64-linux-gnu/libreadline.a(display.o): In function `rl_clear_visible_line':
(.text+0x5265): undefined reference to `tputs'
/usr/lib/x86_64-linux-gnu/libreadline.a(display.o): In function `_rl_redisplay_after_sigwinch':
(.text+0x53f1): undefined reference to `tputs'
/usr/lib/x86_64-linux-gnu/libreadline.a(display.o):(.text+0x5414): more undefined references to `tputs' follow
/usr/lib/x86_64-linux-gnu/libreadline.a(terminal.o): In function `_rl_get_screen_size':
(.text+0x186): undefined reference to `tgetnum'
(.text+0x2be): undefined reference to `tgetnum'
/usr/lib/x86_64-linux-gnu/libreadline.a(terminal.o): In function `_rl_init_terminal_io':
(.text+0x678): undefined reference to `PC'
(.text+0x687): undefined reference to `BC'
(.text+0x68e): undefined reference to `UP'
(.text+0x728): undefined reference to `tgetent'
(.text+0x76f): undefined reference to `tgetstr'
(.text+0x799): undefined reference to `PC'
(.text+0x7af): undefined reference to `BC'
(.text+0x7bd): undefined reference to `UP'
(.text+0x7cf): undefined reference to `tgetflag'
(.text+0x81e): undefined reference to `tgetflag'
(.text+0x938): undefined reference to `tgetflag'
/usr/lib/x86_64-linux-gnu/libreadline.a(terminal.o): In function `_rl_backspace':
(.text+0xb4b): undefined reference to `tputs'
/usr/lib/x86_64-linux-gnu/libreadline.a(terminal.o): In function `rl_ding':
(.text+0xc1d): undefined reference to `tputs'
/usr/lib/x86_64-linux-gnu/libreadline.a(terminal.o): In function `_rl_enable_meta_key':
(.text+0xc67): undefined reference to `tputs'
/usr/lib/x86_64-linux-gnu/libreadline.a(terminal.o): In function `_rl_disable_meta_key':
(.text+0xcc9): undefined reference to `tputs'
/usr/lib/x86_64-linux-gnu/libreadline.a(terminal.o): In function `_rl_control_keypad':
(.text+0xcfd): undefined reference to `tputs'
/usr/lib/x86_64-linux-gnu/libreadline.a(terminal.o):(.text+0xd50): more undefined references to `tputs' follow
collect2: error: ld returned 1 exit status
CMakeFiles/cmTC_c1683.dir/build.make:98: recipe for target 'cmTC_c1683' failed
make[2]: *** [cmTC_c1683] Error 1
make[2]: Leaving directory '/home/buildbot/builder/monero-static-ubuntu-amd64/build/build/release/CMakeFiles/CMakeTmp'
Makefile:126: recipe for target 'cmTC_c1683/fast' failed
make[1]: *** [cmTC_c1683/fast] Error 2
make[1]: Leaving directory '/home/buildbot/builder/monero-static-ubuntu-amd64/build/build/release/CMakeFiles/CMakeTmp'