(view as text)
Determining if the pthread_create exist failed with the following output:
Change Dir: /home/buildbot/builder/monero-static-ubuntu-amd64/build/build/release/CMakeFiles/CMakeTmp

Run Build Command:"/usr/bin/make" "cmTC_4c857/fast"
make[1]: Entering directory '/home/buildbot/builder/monero-static-ubuntu-amd64/build/build/release/CMakeFiles/CMakeTmp'
/usr/bin/make -f CMakeFiles/cmTC_4c857.dir/build.make CMakeFiles/cmTC_4c857.dir/build
make[2]: Entering directory '/home/buildbot/builder/monero-static-ubuntu-amd64/build/build/release/CMakeFiles/CMakeTmp'
Building C object CMakeFiles/cmTC_4c857.dir/CheckSymbolExists.c.o
/usr/bin/cc    -o CMakeFiles/cmTC_4c857.dir/CheckSymbolExists.c.o   -c /home/buildbot/builder/monero-static-ubuntu-amd64/build/build/release/CMakeFiles/CMakeTmp/CheckSymbolExists.c
Linking C executable cmTC_4c857
/usr/bin/cmake -E cmake_link_script CMakeFiles/cmTC_4c857.dir/link.txt --verbose=1
/usr/bin/cc      -rdynamic CMakeFiles/cmTC_4c857.dir/CheckSymbolExists.c.o  -o cmTC_4c857 
CMakeFiles/cmTC_4c857.dir/CheckSymbolExists.c.o: In function `main':
CheckSymbolExists.c:(.text+0x1b): undefined reference to `pthread_create'
collect2: error: ld returned 1 exit status
CMakeFiles/cmTC_4c857.dir/build.make:97: recipe for target 'cmTC_4c857' failed
make[2]: *** [cmTC_4c857] Error 1
make[2]: Leaving directory '/home/buildbot/builder/monero-static-ubuntu-amd64/build/build/release/CMakeFiles/CMakeTmp'
Makefile:126: recipe for target 'cmTC_4c857/fast' failed
make[1]: *** [cmTC_4c857/fast] Error 2
make[1]: Leaving directory '/home/buildbot/builder/monero-static-ubuntu-amd64/build/build/release/CMakeFiles/CMakeTmp'

File /home/buildbot/builder/monero-static-ubuntu-amd64/build/build/release/CMakeFiles/CMakeTmp/CheckSymbolExists.c:
/* */
#include <pthread.h>

int main(int argc, char** argv)
{
  (void)argv;
#ifndef pthread_create
  return ((int*)(&pthread_create))[argc];
#else
  (void)argc;
  return 0;
#endif
}

Determining if the function memset_s exists in the c failed with the following output:
Change Dir: /home/buildbot/builder/monero-static-ubuntu-amd64/build/build/release/CMakeFiles/CMakeTmp

Run Build Command:"/usr/bin/make" "cmTC_c3b3d/fast"
make[1]: Entering directory '/home/buildbot/builder/monero-static-ubuntu-amd64/build/build/release/CMakeFiles/CMakeTmp'
/usr/bin/make -f CMakeFiles/cmTC_c3b3d.dir/build.make CMakeFiles/cmTC_c3b3d.dir/build
make[2]: Entering directory '/home/buildbot/builder/monero-static-ubuntu-amd64/build/build/release/CMakeFiles/CMakeTmp'
Building C object CMakeFiles/cmTC_c3b3d.dir/CheckFunctionExists.c.o
/usr/bin/cc   -pthread -DCHECK_FUNCTION_EXISTS=memset_s   -o CMakeFiles/cmTC_c3b3d.dir/CheckFunctionExists.c.o   -c /usr/share/cmake-3.10/Modules/CheckFunctionExists.c
Linking C executable cmTC_c3b3d
/usr/bin/cmake -E cmake_link_script CMakeFiles/cmTC_c3b3d.dir/link.txt --verbose=1
/usr/bin/cc  -pthread -DCHECK_FUNCTION_EXISTS=memset_s    -rdynamic CMakeFiles/cmTC_c3b3d.dir/CheckFunctionExists.c.o  -o cmTC_c3b3d  -L/home/buildbot/builder/monero-static-ubuntu-amd64/build/build/release/CMakeFiles/CMakeTmp/string.h -Wl,-rpath,/home/buildbot/builder/monero-static-ubuntu-amd64/build/build/release/CMakeFiles/CMakeTmp/string.h -lc 
CMakeFiles/cmTC_c3b3d.dir/CheckFunctionExists.c.o: In function `main':
CheckFunctionExists.c:(.text+0x10): undefined reference to `memset_s'
collect2: error: ld returned 1 exit status
CMakeFiles/cmTC_c3b3d.dir/build.make:97: recipe for target 'cmTC_c3b3d' failed
make[2]: *** [cmTC_c3b3d] Error 1
make[2]: Leaving directory '/home/buildbot/builder/monero-static-ubuntu-amd64/build/build/release/CMakeFiles/CMakeTmp'
Makefile:126: recipe for target 'cmTC_c3b3d/fast' failed
make[1]: *** [cmTC_c3b3d/fast] Error 2
make[1]: Leaving directory '/home/buildbot/builder/monero-static-ubuntu-amd64/build/build/release/CMakeFiles/CMakeTmp'


Determining if the include file event.h exists failed with the following output:
Change Dir: /home/buildbot/builder/monero-static-ubuntu-amd64/build/build/release/CMakeFiles/CMakeTmp

Run Build Command:"/usr/bin/make" "cmTC_a40ff/fast"
make[1]: Entering directory '/home/buildbot/builder/monero-static-ubuntu-amd64/build/build/release/CMakeFiles/CMakeTmp'
/usr/bin/make -f CMakeFiles/cmTC_a40ff.dir/build.make CMakeFiles/cmTC_a40ff.dir/build
make[2]: Entering directory '/home/buildbot/builder/monero-static-ubuntu-amd64/build/build/release/CMakeFiles/CMakeTmp'
Building C object CMakeFiles/cmTC_a40ff.dir/CheckIncludeFile.c.o
/usr/bin/cc   -pthread    -o CMakeFiles/cmTC_a40ff.dir/CheckIncludeFile.c.o   -c /home/buildbot/builder/monero-static-ubuntu-amd64/build/build/release/CMakeFiles/CMakeTmp/CheckIncludeFile.c
/home/buildbot/builder/monero-static-ubuntu-amd64/build/build/release/CMakeFiles/CMakeTmp/CheckIncludeFile.c:1:10: fatal error: event.h: No such file or directory
 #include <event.h>
          ^~~~~~~~~
compilation terminated.
CMakeFiles/cmTC_a40ff.dir/build.make:65: recipe for target 'CMakeFiles/cmTC_a40ff.dir/CheckIncludeFile.c.o' failed
make[2]: *** [CMakeFiles/cmTC_a40ff.dir/CheckIncludeFile.c.o] Error 1
make[2]: Leaving directory '/home/buildbot/builder/monero-static-ubuntu-amd64/build/build/release/CMakeFiles/CMakeTmp'
Makefile:126: recipe for target 'cmTC_a40ff/fast' failed
make[1]: *** [cmTC_a40ff/fast] Error 2
make[1]: Leaving directory '/home/buildbot/builder/monero-static-ubuntu-amd64/build/build/release/CMakeFiles/CMakeTmp'


Determining if the include file iphlpapi.h exists failed with the following output:
Change Dir: /home/buildbot/builder/monero-static-ubuntu-amd64/build/build/release/CMakeFiles/CMakeTmp

Run Build Command:"/usr/bin/make" "cmTC_496f6/fast"
make[1]: Entering directory '/home/buildbot/builder/monero-static-ubuntu-amd64/build/build/release/CMakeFiles/CMakeTmp'
/usr/bin/make -f CMakeFiles/cmTC_496f6.dir/build.make CMakeFiles/cmTC_496f6.dir/build
make[2]: Entering directory '/home/buildbot/builder/monero-static-ubuntu-amd64/build/build/release/CMakeFiles/CMakeTmp'
Building C object CMakeFiles/cmTC_496f6.dir/CheckIncludeFile.c.o
/usr/bin/cc   -pthread    -o CMakeFiles/cmTC_496f6.dir/CheckIncludeFile.c.o   -c /home/buildbot/builder/monero-static-ubuntu-amd64/build/build/release/CMakeFiles/CMakeTmp/CheckIncludeFile.c
/home/buildbot/builder/monero-static-ubuntu-amd64/build/build/release/CMakeFiles/CMakeTmp/CheckIncludeFile.c:1:10: fatal error: iphlpapi.h: No such file or directory
 #include <iphlpapi.h>
          ^~~~~~~~~~~~
compilation terminated.
CMakeFiles/cmTC_496f6.dir/build.make:65: recipe for target 'CMakeFiles/cmTC_496f6.dir/CheckIncludeFile.c.o' failed
make[2]: *** [CMakeFiles/cmTC_496f6.dir/CheckIncludeFile.c.o] Error 1
make[2]: Leaving directory '/home/buildbot/builder/monero-static-ubuntu-amd64/build/build/release/CMakeFiles/CMakeTmp'
Makefile:126: recipe for target 'cmTC_496f6/fast' failed
make[1]: *** [cmTC_496f6/fast] Error 2
make[1]: Leaving directory '/home/buildbot/builder/monero-static-ubuntu-amd64/build/build/release/CMakeFiles/CMakeTmp'


Determining if the include file login_cap.h exists failed with the following output:
Change Dir: /home/buildbot/builder/monero-static-ubuntu-amd64/build/build/release/CMakeFiles/CMakeTmp

Run Build Command:"/usr/bin/make" "cmTC_72763/fast"
make[1]: Entering directory '/home/buildbot/builder/monero-static-ubuntu-amd64/build/build/release/CMakeFiles/CMakeTmp'
/usr/bin/make -f CMakeFiles/cmTC_72763.dir/build.make CMakeFiles/cmTC_72763.dir/build
make[2]: Entering directory '/home/buildbot/builder/monero-static-ubuntu-amd64/build/build/release/CMakeFiles/CMakeTmp'
Building C object CMakeFiles/cmTC_72763.dir/CheckIncludeFile.c.o
/usr/bin/cc   -pthread    -o CMakeFiles/cmTC_72763.dir/CheckIncludeFile.c.o   -c /home/buildbot/builder/monero-static-ubuntu-amd64/build/build/release/CMakeFiles/CMakeTmp/CheckIncludeFile.c
/home/buildbot/builder/monero-static-ubuntu-amd64/build/build/release/CMakeFiles/CMakeTmp/CheckIncludeFile.c:1:10: fatal error: login_cap.h: No such file or directory
 #include <login_cap.h>
          ^~~~~~~~~~~~~
compilation terminated.
CMakeFiles/cmTC_72763.dir/build.make:65: recipe for target 'CMakeFiles/cmTC_72763.dir/CheckIncludeFile.c.o' failed
make[2]: *** [CMakeFiles/cmTC_72763.dir/CheckIncludeFile.c.o] Error 1
make[2]: Leaving directory '/home/buildbot/builder/monero-static-ubuntu-amd64/build/build/release/CMakeFiles/CMakeTmp'
Makefile:126: recipe for target 'cmTC_72763/fast' failed
make[1]: *** [cmTC_72763/fast] Error 2
make[1]: Leaving directory '/home/buildbot/builder/monero-static-ubuntu-amd64/build/build/release/CMakeFiles/CMakeTmp'


Determining if the include file sys/sha2.h exists failed with the following output:
Change Dir: /home/buildbot/builder/monero-static-ubuntu-amd64/build/build/release/CMakeFiles/CMakeTmp

Run Build Command:"/usr/bin/make" "cmTC_ced28/fast"
make[1]: Entering directory '/home/buildbot/builder/monero-static-ubuntu-amd64/build/build/release/CMakeFiles/CMakeTmp'
/usr/bin/make -f CMakeFiles/cmTC_ced28.dir/build.make CMakeFiles/cmTC_ced28.dir/build
make[2]: Entering directory '/home/buildbot/builder/monero-static-ubuntu-amd64/build/build/release/CMakeFiles/CMakeTmp'
Building C object CMakeFiles/cmTC_ced28.dir/CheckIncludeFile.c.o
/usr/bin/cc   -pthread    -o CMakeFiles/cmTC_ced28.dir/CheckIncludeFile.c.o   -c /home/buildbot/builder/monero-static-ubuntu-amd64/build/build/release/CMakeFiles/CMakeTmp/CheckIncludeFile.c
/home/buildbot/builder/monero-static-ubuntu-amd64/build/build/release/CMakeFiles/CMakeTmp/CheckIncludeFile.c:1:10: fatal error: sys/sha2.h: No such file or directory
 #include <sys/sha2.h>
          ^~~~~~~~~~~~
compilation terminated.
CMakeFiles/cmTC_ced28.dir/build.make:65: recipe for target 'CMakeFiles/cmTC_ced28.dir/CheckIncludeFile.c.o' failed
make[2]: *** [CMakeFiles/cmTC_ced28.dir/CheckIncludeFile.c.o] Error 1
make[2]: Leaving directory '/home/buildbot/builder/monero-static-ubuntu-amd64/build/build/release/CMakeFiles/CMakeTmp'
Makefile:126: recipe for target 'cmTC_ced28/fast' failed
make[1]: *** [cmTC_ced28/fast] Error 2
make[1]: Leaving directory '/home/buildbot/builder/monero-static-ubuntu-amd64/build/build/release/CMakeFiles/CMakeTmp'


Determining if the include file vfork.h exists failed with the following output:
Change Dir: /home/buildbot/builder/monero-static-ubuntu-amd64/build/build/release/CMakeFiles/CMakeTmp

Run Build Command:"/usr/bin/make" "cmTC_21410/fast"
make[1]: Entering directory '/home/buildbot/builder/monero-static-ubuntu-amd64/build/build/release/CMakeFiles/CMakeTmp'
/usr/bin/make -f CMakeFiles/cmTC_21410.dir/build.make CMakeFiles/cmTC_21410.dir/build
make[2]: Entering directory '/home/buildbot/builder/monero-static-ubuntu-amd64/build/build/release/CMakeFiles/CMakeTmp'
Building C object CMakeFiles/cmTC_21410.dir/CheckIncludeFile.c.o
/usr/bin/cc   -pthread    -o CMakeFiles/cmTC_21410.dir/CheckIncludeFile.c.o   -c /home/buildbot/builder/monero-static-ubuntu-amd64/build/build/release/CMakeFiles/CMakeTmp/CheckIncludeFile.c
/home/buildbot/builder/monero-static-ubuntu-amd64/build/build/release/CMakeFiles/CMakeTmp/CheckIncludeFile.c:1:10: fatal error: vfork.h: No such file or directory
 #include <vfork.h>
          ^~~~~~~~~
compilation terminated.
CMakeFiles/cmTC_21410.dir/build.make:65: recipe for target 'CMakeFiles/cmTC_21410.dir/CheckIncludeFile.c.o' failed
make[2]: *** [CMakeFiles/cmTC_21410.dir/CheckIncludeFile.c.o] Error 1
make[2]: Leaving directory '/home/buildbot/builder/monero-static-ubuntu-amd64/build/build/release/CMakeFiles/CMakeTmp'
Makefile:126: recipe for target 'cmTC_21410/fast' failed
make[1]: *** [cmTC_21410/fast] Error 2
make[1]: Leaving directory '/home/buildbot/builder/monero-static-ubuntu-amd64/build/build/release/CMakeFiles/CMakeTmp'


Determining if the include file windows.h exists failed with the following output:
Change Dir: /home/buildbot/builder/monero-static-ubuntu-amd64/build/build/release/CMakeFiles/CMakeTmp

Run Build Command:"/usr/bin/make" "cmTC_dfca9/fast"
make[1]: Entering directory '/home/buildbot/builder/monero-static-ubuntu-amd64/build/build/release/CMakeFiles/CMakeTmp'
/usr/bin/make -f CMakeFiles/cmTC_dfca9.dir/build.make CMakeFiles/cmTC_dfca9.dir/build
make[2]: Entering directory '/home/buildbot/builder/monero-static-ubuntu-amd64/build/build/release/CMakeFiles/CMakeTmp'
Building C object CMakeFiles/cmTC_dfca9.dir/CheckIncludeFile.c.o
/usr/bin/cc   -pthread    -o CMakeFiles/cmTC_dfca9.dir/CheckIncludeFile.c.o   -c /home/buildbot/builder/monero-static-ubuntu-amd64/build/build/release/CMakeFiles/CMakeTmp/CheckIncludeFile.c
/home/buildbot/builder/monero-static-ubuntu-amd64/build/build/release/CMakeFiles/CMakeTmp/CheckIncludeFile.c:1:10: fatal error: windows.h: No such file or directory
 #include <windows.h>
          ^~~~~~~~~~~
compilation terminated.
CMakeFiles/cmTC_dfca9.dir/build.make:65: recipe for target 'CMakeFiles/cmTC_dfca9.dir/CheckIncludeFile.c.o' failed
make[2]: *** [CMakeFiles/cmTC_dfca9.dir/CheckIncludeFile.c.o] Error 1
make[2]: Leaving directory '/home/buildbot/builder/monero-static-ubuntu-amd64/build/build/release/CMakeFiles/CMakeTmp'
Makefile:126: recipe for target 'cmTC_dfca9/fast' failed
make[1]: *** [cmTC_dfca9/fast] Error 2
make[1]: Leaving directory '/home/buildbot/builder/monero-static-ubuntu-amd64/build/build/release/CMakeFiles/CMakeTmp'


Determining if the include file winsock2.h exists failed with the following output:
Change Dir: /home/buildbot/builder/monero-static-ubuntu-amd64/build/build/release/CMakeFiles/CMakeTmp

Run Build Command:"/usr/bin/make" "cmTC_c7a00/fast"
make[1]: Entering directory '/home/buildbot/builder/monero-static-ubuntu-amd64/build/build/release/CMakeFiles/CMakeTmp'
/usr/bin/make -f CMakeFiles/cmTC_c7a00.dir/build.make CMakeFiles/cmTC_c7a00.dir/build
make[2]: Entering directory '/home/buildbot/builder/monero-static-ubuntu-amd64/build/build/release/CMakeFiles/CMakeTmp'
Building C object CMakeFiles/cmTC_c7a00.dir/CheckIncludeFile.c.o
/usr/bin/cc   -pthread    -o CMakeFiles/cmTC_c7a00.dir/CheckIncludeFile.c.o   -c /home/buildbot/builder/monero-static-ubuntu-amd64/build/build/release/CMakeFiles/CMakeTmp/CheckIncludeFile.c
/home/buildbot/builder/monero-static-ubuntu-amd64/build/build/release/CMakeFiles/CMakeTmp/CheckIncludeFile.c:1:10: fatal error: winsock2.h: No such file or directory
 #include <winsock2.h>
          ^~~~~~~~~~~~
compilation terminated.
CMakeFiles/cmTC_c7a00.dir/build.make:65: recipe for target 'CMakeFiles/cmTC_c7a00.dir/CheckIncludeFile.c.o' failed
make[2]: *** [CMakeFiles/cmTC_c7a00.dir/CheckIncludeFile.c.o] Error 1
make[2]: Leaving directory '/home/buildbot/builder/monero-static-ubuntu-amd64/build/build/release/CMakeFiles/CMakeTmp'
Makefile:126: recipe for target 'cmTC_c7a00/fast' failed
make[1]: *** [cmTC_c7a00/fast] Error 2
make[1]: Leaving directory '/home/buildbot/builder/monero-static-ubuntu-amd64/build/build/release/CMakeFiles/CMakeTmp'


Determining if the include file ws2tcpip.h exists failed with the following output:
Change Dir: /home/buildbot/builder/monero-static-ubuntu-amd64/build/build/release/CMakeFiles/CMakeTmp

Run Build Command:"/usr/bin/make" "cmTC_67567/fast"
make[1]: Entering directory '/home/buildbot/builder/monero-static-ubuntu-amd64/build/build/release/CMakeFiles/CMakeTmp'
/usr/bin/make -f CMakeFiles/cmTC_67567.dir/build.make CMakeFiles/cmTC_67567.dir/build
make[2]: Entering directory '/home/buildbot/builder/monero-static-ubuntu-amd64/build/build/release/CMakeFiles/CMakeTmp'
Building C object CMakeFiles/cmTC_67567.dir/CheckIncludeFile.c.o
/usr/bin/cc   -pthread    -o CMakeFiles/cmTC_67567.dir/CheckIncludeFile.c.o   -c /home/buildbot/builder/monero-static-ubuntu-amd64/build/build/release/CMakeFiles/CMakeTmp/CheckIncludeFile.c
/home/buildbot/builder/monero-static-ubuntu-amd64/build/build/release/CMakeFiles/CMakeTmp/CheckIncludeFile.c:1:10: fatal error: ws2tcpip.h: No such file or directory
 #include <ws2tcpip.h>
          ^~~~~~~~~~~~
compilation terminated.
CMakeFiles/cmTC_67567.dir/build.make:65: recipe for target 'CMakeFiles/cmTC_67567.dir/CheckIncludeFile.c.o' failed
make[2]: *** [CMakeFiles/cmTC_67567.dir/CheckIncludeFile.c.o] Error 1
make[2]: Leaving directory '/home/buildbot/builder/monero-static-ubuntu-amd64/build/build/release/CMakeFiles/CMakeTmp'
Makefile:126: recipe for target 'cmTC_67567/fast' failed
make[1]: *** [cmTC_67567/fast] Error 2
make[1]: Leaving directory '/home/buildbot/builder/monero-static-ubuntu-amd64/build/build/release/CMakeFiles/CMakeTmp'


Determining if the function _beginthreadex exists failed with the following output:
Change Dir: /home/buildbot/builder/monero-static-ubuntu-amd64/build/build/release/CMakeFiles/CMakeTmp

Run Build Command:"/usr/bin/make" "cmTC_8cdfb/fast"
make[1]: Entering directory '/home/buildbot/builder/monero-static-ubuntu-amd64/build/build/release/CMakeFiles/CMakeTmp'
/usr/bin/make -f CMakeFiles/cmTC_8cdfb.dir/build.make CMakeFiles/cmTC_8cdfb.dir/build
make[2]: Entering directory '/home/buildbot/builder/monero-static-ubuntu-amd64/build/build/release/CMakeFiles/CMakeTmp'
Building C object CMakeFiles/cmTC_8cdfb.dir/CheckFunctionExists.c.o
/usr/bin/cc   -pthread -DCHECK_FUNCTION_EXISTS=_beginthreadex   -o CMakeFiles/cmTC_8cdfb.dir/CheckFunctionExists.c.o   -c /usr/share/cmake-3.10/Modules/CheckFunctionExists.c
Linking C executable cmTC_8cdfb
/usr/bin/cmake -E cmake_link_script CMakeFiles/cmTC_8cdfb.dir/link.txt --verbose=1
/usr/bin/cc  -pthread -DCHECK_FUNCTION_EXISTS=_beginthreadex    -rdynamic CMakeFiles/cmTC_8cdfb.dir/CheckFunctionExists.c.o  -o cmTC_8cdfb 
CMakeFiles/cmTC_8cdfb.dir/CheckFunctionExists.c.o: In function `main':
CheckFunctionExists.c:(.text+0x10): undefined reference to `_beginthreadex'
collect2: error: ld returned 1 exit status
CMakeFiles/cmTC_8cdfb.dir/build.make:97: recipe for target 'cmTC_8cdfb' failed
make[2]: *** [cmTC_8cdfb] Error 1
make[2]: Leaving directory '/home/buildbot/builder/monero-static-ubuntu-amd64/build/build/release/CMakeFiles/CMakeTmp'
Makefile:126: recipe for target 'cmTC_8cdfb/fast' failed
make[1]: *** [cmTC_8cdfb/fast] Error 2
make[1]: Leaving directory '/home/buildbot/builder/monero-static-ubuntu-amd64/build/build/release/CMakeFiles/CMakeTmp'


Determining if the function arc4random exists failed with the following output:
Change Dir: /home/buildbot/builder/monero-static-ubuntu-amd64/build/build/release/CMakeFiles/CMakeTmp

Run Build Command:"/usr/bin/make" "cmTC_7b3f7/fast"
make[1]: Entering directory '/home/buildbot/builder/monero-static-ubuntu-amd64/build/build/release/CMakeFiles/CMakeTmp'
/usr/bin/make -f CMakeFiles/cmTC_7b3f7.dir/build.make CMakeFiles/cmTC_7b3f7.dir/build
make[2]: Entering directory '/home/buildbot/builder/monero-static-ubuntu-amd64/build/build/release/CMakeFiles/CMakeTmp'
Building C object CMakeFiles/cmTC_7b3f7.dir/CheckFunctionExists.c.o
/usr/bin/cc   -pthread -DCHECK_FUNCTION_EXISTS=arc4random   -o CMakeFiles/cmTC_7b3f7.dir/CheckFunctionExists.c.o   -c /usr/share/cmake-3.10/Modules/CheckFunctionExists.c
Linking C executable cmTC_7b3f7
/usr/bin/cmake -E cmake_link_script CMakeFiles/cmTC_7b3f7.dir/link.txt --verbose=1
/usr/bin/cc  -pthread -DCHECK_FUNCTION_EXISTS=arc4random    -rdynamic CMakeFiles/cmTC_7b3f7.dir/CheckFunctionExists.c.o  -o cmTC_7b3f7 
CMakeFiles/cmTC_7b3f7.dir/CheckFunctionExists.c.o: In function `main':
CheckFunctionExists.c:(.text+0x10): undefined reference to `arc4random'
collect2: error: ld returned 1 exit status
CMakeFiles/cmTC_7b3f7.dir/build.make:97: recipe for target 'cmTC_7b3f7' failed
make[2]: *** [cmTC_7b3f7] Error 1
make[2]: Leaving directory '/home/buildbot/builder/monero-static-ubuntu-amd64/build/build/release/CMakeFiles/CMakeTmp'
Makefile:126: recipe for target 'cmTC_7b3f7/fast' failed
make[1]: *** [cmTC_7b3f7/fast] Error 2
make[1]: Leaving directory '/home/buildbot/builder/monero-static-ubuntu-amd64/build/build/release/CMakeFiles/CMakeTmp'


Determining if the function arc4random_uniform exists failed with the following output:
Change Dir: /home/buildbot/builder/monero-static-ubuntu-amd64/build/build/release/CMakeFiles/CMakeTmp

Run Build Command:"/usr/bin/make" "cmTC_8b62e/fast"
make[1]: Entering directory '/home/buildbot/builder/monero-static-ubuntu-amd64/build/build/release/CMakeFiles/CMakeTmp'
/usr/bin/make -f CMakeFiles/cmTC_8b62e.dir/build.make CMakeFiles/cmTC_8b62e.dir/build
make[2]: Entering directory '/home/buildbot/builder/monero-static-ubuntu-amd64/build/build/release/CMakeFiles/CMakeTmp'
Building C object CMakeFiles/cmTC_8b62e.dir/CheckFunctionExists.c.o
/usr/bin/cc   -pthread -DCHECK_FUNCTION_EXISTS=arc4random_uniform   -o CMakeFiles/cmTC_8b62e.dir/CheckFunctionExists.c.o   -c /usr/share/cmake-3.10/Modules/CheckFunctionExists.c
Linking C executable cmTC_8b62e
/usr/bin/cmake -E cmake_link_script CMakeFiles/cmTC_8b62e.dir/link.txt --verbose=1
/usr/bin/cc  -pthread -DCHECK_FUNCTION_EXISTS=arc4random_uniform    -rdynamic CMakeFiles/cmTC_8b62e.dir/CheckFunctionExists.c.o  -o cmTC_8b62e 
CMakeFiles/cmTC_8b62e.dir/CheckFunctionExists.c.o: In function `main':
CheckFunctionExists.c:(.text+0x10): undefined reference to `arc4random_uniform'
collect2: error: ld returned 1 exit status
CMakeFiles/cmTC_8b62e.dir/build.make:97: recipe for target 'cmTC_8b62e' failed
make[2]: *** [cmTC_8b62e] Error 1
make[2]: Leaving directory '/home/buildbot/builder/monero-static-ubuntu-amd64/build/build/release/CMakeFiles/CMakeTmp'
Makefile:126: recipe for target 'cmTC_8b62e/fast' failed
make[1]: *** [cmTC_8b62e/fast] Error 2
make[1]: Leaving directory '/home/buildbot/builder/monero-static-ubuntu-amd64/build/build/release/CMakeFiles/CMakeTmp'


Determining if the function ioctlsocket exists failed with the following output:
Change Dir: /home/buildbot/builder/monero-static-ubuntu-amd64/build/build/release/CMakeFiles/CMakeTmp

Run Build Command:"/usr/bin/make" "cmTC_c9028/fast"
make[1]: Entering directory '/home/buildbot/builder/monero-static-ubuntu-amd64/build/build/release/CMakeFiles/CMakeTmp'
/usr/bin/make -f CMakeFiles/cmTC_c9028.dir/build.make CMakeFiles/cmTC_c9028.dir/build
make[2]: Entering directory '/home/buildbot/builder/monero-static-ubuntu-amd64/build/build/release/CMakeFiles/CMakeTmp'
Building C object CMakeFiles/cmTC_c9028.dir/CheckFunctionExists.c.o
/usr/bin/cc   -pthread -DCHECK_FUNCTION_EXISTS=ioctlsocket   -o CMakeFiles/cmTC_c9028.dir/CheckFunctionExists.c.o   -c /usr/share/cmake-3.10/Modules/CheckFunctionExists.c
Linking C executable cmTC_c9028
/usr/bin/cmake -E cmake_link_script CMakeFiles/cmTC_c9028.dir/link.txt --verbose=1
/usr/bin/cc  -pthread -DCHECK_FUNCTION_EXISTS=ioctlsocket    -rdynamic CMakeFiles/cmTC_c9028.dir/CheckFunctionExists.c.o  -o cmTC_c9028 
CMakeFiles/cmTC_c9028.dir/CheckFunctionExists.c.o: In function `main':
CheckFunctionExists.c:(.text+0x10): undefined reference to `ioctlsocket'
collect2: error: ld returned 1 exit status
CMakeFiles/cmTC_c9028.dir/build.make:97: recipe for target 'cmTC_c9028' failed
make[2]: *** [cmTC_c9028] Error 1
make[2]: Leaving directory '/home/buildbot/builder/monero-static-ubuntu-amd64/build/build/release/CMakeFiles/CMakeTmp'
Makefile:126: recipe for target 'cmTC_c9028/fast' failed
make[1]: *** [cmTC_c9028/fast] Error 2
make[1]: Leaving directory '/home/buildbot/builder/monero-static-ubuntu-amd64/build/build/release/CMakeFiles/CMakeTmp'


Determining if the function setusercontent exists failed with the following output:
Change Dir: /home/buildbot/builder/monero-static-ubuntu-amd64/build/build/release/CMakeFiles/CMakeTmp

Run Build Command:"/usr/bin/make" "cmTC_b1de9/fast"
make[1]: Entering directory '/home/buildbot/builder/monero-static-ubuntu-amd64/build/build/release/CMakeFiles/CMakeTmp'
/usr/bin/make -f CMakeFiles/cmTC_b1de9.dir/build.make CMakeFiles/cmTC_b1de9.dir/build
make[2]: Entering directory '/home/buildbot/builder/monero-static-ubuntu-amd64/build/build/release/CMakeFiles/CMakeTmp'
Building C object CMakeFiles/cmTC_b1de9.dir/CheckFunctionExists.c.o
/usr/bin/cc   -pthread -DCHECK_FUNCTION_EXISTS=setusercontent   -o CMakeFiles/cmTC_b1de9.dir/CheckFunctionExists.c.o   -c /usr/share/cmake-3.10/Modules/CheckFunctionExists.c
Linking C executable cmTC_b1de9
/usr/bin/cmake -E cmake_link_script CMakeFiles/cmTC_b1de9.dir/link.txt --verbose=1
/usr/bin/cc  -pthread -DCHECK_FUNCTION_EXISTS=setusercontent    -rdynamic CMakeFiles/cmTC_b1de9.dir/CheckFunctionExists.c.o  -o cmTC_b1de9 
CMakeFiles/cmTC_b1de9.dir/CheckFunctionExists.c.o: In function `main':
CheckFunctionExists.c:(.text+0x10): undefined reference to `setusercontent'
collect2: error: ld returned 1 exit status
CMakeFiles/cmTC_b1de9.dir/build.make:97: recipe for target 'cmTC_b1de9' failed
make[2]: *** [cmTC_b1de9] Error 1
make[2]: Leaving directory '/home/buildbot/builder/monero-static-ubuntu-amd64/build/build/release/CMakeFiles/CMakeTmp'
Makefile:126: recipe for target 'cmTC_b1de9/fast' failed
make[1]: *** [cmTC_b1de9/fast] Error 2
make[1]: Leaving directory '/home/buildbot/builder/monero-static-ubuntu-amd64/build/build/release/CMakeFiles/CMakeTmp'


Determining if the function strlcat exists failed with the following output:
Change Dir: /home/buildbot/builder/monero-static-ubuntu-amd64/build/build/release/CMakeFiles/CMakeTmp

Run Build Command:"/usr/bin/make" "cmTC_c7f99/fast"
make[1]: Entering directory '/home/buildbot/builder/monero-static-ubuntu-amd64/build/build/release/CMakeFiles/CMakeTmp'
/usr/bin/make -f CMakeFiles/cmTC_c7f99.dir/build.make CMakeFiles/cmTC_c7f99.dir/build
make[2]: Entering directory '/home/buildbot/builder/monero-static-ubuntu-amd64/build/build/release/CMakeFiles/CMakeTmp'
Building C object CMakeFiles/cmTC_c7f99.dir/CheckFunctionExists.c.o
/usr/bin/cc   -pthread -DCHECK_FUNCTION_EXISTS=strlcat   -o CMakeFiles/cmTC_c7f99.dir/CheckFunctionExists.c.o   -c /usr/share/cmake-3.10/Modules/CheckFunctionExists.c
Linking C executable cmTC_c7f99
/usr/bin/cmake -E cmake_link_script CMakeFiles/cmTC_c7f99.dir/link.txt --verbose=1
/usr/bin/cc  -pthread -DCHECK_FUNCTION_EXISTS=strlcat    -rdynamic CMakeFiles/cmTC_c7f99.dir/CheckFunctionExists.c.o  -o cmTC_c7f99 
CMakeFiles/cmTC_c7f99.dir/CheckFunctionExists.c.o: In function `main':
CheckFunctionExists.c:(.text+0x10): undefined reference to `strlcat'
collect2: error: ld returned 1 exit status
CMakeFiles/cmTC_c7f99.dir/build.make:97: recipe for target 'cmTC_c7f99' failed
make[2]: *** [cmTC_c7f99] Error 1
make[2]: Leaving directory '/home/buildbot/builder/monero-static-ubuntu-amd64/build/build/release/CMakeFiles/CMakeTmp'
Makefile:126: recipe for target 'cmTC_c7f99/fast' failed
make[1]: *** [cmTC_c7f99/fast] Error 2
make[1]: Leaving directory '/home/buildbot/builder/monero-static-ubuntu-amd64/build/build/release/CMakeFiles/CMakeTmp'


Determining if the function strlcpy exists failed with the following output:
Change Dir: /home/buildbot/builder/monero-static-ubuntu-amd64/build/build/release/CMakeFiles/CMakeTmp

Run Build Command:"/usr/bin/make" "cmTC_c2577/fast"
make[1]: Entering directory '/home/buildbot/builder/monero-static-ubuntu-amd64/build/build/release/CMakeFiles/CMakeTmp'
/usr/bin/make -f CMakeFiles/cmTC_c2577.dir/build.make CMakeFiles/cmTC_c2577.dir/build
make[2]: Entering directory '/home/buildbot/builder/monero-static-ubuntu-amd64/build/build/release/CMakeFiles/CMakeTmp'
Building C object CMakeFiles/cmTC_c2577.dir/CheckFunctionExists.c.o
/usr/bin/cc   -pthread -DCHECK_FUNCTION_EXISTS=strlcpy   -o CMakeFiles/cmTC_c2577.dir/CheckFunctionExists.c.o   -c /usr/share/cmake-3.10/Modules/CheckFunctionExists.c
Linking C executable cmTC_c2577
/usr/bin/cmake -E cmake_link_script CMakeFiles/cmTC_c2577.dir/link.txt --verbose=1
/usr/bin/cc  -pthread -DCHECK_FUNCTION_EXISTS=strlcpy    -rdynamic CMakeFiles/cmTC_c2577.dir/CheckFunctionExists.c.o  -o cmTC_c2577 
CMakeFiles/cmTC_c2577.dir/CheckFunctionExists.c.o: In function `main':
CheckFunctionExists.c:(.text+0x10): undefined reference to `strlcpy'
collect2: error: ld returned 1 exit status
CMakeFiles/cmTC_c2577.dir/build.make:97: recipe for target 'cmTC_c2577' failed
make[2]: *** [cmTC_c2577] Error 1
make[2]: Leaving directory '/home/buildbot/builder/monero-static-ubuntu-amd64/build/build/release/CMakeFiles/CMakeTmp'
Makefile:126: recipe for target 'cmTC_c2577/fast' failed
make[1]: *** [cmTC_c2577/fast] Error 2
make[1]: Leaving directory '/home/buildbot/builder/monero-static-ubuntu-amd64/build/build/release/CMakeFiles/CMakeTmp'


Determining if the PTHREAD_PRIO_INHERIT exist failed with the following output:
Change Dir: /home/buildbot/builder/monero-static-ubuntu-amd64/build/build/release/CMakeFiles/CMakeTmp

Run Build Command:"/usr/bin/make" "cmTC_f41da/fast"
make[1]: Entering directory '/home/buildbot/builder/monero-static-ubuntu-amd64/build/build/release/CMakeFiles/CMakeTmp'
/usr/bin/make -f CMakeFiles/cmTC_f41da.dir/build.make CMakeFiles/cmTC_f41da.dir/build
make[2]: Entering directory '/home/buildbot/builder/monero-static-ubuntu-amd64/build/build/release/CMakeFiles/CMakeTmp'
Building C object CMakeFiles/cmTC_f41da.dir/CheckSymbolExists.c.o
/usr/bin/cc   -pthread    -o CMakeFiles/cmTC_f41da.dir/CheckSymbolExists.c.o   -c /home/buildbot/builder/monero-static-ubuntu-amd64/build/build/release/CMakeFiles/CMakeTmp/CheckSymbolExists.c
/home/buildbot/builder/monero-static-ubuntu-amd64/build/build/release/CMakeFiles/CMakeTmp/CheckSymbolExists.c: In function 'main':
/home/buildbot/builder/monero-static-ubuntu-amd64/build/build/release/CMakeFiles/CMakeTmp/CheckSymbolExists.c:8:18: error: lvalue required as unary '&' operand
   return ((int*)(&PTHREAD_PRIO_INHERIT))[argc];
                  ^
CMakeFiles/cmTC_f41da.dir/build.make:65: recipe for target 'CMakeFiles/cmTC_f41da.dir/CheckSymbolExists.c.o' failed
make[2]: *** [CMakeFiles/cmTC_f41da.dir/CheckSymbolExists.c.o] Error 1
make[2]: Leaving directory '/home/buildbot/builder/monero-static-ubuntu-amd64/build/build/release/CMakeFiles/CMakeTmp'
Makefile:126: recipe for target 'cmTC_f41da/fast' failed
make[1]: *** [cmTC_f41da/fast] Error 2
make[1]: Leaving directory '/home/buildbot/builder/monero-static-ubuntu-amd64/build/build/release/CMakeFiles/CMakeTmp'

File /home/buildbot/builder/monero-static-ubuntu-amd64/build/build/release/CMakeFiles/CMakeTmp/CheckSymbolExists.c:
/* */
#include <pthread.h>

int main(int argc, char** argv)
{
  (void)argv;
#ifndef PTHREAD_PRIO_INHERIT
  return ((int*)(&PTHREAD_PRIO_INHERIT))[argc];
#else
  (void)argc;
  return 0;
#endif
}

Determining if the pthread_rwlock_t exist failed with the following output:
Change Dir: /home/buildbot/builder/monero-static-ubuntu-amd64/build/build/release/CMakeFiles/CMakeTmp

Run Build Command:"/usr/bin/make" "cmTC_e1cd8/fast"
make[1]: Entering directory '/home/buildbot/builder/monero-static-ubuntu-amd64/build/build/release/CMakeFiles/CMakeTmp'
/usr/bin/make -f CMakeFiles/cmTC_e1cd8.dir/build.make CMakeFiles/cmTC_e1cd8.dir/build
make[2]: Entering directory '/home/buildbot/builder/monero-static-ubuntu-amd64/build/build/release/CMakeFiles/CMakeTmp'
Building C object CMakeFiles/cmTC_e1cd8.dir/CheckSymbolExists.c.o
/usr/bin/cc   -pthread    -o CMakeFiles/cmTC_e1cd8.dir/CheckSymbolExists.c.o   -c /home/buildbot/builder/monero-static-ubuntu-amd64/build/build/release/CMakeFiles/CMakeTmp/CheckSymbolExists.c
/home/buildbot/builder/monero-static-ubuntu-amd64/build/build/release/CMakeFiles/CMakeTmp/CheckSymbolExists.c: In function 'main':
/home/buildbot/builder/monero-static-ubuntu-amd64/build/build/release/CMakeFiles/CMakeTmp/CheckSymbolExists.c:8:19: error: expected expression before 'pthread_rwlock_t'
   return ((int*)(&pthread_rwlock_t))[argc];
                   ^~~~~~~~~~~~~~~~
CMakeFiles/cmTC_e1cd8.dir/build.make:65: recipe for target 'CMakeFiles/cmTC_e1cd8.dir/CheckSymbolExists.c.o' failed
make[2]: *** [CMakeFiles/cmTC_e1cd8.dir/CheckSymbolExists.c.o] Error 1
make[2]: Leaving directory '/home/buildbot/builder/monero-static-ubuntu-amd64/build/build/release/CMakeFiles/CMakeTmp'
Makefile:126: recipe for target 'cmTC_e1cd8/fast' failed
make[1]: *** [cmTC_e1cd8/fast] Error 2
make[1]: Leaving directory '/home/buildbot/builder/monero-static-ubuntu-amd64/build/build/release/CMakeFiles/CMakeTmp'

File /home/buildbot/builder/monero-static-ubuntu-amd64/build/build/release/CMakeFiles/CMakeTmp/CheckSymbolExists.c:
/* */
#include <pthread.h>

int main(int argc, char** argv)
{
  (void)argv;
#ifndef pthread_rwlock_t
  return ((int*)(&pthread_rwlock_t))[argc];
#else
  (void)argc;
  return 0;
#endif
}

Determining if the pthread_spinlock_t exist failed with the following output:
Change Dir: /home/buildbot/builder/monero-static-ubuntu-amd64/build/build/release/CMakeFiles/CMakeTmp

Run Build Command:"/usr/bin/make" "cmTC_adfef/fast"
make[1]: Entering directory '/home/buildbot/builder/monero-static-ubuntu-amd64/build/build/release/CMakeFiles/CMakeTmp'
/usr/bin/make -f CMakeFiles/cmTC_adfef.dir/build.make CMakeFiles/cmTC_adfef.dir/build
make[2]: Entering directory '/home/buildbot/builder/monero-static-ubuntu-amd64/build/build/release/CMakeFiles/CMakeTmp'
Building C object CMakeFiles/cmTC_adfef.dir/CheckSymbolExists.c.o
/usr/bin/cc   -pthread    -o CMakeFiles/cmTC_adfef.dir/CheckSymbolExists.c.o   -c /home/buildbot/builder/monero-static-ubuntu-amd64/build/build/release/CMakeFiles/CMakeTmp/CheckSymbolExists.c
/home/buildbot/builder/monero-static-ubuntu-amd64/build/build/release/CMakeFiles/CMakeTmp/CheckSymbolExists.c: In function 'main':
/home/buildbot/builder/monero-static-ubuntu-amd64/build/build/release/CMakeFiles/CMakeTmp/CheckSymbolExists.c:8:19: error: expected expression before 'pthread_spinlock_t'
   return ((int*)(&pthread_spinlock_t))[argc];
                   ^~~~~~~~~~~~~~~~~~
CMakeFiles/cmTC_adfef.dir/build.make:65: recipe for target 'CMakeFiles/cmTC_adfef.dir/CheckSymbolExists.c.o' failed
make[2]: *** [CMakeFiles/cmTC_adfef.dir/CheckSymbolExists.c.o] Error 1
make[2]: Leaving directory '/home/buildbot/builder/monero-static-ubuntu-amd64/build/build/release/CMakeFiles/CMakeTmp'
Makefile:126: recipe for target 'cmTC_adfef/fast' failed
make[1]: *** [cmTC_adfef/fast] Error 2
make[1]: Leaving directory '/home/buildbot/builder/monero-static-ubuntu-amd64/build/build/release/CMakeFiles/CMakeTmp'

File /home/buildbot/builder/monero-static-ubuntu-amd64/build/build/release/CMakeFiles/CMakeTmp/CheckSymbolExists.c:
/* */
#include <pthread.h>

int main(int argc, char** argv)
{
  (void)argv;
#ifndef pthread_spinlock_t
  return ((int*)(&pthread_spinlock_t))[argc];
#else
  (void)argc;
  return 0;
#endif
}

Determining if the LIBRESSL_VERSION_TEXT exist failed with the following output:
Change Dir: /home/buildbot/builder/monero-static-ubuntu-amd64/build/build/release/CMakeFiles/CMakeTmp

Run Build Command:"/usr/bin/make" "cmTC_8846c/fast"
make[1]: Entering directory '/home/buildbot/builder/monero-static-ubuntu-amd64/build/build/release/CMakeFiles/CMakeTmp'
/usr/bin/make -f CMakeFiles/cmTC_8846c.dir/build.make CMakeFiles/cmTC_8846c.dir/build
make[2]: Entering directory '/home/buildbot/builder/monero-static-ubuntu-amd64/build/build/release/CMakeFiles/CMakeTmp'
Building C object CMakeFiles/cmTC_8846c.dir/CheckSymbolExists.c.o
/usr/bin/cc   -pthread    -o CMakeFiles/cmTC_8846c.dir/CheckSymbolExists.c.o   -c /home/buildbot/builder/monero-static-ubuntu-amd64/build/build/release/CMakeFiles/CMakeTmp/CheckSymbolExists.c
/home/buildbot/builder/monero-static-ubuntu-amd64/build/build/release/CMakeFiles/CMakeTmp/CheckSymbolExists.c: In function 'main':
/home/buildbot/builder/monero-static-ubuntu-amd64/build/build/release/CMakeFiles/CMakeTmp/CheckSymbolExists.c:8:19: error: 'LIBRESSL_VERSION_TEXT' undeclared (first use in this function); did you mean 'OPENSSL_VERSION_TEXT'?
   return ((int*)(&LIBRESSL_VERSION_TEXT))[argc];
                   ^~~~~~~~~~~~~~~~~~~~~
                   OPENSSL_VERSION_TEXT
/home/buildbot/builder/monero-static-ubuntu-amd64/build/build/release/CMakeFiles/CMakeTmp/CheckSymbolExists.c:8:19: note: each undeclared identifier is reported only once for each function it appears in
CMakeFiles/cmTC_8846c.dir/build.make:65: recipe for target 'CMakeFiles/cmTC_8846c.dir/CheckSymbolExists.c.o' failed
make[2]: *** [CMakeFiles/cmTC_8846c.dir/CheckSymbolExists.c.o] Error 1
make[2]: Leaving directory '/home/buildbot/builder/monero-static-ubuntu-amd64/build/build/release/CMakeFiles/CMakeTmp'
Makefile:126: recipe for target 'cmTC_8846c/fast' failed
make[1]: *** [cmTC_8846c/fast] Error 2
make[1]: Leaving directory '/home/buildbot/builder/monero-static-ubuntu-amd64/build/build/release/CMakeFiles/CMakeTmp'

File /home/buildbot/builder/monero-static-ubuntu-amd64/build/build/release/CMakeFiles/CMakeTmp/CheckSymbolExists.c:
/* */
#include <openssl/opensslv.h>

int main(int argc, char** argv)
{
  (void)argv;
#ifndef LIBRESSL_VERSION_TEXT
  return ((int*)(&LIBRESSL_VERSION_TEXT))[argc];
#else
  (void)argc;
  return 0;
#endif
}

Performing C SOURCE FILE Test _fcf_protection=full_c failed with the following output:
Change Dir: /home/buildbot/builder/monero-static-ubuntu-amd64/build/build/release/CMakeFiles/CMakeTmp

Run Build Command:"/usr/bin/make" "cmTC_919d1/fast"
make[1]: Entering directory '/home/buildbot/builder/monero-static-ubuntu-amd64/build/build/release/CMakeFiles/CMakeTmp'
/usr/bin/make -f CMakeFiles/cmTC_919d1.dir/build.make CMakeFiles/cmTC_919d1.dir/build
make[2]: Entering directory '/home/buildbot/builder/monero-static-ubuntu-amd64/build/build/release/CMakeFiles/CMakeTmp'
Building C object CMakeFiles/cmTC_919d1.dir/src.c.o
/usr/bin/cc   -pthread -maes -march=x86-64 -fno-strict-aliasing -D_fcf_protection=full_c   -fcf-protection=full -o CMakeFiles/cmTC_919d1.dir/src.c.o   -c /home/buildbot/builder/monero-static-ubuntu-amd64/build/build/release/CMakeFiles/CMakeTmp/src.c
cc: error: unrecognized command line option '-fcf-protection=full'; did you mean '-fstack-protector-all'?
CMakeFiles/cmTC_919d1.dir/build.make:65: recipe for target 'CMakeFiles/cmTC_919d1.dir/src.c.o' failed
make[2]: *** [CMakeFiles/cmTC_919d1.dir/src.c.o] Error 1
make[2]: Leaving directory '/home/buildbot/builder/monero-static-ubuntu-amd64/build/build/release/CMakeFiles/CMakeTmp'
Makefile:126: recipe for target 'cmTC_919d1/fast' failed
make[1]: *** [cmTC_919d1/fast] Error 2
make[1]: Leaving directory '/home/buildbot/builder/monero-static-ubuntu-amd64/build/build/release/CMakeFiles/CMakeTmp'

Source file was:
int main(void) { return 0; }
Performing C++ SOURCE FILE Test _fcf_protection=full_cxx failed with the following output:
Change Dir: /home/buildbot/builder/monero-static-ubuntu-amd64/build/build/release/CMakeFiles/CMakeTmp

Run Build Command:"/usr/bin/make" "cmTC_3ccdd/fast"
make[1]: Entering directory '/home/buildbot/builder/monero-static-ubuntu-amd64/build/build/release/CMakeFiles/CMakeTmp'
/usr/bin/make -f CMakeFiles/cmTC_3ccdd.dir/build.make CMakeFiles/cmTC_3ccdd.dir/build
make[2]: Entering directory '/home/buildbot/builder/monero-static-ubuntu-amd64/build/build/release/CMakeFiles/CMakeTmp'
Building CXX object CMakeFiles/cmTC_3ccdd.dir/src.cxx.o
/usr/bin/c++    -DZMQ_STATIC -pthread -maes -march=x86-64 -fno-strict-aliasing -D_fcf_protection=full_cxx   -fcf-protection=full -o CMakeFiles/cmTC_3ccdd.dir/src.cxx.o -c /home/buildbot/builder/monero-static-ubuntu-amd64/build/build/release/CMakeFiles/CMakeTmp/src.cxx
c++: error: unrecognized command line option '-fcf-protection=full'; did you mean '-fstack-protector-all'?
CMakeFiles/cmTC_3ccdd.dir/build.make:65: recipe for target 'CMakeFiles/cmTC_3ccdd.dir/src.cxx.o' failed
make[2]: *** [CMakeFiles/cmTC_3ccdd.dir/src.cxx.o] Error 1
make[2]: Leaving directory '/home/buildbot/builder/monero-static-ubuntu-amd64/build/build/release/CMakeFiles/CMakeTmp'
Makefile:126: recipe for target 'cmTC_3ccdd/fast' failed
make[1]: *** [cmTC_3ccdd/fast] Error 2
make[1]: Leaving directory '/home/buildbot/builder/monero-static-ubuntu-amd64/build/build/release/CMakeFiles/CMakeTmp'

Source file was:
int main() { return 0; }
Performing C SOURCE FILE Test _fstack_clash_protection_c failed with the following output:
Change Dir: /home/buildbot/builder/monero-static-ubuntu-amd64/build/build/release/CMakeFiles/CMakeTmp

Run Build Command:"/usr/bin/make" "cmTC_94505/fast"
make[1]: Entering directory '/home/buildbot/builder/monero-static-ubuntu-amd64/build/build/release/CMakeFiles/CMakeTmp'
/usr/bin/make -f CMakeFiles/cmTC_94505.dir/build.make CMakeFiles/cmTC_94505.dir/build
make[2]: Entering directory '/home/buildbot/builder/monero-static-ubuntu-amd64/build/build/release/CMakeFiles/CMakeTmp'
Building C object CMakeFiles/cmTC_94505.dir/src.c.o
/usr/bin/cc   -pthread -maes -march=x86-64 -fno-strict-aliasing -D_fstack_clash_protection_c   -fstack-clash-protection -o CMakeFiles/cmTC_94505.dir/src.c.o   -c /home/buildbot/builder/monero-static-ubuntu-amd64/build/build/release/CMakeFiles/CMakeTmp/src.c
cc: error: unrecognized command line option '-fstack-clash-protection'; did you mean '-fstack-protector'?
CMakeFiles/cmTC_94505.dir/build.make:65: recipe for target 'CMakeFiles/cmTC_94505.dir/src.c.o' failed
make[2]: *** [CMakeFiles/cmTC_94505.dir/src.c.o] Error 1
make[2]: Leaving directory '/home/buildbot/builder/monero-static-ubuntu-amd64/build/build/release/CMakeFiles/CMakeTmp'
Makefile:126: recipe for target 'cmTC_94505/fast' failed
make[1]: *** [cmTC_94505/fast] Error 2
make[1]: Leaving directory '/home/buildbot/builder/monero-static-ubuntu-amd64/build/build/release/CMakeFiles/CMakeTmp'

Source file was:
int main(void) { return 0; }
Performing C++ SOURCE FILE Test _fstack_clash_protection_cxx failed with the following output:
Change Dir: /home/buildbot/builder/monero-static-ubuntu-amd64/build/build/release/CMakeFiles/CMakeTmp

Run Build Command:"/usr/bin/make" "cmTC_b3ead/fast"
make[1]: Entering directory '/home/buildbot/builder/monero-static-ubuntu-amd64/build/build/release/CMakeFiles/CMakeTmp'
/usr/bin/make -f CMakeFiles/cmTC_b3ead.dir/build.make CMakeFiles/cmTC_b3ead.dir/build
make[2]: Entering directory '/home/buildbot/builder/monero-static-ubuntu-amd64/build/build/release/CMakeFiles/CMakeTmp'
Building CXX object CMakeFiles/cmTC_b3ead.dir/src.cxx.o
/usr/bin/c++    -DZMQ_STATIC -pthread -maes -march=x86-64 -fno-strict-aliasing -D_fstack_clash_protection_cxx   -fstack-clash-protection -o CMakeFiles/cmTC_b3ead.dir/src.cxx.o -c /home/buildbot/builder/monero-static-ubuntu-amd64/build/build/release/CMakeFiles/CMakeTmp/src.cxx
c++: error: unrecognized command line option '-fstack-clash-protection'; did you mean '-fstack-protector'?
CMakeFiles/cmTC_b3ead.dir/build.make:65: recipe for target 'CMakeFiles/cmTC_b3ead.dir/src.cxx.o' failed
make[2]: *** [CMakeFiles/cmTC_b3ead.dir/src.cxx.o] Error 1
make[2]: Leaving directory '/home/buildbot/builder/monero-static-ubuntu-amd64/build/build/release/CMakeFiles/CMakeTmp'
Makefile:126: recipe for target 'cmTC_b3ead/fast' failed
make[1]: *** [cmTC_b3ead/fast] Error 2
make[1]: Leaving directory '/home/buildbot/builder/monero-static-ubuntu-amd64/build/build/release/CMakeFiles/CMakeTmp'

Source file was:
int main() { return 0; }
Determining if the -Wl,-z,noexecheap linker flag is supported failed with the following output:
Change Dir: /home/buildbot/builder/monero-static-ubuntu-amd64/build/build/release/CMakeFiles/CMakeTmp

Run Build Command:"/usr/bin/make" "cmTC_b83ca/fast"
make[1]: Entering directory '/home/buildbot/builder/monero-static-ubuntu-amd64/build/build/release/CMakeFiles/CMakeTmp'
/usr/bin/make -f CMakeFiles/cmTC_b83ca.dir/build.make CMakeFiles/cmTC_b83ca.dir/build
make[2]: Entering directory '/home/buildbot/builder/monero-static-ubuntu-amd64/build/build/release/CMakeFiles/CMakeTmp'
Building C object CMakeFiles/cmTC_b83ca.dir/CheckLinkerFlag.c.o
/usr/bin/cc   -Wl,-z,noexecheap    -Wl,-z,noexecheap -o CMakeFiles/cmTC_b83ca.dir/CheckLinkerFlag.c.o   -c /home/buildbot/builder/monero-static-ubuntu-amd64/build/cmake/CheckLinkerFlag.c
Linking C executable cmTC_b83ca
/usr/bin/cmake -E cmake_link_script CMakeFiles/cmTC_b83ca.dir/link.txt --verbose=1
/usr/bin/cc -Wl,-z,noexecheap     -rdynamic CMakeFiles/cmTC_b83ca.dir/CheckLinkerFlag.c.o  -o cmTC_b83ca 
/usr/bin/ld: warning: -z noexecheap ignored.
make[2]: Leaving directory '/home/buildbot/builder/monero-static-ubuntu-amd64/build/build/release/CMakeFiles/CMakeTmp'
make[1]: Leaving directory '/home/buildbot/builder/monero-static-ubuntu-amd64/build/build/release/CMakeFiles/CMakeTmp'


Determining if the function rl_copy_text exists failed with the following output:
Change Dir: /home/buildbot/builder/monero-static-ubuntu-amd64/build/build/release/CMakeFiles/CMakeTmp

Run Build Command:"/usr/bin/make" "cmTC_3a0da/fast"
make[1]: Entering directory '/home/buildbot/builder/monero-static-ubuntu-amd64/build/build/release/CMakeFiles/CMakeTmp'
/usr/bin/make -f CMakeFiles/cmTC_3a0da.dir/build.make CMakeFiles/cmTC_3a0da.dir/build
make[2]: Entering directory '/home/buildbot/builder/monero-static-ubuntu-amd64/build/build/release/CMakeFiles/CMakeTmp'
Building C object CMakeFiles/cmTC_3a0da.dir/CheckFunctionExists.c.o
/usr/bin/cc   -pthread -maes -march=x86-64 -fno-strict-aliasing -std=c11 -D_GNU_SOURCE   -Wall -Wextra -Wpointer-arith -Wundef -Wvla -Wwrite-strings -Wno-error=extra -Wno-error=deprecated-declarations -Wno-unused-parameter -Wno-unused-variable -Wno-error=unused-variable -Wno-error=undef -Wno-error=uninitialized -Wlogical-op -Wno-error=maybe-uninitialized -Wno-error=cpp -Waggregate-return -Wnested-externs -Wold-style-definition -Wstrict-prototypes  -fPIC  -Wformat -Wformat-security -fstack-protector -fstack-protector-strong -mmitigate-rop -fno-strict-aliasing -DCHECK_FUNCTION_EXISTS=rl_copy_text   -o CMakeFiles/cmTC_3a0da.dir/CheckFunctionExists.c.o   -c /usr/share/cmake-3.10/Modules/CheckFunctionExists.c
Linking C executable cmTC_3a0da
/usr/bin/cmake -E cmake_link_script CMakeFiles/cmTC_3a0da.dir/link.txt --verbose=1
/usr/bin/cc  -pthread -maes -march=x86-64 -fno-strict-aliasing -std=c11 -D_GNU_SOURCE   -Wall -Wextra -Wpointer-arith -Wundef -Wvla -Wwrite-strings -Wno-error=extra -Wno-error=deprecated-declarations -Wno-unused-parameter -Wno-unused-variable -Wno-error=unused-variable -Wno-error=undef -Wno-error=uninitialized -Wlogical-op -Wno-error=maybe-uninitialized -Wno-error=cpp -Waggregate-return -Wnested-externs -Wold-style-definition -Wstrict-prototypes  -fPIC  -Wformat -Wformat-security -fstack-protector -fstack-protector-strong -mmitigate-rop -fno-strict-aliasing -DCHECK_FUNCTION_EXISTS=rl_copy_text    -rdynamic CMakeFiles/cmTC_3a0da.dir/CheckFunctionExists.c.o  -o cmTC_3a0da /usr/lib/x86_64-linux-gnu/libreadline.a 
/usr/lib/x86_64-linux-gnu/libreadline.a(terminal.o): In function `_rl_get_screen_size':
(.text+0x186): undefined reference to `tgetnum'
(.text+0x2be): undefined reference to `tgetnum'
/usr/lib/x86_64-linux-gnu/libreadline.a(terminal.o): In function `_rl_init_terminal_io':
(.text+0x678): undefined reference to `PC'
(.text+0x687): undefined reference to `BC'
(.text+0x68e): undefined reference to `UP'
(.text+0x728): undefined reference to `tgetent'
(.text+0x76f): undefined reference to `tgetstr'
(.text+0x799): undefined reference to `PC'
(.text+0x7af): undefined reference to `BC'
(.text+0x7bd): undefined reference to `UP'
(.text+0x7cf): undefined reference to `tgetflag'
(.text+0x81e): undefined reference to `tgetflag'
(.text+0x938): undefined reference to `tgetflag'
/usr/lib/x86_64-linux-gnu/libreadline.a(terminal.o): In function `_rl_backspace':
(.text+0xb4b): undefined reference to `tputs'
/usr/lib/x86_64-linux-gnu/libreadline.a(terminal.o): In function `rl_ding':
(.text+0xc1d): undefined reference to `tputs'
/usr/lib/x86_64-linux-gnu/libreadline.a(terminal.o): In function `_rl_enable_meta_key':
(.text+0xc67): undefined reference to `tputs'
/usr/lib/x86_64-linux-gnu/libreadline.a(terminal.o): In function `_rl_disable_meta_key':
(.text+0xcc9): undefined reference to `tputs'
/usr/lib/x86_64-linux-gnu/libreadline.a(terminal.o): In function `_rl_control_keypad':
(.text+0xcfd): undefined reference to `tputs'
/usr/lib/x86_64-linux-gnu/libreadline.a(terminal.o):(.text+0xd50): more undefined references to `tputs' follow
/usr/lib/x86_64-linux-gnu/libreadline.a(display.o): In function `update_line':
(.text+0x301f): undefined reference to `tgoto'
(.text+0x3033): undefined reference to `tputs'
(.text+0x31cc): undefined reference to `tputs'
(.text+0x32bf): undefined reference to `tputs'
(.text+0x34b8): undefined reference to `tputs'
(.text+0x3513): undefined reference to `tputs'
(.text+0x3546): undefined reference to `tgoto'
(.text+0x3557): undefined reference to `tputs'
/usr/lib/x86_64-linux-gnu/libreadline.a(display.o): In function `rl_redisplay':
(.text+0x4591): undefined reference to `tputs'
(.text+0x50be): undefined reference to `tputs'
/usr/lib/x86_64-linux-gnu/libreadline.a(display.o): In function `rl_clear_visible_line':
(.text+0x5265): undefined reference to `tputs'
/usr/lib/x86_64-linux-gnu/libreadline.a(display.o): In function `_rl_redisplay_after_sigwinch':
(.text+0x53f1): undefined reference to `tputs'
/usr/lib/x86_64-linux-gnu/libreadline.a(display.o):(.text+0x5414): more undefined references to `tputs' follow
collect2: error: ld returned 1 exit status
CMakeFiles/cmTC_3a0da.dir/build.make:98: recipe for target 'cmTC_3a0da' failed
make[2]: *** [cmTC_3a0da] Error 1
make[2]: Leaving directory '/home/buildbot/builder/monero-static-ubuntu-amd64/build/build/release/CMakeFiles/CMakeTmp'
Makefile:126: recipe for target 'cmTC_3a0da/fast' failed
make[1]: *** [cmTC_3a0da/fast] Error 2
make[1]: Leaving directory '/home/buildbot/builder/monero-static-ubuntu-amd64/build/build/release/CMakeFiles/CMakeTmp'


Determining if the function rl_filename_completion_function exists failed with the following output:
Change Dir: /home/buildbot/builder/monero-static-ubuntu-amd64/build/build/release/CMakeFiles/CMakeTmp

Run Build Command:"/usr/bin/make" "cmTC_d4f53/fast"
make[1]: Entering directory '/home/buildbot/builder/monero-static-ubuntu-amd64/build/build/release/CMakeFiles/CMakeTmp'
/usr/bin/make -f CMakeFiles/cmTC_d4f53.dir/build.make CMakeFiles/cmTC_d4f53.dir/build
make[2]: Entering directory '/home/buildbot/builder/monero-static-ubuntu-amd64/build/build/release/CMakeFiles/CMakeTmp'
Building C object CMakeFiles/cmTC_d4f53.dir/CheckFunctionExists.c.o
/usr/bin/cc   -pthread -maes -march=x86-64 -fno-strict-aliasing -std=c11 -D_GNU_SOURCE   -Wall -Wextra -Wpointer-arith -Wundef -Wvla -Wwrite-strings -Wno-error=extra -Wno-error=deprecated-declarations -Wno-unused-parameter -Wno-unused-variable -Wno-error=unused-variable -Wno-error=undef -Wno-error=uninitialized -Wlogical-op -Wno-error=maybe-uninitialized -Wno-error=cpp -Waggregate-return -Wnested-externs -Wold-style-definition -Wstrict-prototypes  -fPIC  -Wformat -Wformat-security -fstack-protector -fstack-protector-strong -mmitigate-rop -fno-strict-aliasing -DCHECK_FUNCTION_EXISTS=rl_filename_completion_function   -o CMakeFiles/cmTC_d4f53.dir/CheckFunctionExists.c.o   -c /usr/share/cmake-3.10/Modules/CheckFunctionExists.c
Linking C executable cmTC_d4f53
/usr/bin/cmake -E cmake_link_script CMakeFiles/cmTC_d4f53.dir/link.txt --verbose=1
/usr/bin/cc  -pthread -maes -march=x86-64 -fno-strict-aliasing -std=c11 -D_GNU_SOURCE   -Wall -Wextra -Wpointer-arith -Wundef -Wvla -Wwrite-strings -Wno-error=extra -Wno-error=deprecated-declarations -Wno-unused-parameter -Wno-unused-variable -Wno-error=unused-variable -Wno-error=undef -Wno-error=uninitialized -Wlogical-op -Wno-error=maybe-uninitialized -Wno-error=cpp -Waggregate-return -Wnested-externs -Wold-style-definition -Wstrict-prototypes  -fPIC  -Wformat -Wformat-security -fstack-protector -fstack-protector-strong -mmitigate-rop -fno-strict-aliasing -DCHECK_FUNCTION_EXISTS=rl_filename_completion_function    -rdynamic CMakeFiles/cmTC_d4f53.dir/CheckFunctionExists.c.o  -o cmTC_d4f53 /usr/lib/x86_64-linux-gnu/libreadline.a 
/usr/lib/x86_64-linux-gnu/libreadline.a(display.o): In function `_rl_move_cursor_relative':
(.text+0xf86): undefined reference to `tputs'
(.text+0xfec): undefined reference to `tputs'
(.text+0x11ac): undefined reference to `tputs'
/usr/lib/x86_64-linux-gnu/libreadline.a(display.o): In function `_rl_move_vert':
(.text+0x123d): undefined reference to `tputs'
(.text+0x12a3): undefined reference to `tputs'
/usr/lib/x86_64-linux-gnu/libreadline.a(display.o):(.text+0x2117): more undefined references to `tputs' follow
/usr/lib/x86_64-linux-gnu/libreadline.a(display.o): In function `update_line':
(.text+0x301f): undefined reference to `tgoto'
(.text+0x3033): undefined reference to `tputs'
(.text+0x31cc): undefined reference to `tputs'
(.text+0x32bf): undefined reference to `tputs'
(.text+0x34b8): undefined reference to `tputs'
(.text+0x3513): undefined reference to `tputs'
(.text+0x3546): undefined reference to `tgoto'
(.text+0x3557): undefined reference to `tputs'
/usr/lib/x86_64-linux-gnu/libreadline.a(display.o): In function `rl_redisplay':
(.text+0x4591): undefined reference to `tputs'
(.text+0x50be): undefined reference to `tputs'
/usr/lib/x86_64-linux-gnu/libreadline.a(display.o): In function `rl_clear_visible_line':
(.text+0x5265): undefined reference to `tputs'
/usr/lib/x86_64-linux-gnu/libreadline.a(display.o): In function `_rl_redisplay_after_sigwinch':
(.text+0x53f1): undefined reference to `tputs'
/usr/lib/x86_64-linux-gnu/libreadline.a(display.o):(.text+0x5414): more undefined references to `tputs' follow
/usr/lib/x86_64-linux-gnu/libreadline.a(terminal.o): In function `_rl_get_screen_size':
(.text+0x186): undefined reference to `tgetnum'
(.text+0x2be): undefined reference to `tgetnum'
/usr/lib/x86_64-linux-gnu/libreadline.a(terminal.o): In function `_rl_init_terminal_io':
(.text+0x678): undefined reference to `PC'
(.text+0x687): undefined reference to `BC'
(.text+0x68e): undefined reference to `UP'
(.text+0x728): undefined reference to `tgetent'
(.text+0x76f): undefined reference to `tgetstr'
(.text+0x799): undefined reference to `PC'
(.text+0x7af): undefined reference to `BC'
(.text+0x7bd): undefined reference to `UP'
(.text+0x7cf): undefined reference to `tgetflag'
(.text+0x81e): undefined reference to `tgetflag'
(.text+0x938): undefined reference to `tgetflag'
/usr/lib/x86_64-linux-gnu/libreadline.a(terminal.o): In function `_rl_backspace':
(.text+0xb4b): undefined reference to `tputs'
/usr/lib/x86_64-linux-gnu/libreadline.a(terminal.o): In function `rl_ding':
(.text+0xc1d): undefined reference to `tputs'
/usr/lib/x86_64-linux-gnu/libreadline.a(terminal.o): In function `_rl_enable_meta_key':
(.text+0xc67): undefined reference to `tputs'
/usr/lib/x86_64-linux-gnu/libreadline.a(terminal.o): In function `_rl_disable_meta_key':
(.text+0xcc9): undefined reference to `tputs'
/usr/lib/x86_64-linux-gnu/libreadline.a(terminal.o): In function `_rl_control_keypad':
(.text+0xcfd): undefined reference to `tputs'
/usr/lib/x86_64-linux-gnu/libreadline.a(terminal.o):(.text+0xd50): more undefined references to `tputs' follow
collect2: error: ld returned 1 exit status
CMakeFiles/cmTC_d4f53.dir/build.make:98: recipe for target 'cmTC_d4f53' failed
make[2]: *** [cmTC_d4f53] Error 1
make[2]: Leaving directory '/home/buildbot/builder/monero-static-ubuntu-amd64/build/build/release/CMakeFiles/CMakeTmp'
Makefile:126: recipe for target 'cmTC_d4f53/fast' failed
make[1]: *** [cmTC_d4f53/fast] Error 2
make[1]: Leaving directory '/home/buildbot/builder/monero-static-ubuntu-amd64/build/build/release/CMakeFiles/CMakeTmp'