(view as text)
make release-test
 in dir /home/buildbot/builder/monero-static-ubuntu-amd64/build (timeout 1200 secs)
 watching logfiles {'LastTest': 'build/release/Testing/Temporary/LastTest.log', 'CTestCostData.txt': 'build/release/Testing/Temporary/CTestCostData.txt'}
 argv: ['make', 'release-test']
 environment:
  ARGS= -E 'core_tests|libwallet_api_tests' 
  GTEST_FILTER=-DNSResolver.*:AddressFromURL.*
  HOME=/home/buildbot
  LANG=en_US
  LANGUAGE=en_US:
  LESSCLOSE=/usr/bin/lesspipe %s %s
  LESSOPEN=| /usr/bin/lesspipe %s
  LOGNAME=buildbot
  LS_COLORS=rs=0:di=01;34:ln=01;36:mh=00:pi=40;33:so=01;35:do=01;35:bd=40;33;01:cd=40;33;01:or=40;31;01:mi=00:su=37;41:sg=30;43:ca=30;41:tw=30;42:ow=34;42:st=37;44:ex=01;32:*.tar=01;31:*.tgz=01;31:*.arc=01;31:*.arj=01;31:*.taz=01;31:*.lha=01;31:*.lz4=01;31:*.lzh=01;31:*.lzma=01;31:*.tlz=01;31:*.txz=01;31:*.tzo=01;31:*.t7z=01;31:*.zip=01;31:*.z=01;31:*.Z=01;31:*.dz=01;31:*.gz=01;31:*.lrz=01;31:*.lz=01;31:*.lzo=01;31:*.xz=01;31:*.zst=01;31:*.tzst=01;31:*.bz2=01;31:*.bz=01;31:*.tbz=01;31:*.tbz2=01;31:*.tz=01;31:*.deb=01;31:*.rpm=01;31:*.jar=01;31:*.war=01;31:*.ear=01;31:*.sar=01;31:*.rar=01;31:*.alz=01;31:*.ace=01;31:*.zoo=01;31:*.cpio=01;31:*.7z=01;31:*.rz=01;31:*.cab=01;31:*.wim=01;31:*.swm=01;31:*.dwm=01;31:*.esd=01;31:*.jpg=01;35:*.jpeg=01;35:*.mjpg=01;35:*.mjpeg=01;35:*.gif=01;35:*.bmp=01;35:*.pbm=01;35:*.pgm=01;35:*.ppm=01;35:*.tga=01;35:*.xbm=01;35:*.xpm=01;35:*.tif=01;35:*.tiff=01;35:*.png=01;35:*.svg=01;35:*.svgz=01;35:*.mng=01;35:*.pcx=01;35:*.mov=01;35:*.mpg=01;35:*.mpeg=01;35:*.m2v=01;35:*.mkv=01;35:*.webm=01;35:*.ogm=01;35:*.mp4=01;35:*.m4v=01;35:*.mp4v=01;35:*.vob=01;35:*.qt=01;35:*.nuv=01;35:*.wmv=01;35:*.asf=01;35:*.rm=01;35:*.rmvb=01;35:*.flc=01;35:*.avi=01;35:*.fli=01;35:*.flv=01;35:*.gl=01;35:*.dl=01;35:*.xcf=01;35:*.xwd=01;35:*.yuv=01;35:*.cgm=01;35:*.emf=01;35:*.ogv=01;35:*.ogx=01;35:*.aac=00;36:*.au=00;36:*.flac=00;36:*.m4a=00;36:*.mid=00;36:*.midi=00;36:*.mka=00;36:*.mp3=00;36:*.mpc=00;36:*.ogg=00;36:*.ra=00;36:*.wav=00;36:*.oga=00;36:*.opus=00;36:*.spx=00;36:*.xspf=00;36:
  MAIL=/var/mail/buildbot
  PATH=/usr/local/bin:/usr/bin:/bin:/usr/local/games:/usr/games:/snap/bin
  PWD=/home/buildbot/builder/monero-static-ubuntu-amd64/build
  SHELL=/bin/bash
  SHLVL=1
  S_COLORS=auto
  TERM=xterm
  USER=buildbot
  USE_SINGLE_BUILDDIR=1
  XDG_DATA_DIRS=/usr/local/share:/usr/share:/var/lib/snapd/desktop
  _=/usr/local/bin/buildslave
 using PTY: False
mkdir -p build/release
cd build/release && cmake -D BUILD_TESTS=ON -D CMAKE_BUILD_TYPE=release ../.. && make && make test
-- CMake version 3.10.2
-- Building without build tag
-- Checking submodules
-- Submodule 'external/miniupnp' is up-to-date
-- Submodule 'external/unbound' is up-to-date
-- Submodule 'external/rapidjson' is up-to-date
-- Submodule 'external/trezor-common' is up-to-date
-- Could not find DEVELOPER_LOCAL_TOOLS in env (not required)
-- BOOST_IGNORE_SYSTEM_PATHS defaults to OFF
-- Could not find DEVELOPER_LIBUNBOUND_OLD in env (not required)
-- Building for a 64-bit system
-- Building internal libraries as static
-- Could not find DATABASE in env (not required unless you want to change database type from default: lmdb)
-- Using LMDB as default DB type
-- Stack trace on exception enabled (using easylogging++)
-- Using OpenSSL include dir at /usr/include
-- Could NOT find HIDAPI (missing: HIDAPI_LIBRARY HIDAPI_INCLUDE_DIR) 
-- Could NOT find MiniUPnPc (missing: MINIUPNP_INCLUDE_DIR MINIUPNP_LIBRARY) 
-- Using in-tree miniupnpc
-- Looking for libunbound
-- Using 64-bit LMDB from source tree
-- Could not find HIDAPI
-- Could NOT find Protobuf (missing: Protobuf_INCLUDE_DIR) 
-- Could NOT find Protobuf (missing: Protobuf_INCLUDE_DIR) 
-- Could not find Protobuf
-- Building on x86_64 for x86-64
-- AES support enabled
-- Performing Test _fcf_protection=full_c
-- Performing Test _fcf_protection=full_c - Failed
-- Performing Test _fcf_protection=full_cxx
-- Performing Test _fcf_protection=full_cxx - Failed
-- Using C security hardening flags:  -Wformat -Wformat-security -fstack-protector -fstack-protector-strong -mmitigate-rop
-- Using C++ security hardening flags:  -Wformat -Wformat-security -fstack-protector -fstack-protector-strong -mmitigate-rop
-- Using linker security hardening flags:  -pie -Wl,-z,relro -Wl,-z,now -Wl,-z,noexecstack
-- Found Boost Version: 106501
-- Found readline library at: /usr
-- Found Git: /usr/bin/git
-- Trezor support disabled
-- Could NOT find GTest (missing: GTEST_LIBRARY GTEST_INCLUDE_DIR GTEST_MAIN_LIBRARY) 
-- GTest not found on the system: will use GTest bundled with this source
-- Configuring done
-- Generating done
-- Build files have been written to: /home/buildbot/builder/monero-static-ubuntu-amd64/build/build/release
make[1]: Entering directory '/home/buildbot/builder/monero-static-ubuntu-amd64/build/build/release'
make[2]: Entering directory '/home/buildbot/builder/monero-static-ubuntu-amd64/build/build/release'
make[3]: Entering directory '/home/buildbot/builder/monero-static-ubuntu-amd64/build/build/release'
make[3]: Leaving directory '/home/buildbot/builder/monero-static-ubuntu-amd64/build/build/release'
[  2%] Built target generate_translations_header
make[3]: Entering directory '/home/buildbot/builder/monero-static-ubuntu-amd64/build/build/release'
make[3]: Leaving directory '/home/buildbot/builder/monero-static-ubuntu-amd64/build/build/release'
[  5%] Built target libminiupnpc-static
make[3]: Entering directory '/home/buildbot/builder/monero-static-ubuntu-amd64/build/build/release'
make[3]: Leaving directory '/home/buildbot/builder/monero-static-ubuntu-amd64/build/build/release'
[ 24%] Built target unbound
make[3]: Entering directory '/home/buildbot/builder/monero-static-ubuntu-amd64/build/build/release'
make[3]: Leaving directory '/home/buildbot/builder/monero-static-ubuntu-amd64/build/build/release'
[ 25%] Built target lmdb
make[3]: Entering directory '/home/buildbot/builder/monero-static-ubuntu-amd64/build/build/release'
make[3]: Leaving directory '/home/buildbot/builder/monero-static-ubuntu-amd64/build/build/release'
[ 26%] Built target easylogging
make[3]: Entering directory '/home/buildbot/builder/monero-static-ubuntu-amd64/build/build/release'
make[3]: Leaving directory '/home/buildbot/builder/monero-static-ubuntu-amd64/build/build/release'
make[3]: Entering directory '/home/buildbot/builder/monero-static-ubuntu-amd64/build/build/release'
[ 26%] Building CXX object contrib/epee/src/CMakeFiles/epee.dir/hex.cpp.o
[ 26%] Building CXX object contrib/epee/src/CMakeFiles/epee.dir/http_auth.cpp.o
[ 27%] Building CXX object contrib/epee/src/CMakeFiles/epee.dir/mlog.cpp.o
[ 27%] Building CXX object contrib/epee/src/CMakeFiles/epee.dir/net_utils_base.cpp.o
[ 27%] Building CXX object contrib/epee/src/CMakeFiles/epee.dir/string_tools.cpp.o
[ 27%] Building CXX object contrib/epee/src/CMakeFiles/epee.dir/wipeable_string.cpp.o
[ 28%] Building C object contrib/epee/src/CMakeFiles/epee.dir/memwipe.c.o
[ 28%] Building CXX object contrib/epee/src/CMakeFiles/epee.dir/connection_basic.cpp.o
[ 28%] Building CXX object contrib/epee/src/CMakeFiles/epee.dir/network_throttle.cpp.o
[ 28%] Building CXX object contrib/epee/src/CMakeFiles/epee.dir/network_throttle-detail.cpp.o
[ 29%] Building CXX object contrib/epee/src/CMakeFiles/epee.dir/mlocker.cpp.o
[ 29%] Linking CXX static library libepee.a
make[3]: Leaving directory '/home/buildbot/builder/monero-static-ubuntu-amd64/build/build/release'
[ 29%] Built target epee
make[3]: Entering directory '/home/buildbot/builder/monero-static-ubuntu-amd64/build/build/release'
make[3]: Leaving directory '/home/buildbot/builder/monero-static-ubuntu-amd64/build/build/release'
[ 29%] Built target epee_readline
make[3]: Entering directory '/home/buildbot/builder/monero-static-ubuntu-amd64/build/build/release'
make[3]: Leaving directory '/home/buildbot/builder/monero-static-ubuntu-amd64/build/build/release'
[ 29%] Built target genversion
make[3]: Entering directory '/home/buildbot/builder/monero-static-ubuntu-amd64/build/build/release'
make[3]: Leaving directory '/home/buildbot/builder/monero-static-ubuntu-amd64/build/build/release'
[ 30%] Built target obj_version
make[3]: Entering directory '/home/buildbot/builder/monero-static-ubuntu-amd64/build/build/release'
make[3]: Leaving directory '/home/buildbot/builder/monero-static-ubuntu-amd64/build/build/release'
[ 31%] Built target version
make[3]: Entering directory '/home/buildbot/builder/monero-static-ubuntu-amd64/build/build/release'
make[3]: Leaving directory '/home/buildbot/builder/monero-static-ubuntu-amd64/build/build/release'
[ 35%] Built target obj_cncrypto
make[3]: Entering directory '/home/buildbot/builder/monero-static-ubuntu-amd64/build/build/release'
make[3]: Leaving directory '/home/buildbot/builder/monero-static-ubuntu-amd64/build/build/release'
[ 35%] Built target cncrypto
make[3]: Entering directory '/home/buildbot/builder/monero-static-ubuntu-amd64/build/build/release'
make[3]: Leaving directory '/home/buildbot/builder/monero-static-ubuntu-amd64/build/build/release'
[ 39%] Built target obj_common
make[3]: Entering directory '/home/buildbot/builder/monero-static-ubuntu-amd64/build/build/release'
make[3]: Leaving directory '/home/buildbot/builder/monero-static-ubuntu-amd64/build/build/release'
[ 39%] Built target common
make[3]: Entering directory '/home/buildbot/builder/monero-static-ubuntu-amd64/build/build/release'
make[3]: Leaving directory '/home/buildbot/builder/monero-static-ubuntu-amd64/build/build/release'
[ 40%] Built target obj_ringct_basic
make[3]: Entering directory '/home/buildbot/builder/monero-static-ubuntu-amd64/build/build/release'
make[3]: Leaving directory '/home/buildbot/builder/monero-static-ubuntu-amd64/build/build/release'
[ 40%] Built target ringct_basic
make[3]: Entering directory '/home/buildbot/builder/monero-static-ubuntu-amd64/build/build/release'
make[3]: Leaving directory '/home/buildbot/builder/monero-static-ubuntu-amd64/build/build/release'
[ 40%] Built target obj_ringct
make[3]: Entering directory '/home/buildbot/builder/monero-static-ubuntu-amd64/build/build/release'
make[3]: Leaving directory '/home/buildbot/builder/monero-static-ubuntu-amd64/build/build/release'
[ 41%] Built target obj_device
make[3]: Entering directory '/home/buildbot/builder/monero-static-ubuntu-amd64/build/build/release'
make[3]: Leaving directory '/home/buildbot/builder/monero-static-ubuntu-amd64/build/build/release'
[ 42%] Built target device
make[3]: Entering directory '/home/buildbot/builder/monero-static-ubuntu-amd64/build/build/release'
make[3]: Leaving directory '/home/buildbot/builder/monero-static-ubuntu-amd64/build/build/release'
[ 43%] Built target obj_checkpoints
make[3]: Entering directory '/home/buildbot/builder/monero-static-ubuntu-amd64/build/build/release'
make[3]: Leaving directory '/home/buildbot/builder/monero-static-ubuntu-amd64/build/build/release'
[ 43%] Built target checkpoints
make[3]: Entering directory '/home/buildbot/builder/monero-static-ubuntu-amd64/build/build/release'
make[3]: Leaving directory '/home/buildbot/builder/monero-static-ubuntu-amd64/build/build/release'
[ 45%] Built target obj_cryptonote_basic
make[3]: Entering directory '/home/buildbot/builder/monero-static-ubuntu-amd64/build/build/release'
make[3]: Leaving directory '/home/buildbot/builder/monero-static-ubuntu-amd64/build/build/release'
[ 45%] Built target cryptonote_basic
make[3]: Entering directory '/home/buildbot/builder/monero-static-ubuntu-amd64/build/build/release'
make[3]: Leaving directory '/home/buildbot/builder/monero-static-ubuntu-amd64/build/build/release'
[ 45%] Built target ringct
make[3]: Entering directory '/home/buildbot/builder/monero-static-ubuntu-amd64/build/build/release'
make[3]: Leaving directory '/home/buildbot/builder/monero-static-ubuntu-amd64/build/build/release'
[ 45%] Built target obj_cryptonote_core
make[3]: Entering directory '/home/buildbot/builder/monero-static-ubuntu-amd64/build/build/release'
make[3]: Leaving directory '/home/buildbot/builder/monero-static-ubuntu-amd64/build/build/release'
[ 46%] Built target obj_multisig
make[3]: Entering directory '/home/buildbot/builder/monero-static-ubuntu-amd64/build/build/release'
make[3]: Leaving directory '/home/buildbot/builder/monero-static-ubuntu-amd64/build/build/release'
[ 46%] Built target multisig
make[3]: Entering directory '/home/buildbot/builder/monero-static-ubuntu-amd64/build/build/release'
make[3]: Leaving directory '/home/buildbot/builder/monero-static-ubuntu-amd64/build/build/release'
[ 46%] Built target obj_blockchain_db
make[3]: Entering directory '/home/buildbot/builder/monero-static-ubuntu-amd64/build/build/release'
make[3]: Leaving directory '/home/buildbot/builder/monero-static-ubuntu-amd64/build/build/release'
[ 46%] Built target blockchain_db
make[3]: Entering directory '/home/buildbot/builder/monero-static-ubuntu-amd64/build/build/release'
make[3]: Leaving directory '/home/buildbot/builder/monero-static-ubuntu-amd64/build/build/release'
[ 47%] Built target cryptonote_core
make[3]: Entering directory '/home/buildbot/builder/monero-static-ubuntu-amd64/build/build/release'
make[3]: Leaving directory '/home/buildbot/builder/monero-static-ubuntu-amd64/build/build/release'
[ 47%] Built target obj_mnemonics
make[3]: Entering directory '/home/buildbot/builder/monero-static-ubuntu-amd64/build/build/release'
make[3]: Leaving directory '/home/buildbot/builder/monero-static-ubuntu-amd64/build/build/release'
[ 48%] Built target mnemonics
make[3]: Entering directory '/home/buildbot/builder/monero-static-ubuntu-amd64/build/build/release'
make[3]: Leaving directory '/home/buildbot/builder/monero-static-ubuntu-amd64/build/build/release'
[ 50%] Built target obj_daemon_rpc_server
make[3]: Entering directory '/home/buildbot/builder/monero-static-ubuntu-amd64/build/build/release'
make[3]: Leaving directory '/home/buildbot/builder/monero-static-ubuntu-amd64/build/build/release'
[ 50%] Built target obj_rpc_base
make[3]: Entering directory '/home/buildbot/builder/monero-static-ubuntu-amd64/build/build/release'
make[3]: Leaving directory '/home/buildbot/builder/monero-static-ubuntu-amd64/build/build/release'
[ 50%] Built target rpc_base
make[3]: Entering directory '/home/buildbot/builder/monero-static-ubuntu-amd64/build/build/release'
make[3]: Leaving directory '/home/buildbot/builder/monero-static-ubuntu-amd64/build/build/release'
[ 51%] Built target obj_rpc
make[3]: Entering directory '/home/buildbot/builder/monero-static-ubuntu-amd64/build/build/release'
make[3]: Leaving directory '/home/buildbot/builder/monero-static-ubuntu-amd64/build/build/release'
[ 51%] Built target obj_p2p
make[3]: Entering directory '/home/buildbot/builder/monero-static-ubuntu-amd64/build/build/release'
make[3]: Leaving directory '/home/buildbot/builder/monero-static-ubuntu-amd64/build/build/release'
[ 51%] Built target p2p
make[3]: Entering directory '/home/buildbot/builder/monero-static-ubuntu-amd64/build/build/release'
make[3]: Leaving directory '/home/buildbot/builder/monero-static-ubuntu-amd64/build/build/release'
[ 52%] Built target obj_cryptonote_protocol
make[3]: Entering directory '/home/buildbot/builder/monero-static-ubuntu-amd64/build/build/release'
make[3]: Leaving directory '/home/buildbot/builder/monero-static-ubuntu-amd64/build/build/release'
[ 52%] Built target cryptonote_protocol
make[3]: Entering directory '/home/buildbot/builder/monero-static-ubuntu-amd64/build/build/release'
make[3]: Leaving directory '/home/buildbot/builder/monero-static-ubuntu-amd64/build/build/release'
[ 52%] Built target rpc
make[3]: Entering directory '/home/buildbot/builder/monero-static-ubuntu-amd64/build/build/release'
make[3]: Leaving directory '/home/buildbot/builder/monero-static-ubuntu-amd64/build/build/release'
[ 52%] Built target obj_daemon_messages
make[3]: Entering directory '/home/buildbot/builder/monero-static-ubuntu-amd64/build/build/release'
make[3]: Leaving directory '/home/buildbot/builder/monero-static-ubuntu-amd64/build/build/release'
[ 52%] Built target obj_serialization
make[3]: Entering directory '/home/buildbot/builder/monero-static-ubuntu-amd64/build/build/release'
make[3]: Leaving directory '/home/buildbot/builder/monero-static-ubuntu-amd64/build/build/release'
[ 53%] Built target serialization
make[3]: Entering directory '/home/buildbot/builder/monero-static-ubuntu-amd64/build/build/release'
make[3]: Leaving directory '/home/buildbot/builder/monero-static-ubuntu-amd64/build/build/release'
[ 53%] Built target daemon_messages
make[3]: Entering directory '/home/buildbot/builder/monero-static-ubuntu-amd64/build/build/release'
make[3]: Leaving directory '/home/buildbot/builder/monero-static-ubuntu-amd64/build/build/release'
[ 53%] Built target daemon_rpc_server
make[3]: Entering directory '/home/buildbot/builder/monero-static-ubuntu-amd64/build/build/release'
make[3]: Leaving directory '/home/buildbot/builder/monero-static-ubuntu-amd64/build/build/release'
[ 54%] Built target obj_wallet
make[3]: Entering directory '/home/buildbot/builder/monero-static-ubuntu-amd64/build/build/release'
make[3]: Leaving directory '/home/buildbot/builder/monero-static-ubuntu-amd64/build/build/release'
[ 54%] Built target obj_device_trezor
make[3]: Entering directory '/home/buildbot/builder/monero-static-ubuntu-amd64/build/build/release'
make[3]: Leaving directory '/home/buildbot/builder/monero-static-ubuntu-amd64/build/build/release'
[ 54%] Built target device_trezor
make[3]: Entering directory '/home/buildbot/builder/monero-static-ubuntu-amd64/build/build/release'
make[3]: Leaving directory '/home/buildbot/builder/monero-static-ubuntu-amd64/build/build/release'
[ 54%] Built target wallet
make[3]: Entering directory '/home/buildbot/builder/monero-static-ubuntu-amd64/build/build/release'
make[3]: Leaving directory '/home/buildbot/builder/monero-static-ubuntu-amd64/build/build/release'
[ 54%] Built target obj_daemonizer
make[3]: Entering directory '/home/buildbot/builder/monero-static-ubuntu-amd64/build/build/release'
make[3]: Leaving directory '/home/buildbot/builder/monero-static-ubuntu-amd64/build/build/release'
[ 54%] Built target daemonizer
make[3]: Entering directory '/home/buildbot/builder/monero-static-ubuntu-amd64/build/build/release'
make[3]: Leaving directory '/home/buildbot/builder/monero-static-ubuntu-amd64/build/build/release'
make[3]: Entering directory '/home/buildbot/builder/monero-static-ubuntu-amd64/build/build/release'
[ 55%] Linking CXX executable ../../bin/monero-wallet-rpc
make[3]: Leaving directory '/home/buildbot/builder/monero-static-ubuntu-amd64/build/build/release'
[ 55%] Built target wallet_rpc_server
make[3]: Entering directory '/home/buildbot/builder/monero-static-ubuntu-amd64/build/build/release'
make[3]: Leaving directory '/home/buildbot/builder/monero-static-ubuntu-amd64/build/build/release'
make[3]: Entering directory '/home/buildbot/builder/monero-static-ubuntu-amd64/build/build/release'
[ 55%] Linking CXX executable ../../bin/monero-wallet-cli
make[3]: Leaving directory '/home/buildbot/builder/monero-static-ubuntu-amd64/build/build/release'
[ 56%] Built target simplewallet
make[3]: Entering directory '/home/buildbot/builder/monero-static-ubuntu-amd64/build/build/release'
make[3]: Leaving directory '/home/buildbot/builder/monero-static-ubuntu-amd64/build/build/release'
make[3]: Entering directory '/home/buildbot/builder/monero-static-ubuntu-amd64/build/build/release'
[ 57%] Linking CXX executable ../../bin/monero-gen-trusted-multisig
make[3]: Leaving directory '/home/buildbot/builder/monero-static-ubuntu-amd64/build/build/release'
[ 57%] Built target gen_multisig
make[3]: Entering directory '/home/buildbot/builder/monero-static-ubuntu-amd64/build/build/release'
make[3]: Leaving directory '/home/buildbot/builder/monero-static-ubuntu-amd64/build/build/release'
[ 59%] Built target blocks
make[3]: Entering directory '/home/buildbot/builder/monero-static-ubuntu-amd64/build/build/release'
make[3]: Leaving directory '/home/buildbot/builder/monero-static-ubuntu-amd64/build/build/release'
make[3]: Entering directory '/home/buildbot/builder/monero-static-ubuntu-amd64/build/build/release'
[ 60%] Linking CXX executable ../../bin/monerod
make[3]: Leaving directory '/home/buildbot/builder/monero-static-ubuntu-amd64/build/build/release'
[ 61%] Built target daemon
make[3]: Entering directory '/home/buildbot/builder/monero-static-ubuntu-amd64/build/build/release'
make[3]: Leaving directory '/home/buildbot/builder/monero-static-ubuntu-amd64/build/build/release'
make[3]: Entering directory '/home/buildbot/builder/monero-static-ubuntu-amd64/build/build/release'
[ 61%] Linking CXX executable ../../bin/monero-blockchain-stats
make[3]: Leaving directory '/home/buildbot/builder/monero-static-ubuntu-amd64/build/build/release'
[ 62%] Built target blockchain_stats
make[3]: Entering directory '/home/buildbot/builder/monero-static-ubuntu-amd64/build/build/release'
make[3]: Leaving directory '/home/buildbot/builder/monero-static-ubuntu-amd64/build/build/release'
make[3]: Entering directory '/home/buildbot/builder/monero-static-ubuntu-amd64/build/build/release'
[ 63%] Linking CXX executable ../../bin/monero-blockchain-export
make[3]: Leaving directory '/home/buildbot/builder/monero-static-ubuntu-amd64/build/build/release'
[ 63%] Built target blockchain_export
make[3]: Entering directory '/home/buildbot/builder/monero-static-ubuntu-amd64/build/build/release'
make[3]: Leaving directory '/home/buildbot/builder/monero-static-ubuntu-amd64/build/build/release'
make[3]: Entering directory '/home/buildbot/builder/monero-static-ubuntu-amd64/build/build/release'
[ 63%] Linking CXX executable ../../bin/monero-blockchain-import
make[3]: Leaving directory '/home/buildbot/builder/monero-static-ubuntu-amd64/build/build/release'
[ 63%] Built target blockchain_import
make[3]: Entering directory '/home/buildbot/builder/monero-static-ubuntu-amd64/build/build/release'
make[3]: Leaving directory '/home/buildbot/builder/monero-static-ubuntu-amd64/build/build/release'
make[3]: Entering directory '/home/buildbot/builder/monero-static-ubuntu-amd64/build/build/release'
[ 64%] Linking CXX executable ../../bin/monero-blockchain-depth
make[3]: Leaving directory '/home/buildbot/builder/monero-static-ubuntu-amd64/build/build/release'
[ 64%] Built target blockchain_depth
make[3]: Entering directory '/home/buildbot/builder/monero-static-ubuntu-amd64/build/build/release'
make[3]: Leaving directory '/home/buildbot/builder/monero-static-ubuntu-amd64/build/build/release'
make[3]: Entering directory '/home/buildbot/builder/monero-static-ubuntu-amd64/build/build/release'
[ 64%] Linking CXX executable ../../bin/monero-blockchain-ancestry
make[3]: Leaving directory '/home/buildbot/builder/monero-static-ubuntu-amd64/build/build/release'
[ 64%] Built target blockchain_ancestry
make[3]: Entering directory '/home/buildbot/builder/monero-static-ubuntu-amd64/build/build/release'
make[3]: Leaving directory '/home/buildbot/builder/monero-static-ubuntu-amd64/build/build/release'
make[3]: Entering directory '/home/buildbot/builder/monero-static-ubuntu-amd64/build/build/release'
[ 64%] Linking CXX executable ../../bin/monero-blockchain-mark-spent-outputs
make[3]: Leaving directory '/home/buildbot/builder/monero-static-ubuntu-amd64/build/build/release'
[ 65%] Built target blockchain_blackball
make[3]: Entering directory '/home/buildbot/builder/monero-static-ubuntu-amd64/build/build/release'
make[3]: Leaving directory '/home/buildbot/builder/monero-static-ubuntu-amd64/build/build/release'
make[3]: Entering directory '/home/buildbot/builder/monero-static-ubuntu-amd64/build/build/release'
[ 65%] Linking CXX executable ../../bin/monero-blockchain-usage
make[3]: Leaving directory '/home/buildbot/builder/monero-static-ubuntu-amd64/build/build/release'
[ 65%] Built target blockchain_usage
make[3]: Entering directory '/home/buildbot/builder/monero-static-ubuntu-amd64/build/build/release'
Scanning dependencies of target hash-target-tests
make[3]: Leaving directory '/home/buildbot/builder/monero-static-ubuntu-amd64/build/build/release'
make[3]: Entering directory '/home/buildbot/builder/monero-static-ubuntu-amd64/build/build/release'
[ 65%] Building CXX object tests/CMakeFiles/hash-target-tests.dir/hash-target.cpp.o
[ 65%] Linking CXX executable hash-target-tests
make[3]: Leaving directory '/home/buildbot/builder/monero-static-ubuntu-amd64/build/build/release'
[ 65%] Built target hash-target-tests
make[3]: Entering directory '/home/buildbot/builder/monero-static-ubuntu-amd64/build/build/release'
Scanning dependencies of target googletest
make[3]: Leaving directory '/home/buildbot/builder/monero-static-ubuntu-amd64/build/build/release'
make[3]: Entering directory '/home/buildbot/builder/monero-static-ubuntu-amd64/build/build/release'
[ 66%] Creating directories for 'googletest'
[ 66%] No download step for 'googletest'
[ 66%] No patch step for 'googletest'
[ 66%] No update step for 'googletest'
[ 66%] Performing configure step for 'googletest'
-- The CXX compiler identification is GNU 7.3.0
-- The C compiler identification is GNU 7.3.0
-- Check for working CXX compiler: /usr/bin/c++
-- Check for working CXX compiler: /usr/bin/c++ -- works
-- Detecting CXX compiler ABI info
-- Detecting CXX compiler ABI info - done
-- Detecting CXX compile features
-- Detecting CXX compile features - done
-- Check for working C compiler: /usr/bin/cc
-- Check for working C compiler: /usr/bin/cc -- works
-- Detecting C compiler ABI info
-- Detecting C compiler ABI info - done
-- Detecting C compile features
-- Detecting C compile features - done
-- Found PythonInterp: /usr/bin/python (found version "2.7.15") 
-- Looking for pthread.h
-- Looking for pthread.h - found
-- Looking for pthread_create
-- Looking for pthread_create - not found
-- Looking for pthread_create in pthreads
-- Looking for pthread_create in pthreads - not found
-- Looking for pthread_create in pthread
-- Looking for pthread_create in pthread - found
-- Found Threads: TRUE  
-- Configuring done
-- Generating done
-- Build files have been written to: /home/buildbot/builder/monero-static-ubuntu-amd64/build/build/release/tests/gtest
[ 67%] Performing build step for 'googletest'
make[4]: Entering directory '/home/buildbot/builder/monero-static-ubuntu-amd64/build/build/release/tests/gtest'
make[5]: Entering directory '/home/buildbot/builder/monero-static-ubuntu-amd64/build/build/release/tests/gtest'
make[6]: Entering directory '/home/buildbot/builder/monero-static-ubuntu-amd64/build/build/release/tests/gtest'
Scanning dependencies of target gtest
make[6]: Leaving directory '/home/buildbot/builder/monero-static-ubuntu-amd64/build/build/release/tests/gtest'
make[6]: Entering directory '/home/buildbot/builder/monero-static-ubuntu-amd64/build/build/release/tests/gtest'
[ 25%] Building CXX object CMakeFiles/gtest.dir/src/gtest-all.cc.o
[ 50%] Linking CXX static library libgtest.a
make[6]: Leaving directory '/home/buildbot/builder/monero-static-ubuntu-amd64/build/build/release/tests/gtest'
[ 50%] Built target gtest
make[6]: Entering directory '/home/buildbot/builder/monero-static-ubuntu-amd64/build/build/release/tests/gtest'
Scanning dependencies of target gtest_main
make[6]: Leaving directory '/home/buildbot/builder/monero-static-ubuntu-amd64/build/build/release/tests/gtest'
make[6]: Entering directory '/home/buildbot/builder/monero-static-ubuntu-amd64/build/build/release/tests/gtest'
[ 75%] Building CXX object CMakeFiles/gtest_main.dir/src/gtest_main.cc.o
[100%] Linking CXX static library libgtest_main.a
make[6]: Leaving directory '/home/buildbot/builder/monero-static-ubuntu-amd64/build/build/release/tests/gtest'
[100%] Built target gtest_main
make[5]: Leaving directory '/home/buildbot/builder/monero-static-ubuntu-amd64/build/build/release/tests/gtest'
make[4]: Leaving directory '/home/buildbot/builder/monero-static-ubuntu-amd64/build/build/release/tests/gtest'
[ 67%] No install step for 'googletest'
[ 67%] Completed 'googletest'
make[3]: Leaving directory '/home/buildbot/builder/monero-static-ubuntu-amd64/build/build/release'
[ 67%] Built target googletest
make[3]: Entering directory '/home/buildbot/builder/monero-static-ubuntu-amd64/build/build/release'
Scanning dependencies of target core_tests
make[3]: Leaving directory '/home/buildbot/builder/monero-static-ubuntu-amd64/build/build/release'
make[3]: Entering directory '/home/buildbot/builder/monero-static-ubuntu-amd64/build/build/release'
[ 67%] Building CXX object tests/core_tests/CMakeFiles/core_tests.dir/block_reward.cpp.o
[ 68%] Building CXX object tests/core_tests/CMakeFiles/core_tests.dir/block_validation.cpp.o
[ 68%] Building CXX object tests/core_tests/CMakeFiles/core_tests.dir/chain_split_1.cpp.o
[ 68%] Building CXX object tests/core_tests/CMakeFiles/core_tests.dir/chain_switch_1.cpp.o
[ 68%] Building CXX object tests/core_tests/CMakeFiles/core_tests.dir/chaingen.cpp.o
[ 69%] Building CXX object tests/core_tests/CMakeFiles/core_tests.dir/chaingen001.cpp.o
[ 69%] Building CXX object tests/core_tests/CMakeFiles/core_tests.dir/chaingen_main.cpp.o
[ 69%] Building CXX object tests/core_tests/CMakeFiles/core_tests.dir/double_spend.cpp.o
[ 69%] Building CXX object tests/core_tests/CMakeFiles/core_tests.dir/integer_overflow.cpp.o
[ 70%] Building CXX object tests/core_tests/CMakeFiles/core_tests.dir/multisig.cpp.o
[ 70%] Building CXX object tests/core_tests/CMakeFiles/core_tests.dir/ring_signature_1.cpp.o
[ 70%] Building CXX object tests/core_tests/CMakeFiles/core_tests.dir/transaction_tests.cpp.o
[ 70%] Building CXX object tests/core_tests/CMakeFiles/core_tests.dir/tx_validation.cpp.o
[ 71%] Building CXX object tests/core_tests/CMakeFiles/core_tests.dir/v2_tests.cpp.o
[ 71%] Building CXX object tests/core_tests/CMakeFiles/core_tests.dir/rct.cpp.o
[ 71%] Building CXX object tests/core_tests/CMakeFiles/core_tests.dir/bulletproofs.cpp.o
[ 71%] Linking CXX executable core_tests
make[3]: Leaving directory '/home/buildbot/builder/monero-static-ubuntu-amd64/build/build/release'
[ 71%] Built target core_tests
make[3]: Entering directory '/home/buildbot/builder/monero-static-ubuntu-amd64/build/build/release'
Scanning dependencies of target base58_fuzz_tests
make[3]: Leaving directory '/home/buildbot/builder/monero-static-ubuntu-amd64/build/build/release'
make[3]: Entering directory '/home/buildbot/builder/monero-static-ubuntu-amd64/build/build/release'
[ 71%] Building CXX object tests/fuzz/CMakeFiles/base58_fuzz_tests.dir/base58.cpp.o
[ 71%] Building CXX object tests/fuzz/CMakeFiles/base58_fuzz_tests.dir/fuzzer.cpp.o
[ 71%] Linking CXX executable base58_fuzz_tests
make[3]: Leaving directory '/home/buildbot/builder/monero-static-ubuntu-amd64/build/build/release'
[ 71%] Built target base58_fuzz_tests
make[3]: Entering directory '/home/buildbot/builder/monero-static-ubuntu-amd64/build/build/release'
Scanning dependencies of target load-from-binary_fuzz_tests
make[3]: Leaving directory '/home/buildbot/builder/monero-static-ubuntu-amd64/build/build/release'
make[3]: Entering directory '/home/buildbot/builder/monero-static-ubuntu-amd64/build/build/release'
[ 71%] Building CXX object tests/fuzz/CMakeFiles/load-from-binary_fuzz_tests.dir/load_from_binary.cpp.o
[ 72%] Building CXX object tests/fuzz/CMakeFiles/load-from-binary_fuzz_tests.dir/fuzzer.cpp.o
[ 72%] Linking CXX executable load-from-binary_fuzz_tests
make[3]: Leaving directory '/home/buildbot/builder/monero-static-ubuntu-amd64/build/build/release'
[ 72%] Built target load-from-binary_fuzz_tests
make[3]: Entering directory '/home/buildbot/builder/monero-static-ubuntu-amd64/build/build/release'
Scanning dependencies of target signature_fuzz_tests
make[3]: Leaving directory '/home/buildbot/builder/monero-static-ubuntu-amd64/build/build/release'
make[3]: Entering directory '/home/buildbot/builder/monero-static-ubuntu-amd64/build/build/release'
[ 72%] Building CXX object tests/fuzz/CMakeFiles/signature_fuzz_tests.dir/signature.cpp.o
[ 72%] Building CXX object tests/fuzz/CMakeFiles/signature_fuzz_tests.dir/fuzzer.cpp.o
[ 72%] Linking CXX executable signature_fuzz_tests
make[3]: Leaving directory '/home/buildbot/builder/monero-static-ubuntu-amd64/build/build/release'
[ 72%] Built target signature_fuzz_tests
make[3]: Entering directory '/home/buildbot/builder/monero-static-ubuntu-amd64/build/build/release'
Scanning dependencies of target cold-transaction_fuzz_tests
make[3]: Leaving directory '/home/buildbot/builder/monero-static-ubuntu-amd64/build/build/release'
make[3]: Entering directory '/home/buildbot/builder/monero-static-ubuntu-amd64/build/build/release'
[ 72%] Building CXX object tests/fuzz/CMakeFiles/cold-transaction_fuzz_tests.dir/cold-transaction.cpp.o
[ 72%] Building CXX object tests/fuzz/CMakeFiles/cold-transaction_fuzz_tests.dir/fuzzer.cpp.o
[ 73%] Linking CXX executable cold-transaction_fuzz_tests
make[3]: Leaving directory '/home/buildbot/builder/monero-static-ubuntu-amd64/build/build/release'
[ 73%] Built target cold-transaction_fuzz_tests
make[3]: Entering directory '/home/buildbot/builder/monero-static-ubuntu-amd64/build/build/release'
Scanning dependencies of target transaction_fuzz_tests
make[3]: Leaving directory '/home/buildbot/builder/monero-static-ubuntu-amd64/build/build/release'
make[3]: Entering directory '/home/buildbot/builder/monero-static-ubuntu-amd64/build/build/release'
[ 74%] Building CXX object tests/fuzz/CMakeFiles/transaction_fuzz_tests.dir/transaction.cpp.o
[ 74%] Building CXX object tests/fuzz/CMakeFiles/transaction_fuzz_tests.dir/fuzzer.cpp.o
[ 74%] Linking CXX executable transaction_fuzz_tests
make[3]: Leaving directory '/home/buildbot/builder/monero-static-ubuntu-amd64/build/build/release'
[ 74%] Built target transaction_fuzz_tests
make[3]: Entering directory '/home/buildbot/builder/monero-static-ubuntu-amd64/build/build/release'
Scanning dependencies of target http-client_fuzz_tests
make[3]: Leaving directory '/home/buildbot/builder/monero-static-ubuntu-amd64/build/build/release'
make[3]: Entering directory '/home/buildbot/builder/monero-static-ubuntu-amd64/build/build/release'
[ 74%] Building CXX object tests/fuzz/CMakeFiles/http-client_fuzz_tests.dir/http-client.cpp.o
[ 74%] Building CXX object tests/fuzz/CMakeFiles/http-client_fuzz_tests.dir/fuzzer.cpp.o
[ 74%] Linking CXX executable http-client_fuzz_tests
make[3]: Leaving directory '/home/buildbot/builder/monero-static-ubuntu-amd64/build/build/release'
[ 74%] Built target http-client_fuzz_tests
make[3]: Entering directory '/home/buildbot/builder/monero-static-ubuntu-amd64/build/build/release'
Scanning dependencies of target load-from-json_fuzz_tests
make[3]: Leaving directory '/home/buildbot/builder/monero-static-ubuntu-amd64/build/build/release'
make[3]: Entering directory '/home/buildbot/builder/monero-static-ubuntu-amd64/build/build/release'
[ 74%] Building CXX object tests/fuzz/CMakeFiles/load-from-json_fuzz_tests.dir/load_from_json.cpp.o
[ 74%] Building CXX object tests/fuzz/CMakeFiles/load-from-json_fuzz_tests.dir/fuzzer.cpp.o
[ 74%] Linking CXX executable load-from-json_fuzz_tests
make[3]: Leaving directory '/home/buildbot/builder/monero-static-ubuntu-amd64/build/build/release'
[ 74%] Built target load-from-json_fuzz_tests
make[3]: Entering directory '/home/buildbot/builder/monero-static-ubuntu-amd64/build/build/release'
Scanning dependencies of target levin_fuzz_tests
make[3]: Leaving directory '/home/buildbot/builder/monero-static-ubuntu-amd64/build/build/release'
make[3]: Entering directory '/home/buildbot/builder/monero-static-ubuntu-amd64/build/build/release'
[ 75%] Building CXX object tests/fuzz/CMakeFiles/levin_fuzz_tests.dir/levin.cpp.o
[ 75%] Building CXX object tests/fuzz/CMakeFiles/levin_fuzz_tests.dir/fuzzer.cpp.o
[ 75%] Linking CXX executable levin_fuzz_tests
make[3]: Leaving directory '/home/buildbot/builder/monero-static-ubuntu-amd64/build/build/release'
[ 75%] Built target levin_fuzz_tests
make[3]: Entering directory '/home/buildbot/builder/monero-static-ubuntu-amd64/build/build/release'
Scanning dependencies of target bulletproof_fuzz_tests
make[3]: Leaving directory '/home/buildbot/builder/monero-static-ubuntu-amd64/build/build/release'
make[3]: Entering directory '/home/buildbot/builder/monero-static-ubuntu-amd64/build/build/release'
[ 76%] Building CXX object tests/fuzz/CMakeFiles/bulletproof_fuzz_tests.dir/bulletproof.cpp.o
In file included from /home/buildbot/builder/monero-static-ubuntu-amd64/build/src/cryptonote_basic/cryptonote_basic.h:50:0,
                 from /home/buildbot/builder/monero-static-ubuntu-amd64/build/tests/fuzz/bulletproof.cpp:32:
/home/buildbot/builder/monero-static-ubuntu-amd64/build/src/ringct/rctTypes.h: In member function 'virtual int BulletproofFuzzer::run(const string&)':
/home/buildbot/builder/monero-static-ubuntu-amd64/build/src/ringct/rctTypes.h:182:12: warning: '<anonymous>.rct::Bulletproof::A' may be used uninitialized in this function [-Wmaybe-uninitialized]
     struct Bulletproof
            ^~~~~~~~~~~
/home/buildbot/builder/monero-static-ubuntu-amd64/build/src/ringct/rctTypes.h:182:12: warning: '<anonymous>.rct::Bulletproof::S' may be used uninitialized in this function [-Wmaybe-uninitialized]
/home/buildbot/builder/monero-static-ubuntu-amd64/build/src/ringct/rctTypes.h:182:12: warning: '<anonymous>.rct::Bulletproof::T1' may be used uninitialized in this function [-Wmaybe-uninitialized]
/home/buildbot/builder/monero-static-ubuntu-amd64/build/src/ringct/rctTypes.h:182:12: warning: '<anonymous>.rct::Bulletproof::T2' may be used uninitialized in this function [-Wmaybe-uninitialized]
/home/buildbot/builder/monero-static-ubuntu-amd64/build/src/ringct/rctTypes.h:182:12: warning: '<anonymous>.rct::Bulletproof::taux' may be used uninitialized in this function [-Wmaybe-uninitialized]
/home/buildbot/builder/monero-static-ubuntu-amd64/build/src/ringct/rctTypes.h:182:12: warning: '<anonymous>.rct::Bulletproof::mu' may be used uninitialized in this function [-Wmaybe-uninitialized]
/home/buildbot/builder/monero-static-ubuntu-amd64/build/src/ringct/rctTypes.h:182:12: warning: '<anonymous>.rct::Bulletproof::a' may be used uninitialized in this function [-Wmaybe-uninitialized]
/home/buildbot/builder/monero-static-ubuntu-amd64/build/src/ringct/rctTypes.h:182:12: warning: '<anonymous>.rct::Bulletproof::b' may be used uninitialized in this function [-Wmaybe-uninitialized]
/home/buildbot/builder/monero-static-ubuntu-amd64/build/src/ringct/rctTypes.h:182:12: warning: '<anonymous>.rct::Bulletproof::t' may be used uninitialized in this function [-Wmaybe-uninitialized]
[ 76%] Building CXX object tests/fuzz/CMakeFiles/bulletproof_fuzz_tests.dir/fuzzer.cpp.o
[ 76%] Linking CXX executable bulletproof_fuzz_tests
make[3]: Leaving directory '/home/buildbot/builder/monero-static-ubuntu-amd64/build/build/release'
[ 76%] Built target bulletproof_fuzz_tests
make[3]: Entering directory '/home/buildbot/builder/monero-static-ubuntu-amd64/build/build/release'
Scanning dependencies of target cold-outputs_fuzz_tests
make[3]: Leaving directory '/home/buildbot/builder/monero-static-ubuntu-amd64/build/build/release'
make[3]: Entering directory '/home/buildbot/builder/monero-static-ubuntu-amd64/build/build/release'
[ 76%] Building CXX object tests/fuzz/CMakeFiles/cold-outputs_fuzz_tests.dir/cold-outputs.cpp.o
[ 77%] Building CXX object tests/fuzz/CMakeFiles/cold-outputs_fuzz_tests.dir/fuzzer.cpp.o
[ 77%] Linking CXX executable cold-outputs_fuzz_tests
make[3]: Leaving directory '/home/buildbot/builder/monero-static-ubuntu-amd64/build/build/release'
[ 77%] Built target cold-outputs_fuzz_tests
make[3]: Entering directory '/home/buildbot/builder/monero-static-ubuntu-amd64/build/build/release'
Scanning dependencies of target parse-url_fuzz_tests
make[3]: Leaving directory '/home/buildbot/builder/monero-static-ubuntu-amd64/build/build/release'
make[3]: Entering directory '/home/buildbot/builder/monero-static-ubuntu-amd64/build/build/release'
[ 78%] Building CXX object tests/fuzz/CMakeFiles/parse-url_fuzz_tests.dir/parse_url.cpp.o
[ 78%] Building CXX object tests/fuzz/CMakeFiles/parse-url_fuzz_tests.dir/fuzzer.cpp.o
[ 78%] Linking CXX executable parse-url_fuzz_tests
make[3]: Leaving directory '/home/buildbot/builder/monero-static-ubuntu-amd64/build/build/release'
[ 78%] Built target parse-url_fuzz_tests
make[3]: Entering directory '/home/buildbot/builder/monero-static-ubuntu-amd64/build/build/release'
Scanning dependencies of target block_fuzz_tests
make[3]: Leaving directory '/home/buildbot/builder/monero-static-ubuntu-amd64/build/build/release'
make[3]: Entering directory '/home/buildbot/builder/monero-static-ubuntu-amd64/build/build/release'
[ 78%] Building CXX object tests/fuzz/CMakeFiles/block_fuzz_tests.dir/block.cpp.o
[ 79%] Building CXX object tests/fuzz/CMakeFiles/block_fuzz_tests.dir/fuzzer.cpp.o
[ 79%] Linking CXX executable block_fuzz_tests
make[3]: Leaving directory '/home/buildbot/builder/monero-static-ubuntu-amd64/build/build/release'
[ 79%] Built target block_fuzz_tests
make[3]: Entering directory '/home/buildbot/builder/monero-static-ubuntu-amd64/build/build/release'
Scanning dependencies of target cncrypto-tests
make[3]: Leaving directory '/home/buildbot/builder/monero-static-ubuntu-amd64/build/build/release'
make[3]: Entering directory '/home/buildbot/builder/monero-static-ubuntu-amd64/build/build/release'
[ 80%] Building C object tests/crypto/CMakeFiles/cncrypto-tests.dir/crypto-ops-data.c.o
[ 80%] Building C object tests/crypto/CMakeFiles/cncrypto-tests.dir/crypto-ops.c.o
[ 80%] Building CXX object tests/crypto/CMakeFiles/cncrypto-tests.dir/crypto.cpp.o
[ 80%] Building C object tests/crypto/CMakeFiles/cncrypto-tests.dir/hash.c.o
[ 81%] Building CXX object tests/crypto/CMakeFiles/cncrypto-tests.dir/main.cpp.o
[ 81%] Building C object tests/crypto/CMakeFiles/cncrypto-tests.dir/random.c.o
[ 81%] Linking CXX executable cncrypto-tests
make[3]: Leaving directory '/home/buildbot/builder/monero-static-ubuntu-amd64/build/build/release'
[ 81%] Built target cncrypto-tests
make[3]: Entering directory '/home/buildbot/builder/monero-static-ubuntu-amd64/build/build/release'
Scanning dependencies of target functional_tests
make[3]: Leaving directory '/home/buildbot/builder/monero-static-ubuntu-amd64/build/build/release'
make[3]: Entering directory '/home/buildbot/builder/monero-static-ubuntu-amd64/build/build/release'
[ 82%] Building CXX object tests/functional_tests/CMakeFiles/functional_tests.dir/main.cpp.o
[ 82%] Building CXX object tests/functional_tests/CMakeFiles/functional_tests.dir/transactions_flow_test.cpp.o
[ 82%] Building CXX object tests/functional_tests/CMakeFiles/functional_tests.dir/transactions_generation_from_blockchain.cpp.o
[ 82%] Linking CXX executable functional_tests
make[3]: Leaving directory '/home/buildbot/builder/monero-static-ubuntu-amd64/build/build/release'
[ 82%] Built target functional_tests
make[3]: Entering directory '/home/buildbot/builder/monero-static-ubuntu-amd64/build/build/release'
Scanning dependencies of target performance_tests
make[3]: Leaving directory '/home/buildbot/builder/monero-static-ubuntu-amd64/build/build/release'
make[3]: Entering directory '/home/buildbot/builder/monero-static-ubuntu-amd64/build/build/release'
[ 82%] Building CXX object tests/performance_tests/CMakeFiles/performance_tests.dir/main.cpp.o
[ 83%] Linking CXX executable performance_tests
make[3]: Leaving directory '/home/buildbot/builder/monero-static-ubuntu-amd64/build/build/release'
[ 83%] Built target performance_tests
make[3]: Entering directory '/home/buildbot/builder/monero-static-ubuntu-amd64/build/build/release'
Scanning dependencies of target core_proxy
make[3]: Leaving directory '/home/buildbot/builder/monero-static-ubuntu-amd64/build/build/release'
make[3]: Entering directory '/home/buildbot/builder/monero-static-ubuntu-amd64/build/build/release'
[ 83%] Building CXX object tests/core_proxy/CMakeFiles/core_proxy.dir/core_proxy.cpp.o
[ 83%] Linking CXX executable core_proxy
make[3]: Leaving directory '/home/buildbot/builder/monero-static-ubuntu-amd64/build/build/release'
[ 83%] Built target core_proxy
make[3]: Entering directory '/home/buildbot/builder/monero-static-ubuntu-amd64/build/build/release'
Scanning dependencies of target unit_tests
make[3]: Leaving directory '/home/buildbot/builder/monero-static-ubuntu-amd64/build/build/release'
make[3]: Entering directory '/home/buildbot/builder/monero-static-ubuntu-amd64/build/build/release'
[ 84%] Building CXX object tests/unit_tests/CMakeFiles/unit_tests.dir/account.cpp.o
[ 84%] Building CXX object tests/unit_tests/CMakeFiles/unit_tests.dir/apply_permutation.cpp.o
[ 84%] Building CXX object tests/unit_tests/CMakeFiles/unit_tests.dir/address_from_url.cpp.o
[ 84%] Building CXX object tests/unit_tests/CMakeFiles/unit_tests.dir/ban.cpp.o
[ 85%] Building CXX object tests/unit_tests/CMakeFiles/unit_tests.dir/base58.cpp.o
[ 85%] Building CXX object tests/unit_tests/CMakeFiles/unit_tests.dir/blockchain_db.cpp.o
[ 85%] Building CXX object tests/unit_tests/CMakeFiles/unit_tests.dir/block_queue.cpp.o
[ 85%] Building CXX object tests/unit_tests/CMakeFiles/unit_tests.dir/block_reward.cpp.o
[ 86%] Building CXX object tests/unit_tests/CMakeFiles/unit_tests.dir/bulletproofs.cpp.o
[ 86%] Building CXX object tests/unit_tests/CMakeFiles/unit_tests.dir/canonical_amounts.cpp.o
[ 86%] Building CXX object tests/unit_tests/CMakeFiles/unit_tests.dir/chacha.cpp.o
[ 86%] Building CXX object tests/unit_tests/CMakeFiles/unit_tests.dir/checkpoints.cpp.o
[ 86%] Building CXX object tests/unit_tests/CMakeFiles/unit_tests.dir/command_line.cpp.o
[ 87%] Building CXX object tests/unit_tests/CMakeFiles/unit_tests.dir/crypto.cpp.o
[ 87%] Building CXX object tests/unit_tests/CMakeFiles/unit_tests.dir/decompose_amount_into_digits.cpp.o
[ 87%] Building CXX object tests/unit_tests/CMakeFiles/unit_tests.dir/device.cpp.o
[ 87%] Building CXX object tests/unit_tests/CMakeFiles/unit_tests.dir/dns_resolver.cpp.o
[ 88%] Building CXX object tests/unit_tests/CMakeFiles/unit_tests.dir/epee_boosted_tcp_server.cpp.o
[ 88%] Building CXX object tests/unit_tests/CMakeFiles/unit_tests.dir/epee_levin_protocol_handler_async.cpp.o
[ 88%] Building CXX object tests/unit_tests/CMakeFiles/unit_tests.dir/epee_utils.cpp.o
[ 88%] Building CXX object tests/unit_tests/CMakeFiles/unit_tests.dir/expect.cpp.o
[ 89%] Building CXX object tests/unit_tests/CMakeFiles/unit_tests.dir/fee.cpp.o
[ 89%] Building CXX object tests/unit_tests/CMakeFiles/unit_tests.dir/json_serialization.cpp.o
[ 89%] Building CXX object tests/unit_tests/CMakeFiles/unit_tests.dir/get_xtype_from_string.cpp.o
[ 89%] Building CXX object tests/unit_tests/CMakeFiles/unit_tests.dir/hashchain.cpp.o
[ 90%] Building CXX object tests/unit_tests/CMakeFiles/unit_tests.dir/http.cpp.o
[ 90%] Building CXX object tests/unit_tests/CMakeFiles/unit_tests.dir/keccak.cpp.o
[ 90%] Building CXX object tests/unit_tests/CMakeFiles/unit_tests.dir/logging.cpp.o
[ 90%] Building CXX object tests/unit_tests/CMakeFiles/unit_tests.dir/main.cpp.o
[ 90%] Building CXX object tests/unit_tests/CMakeFiles/unit_tests.dir/memwipe.cpp.o
[ 91%] Building CXX object tests/unit_tests/CMakeFiles/unit_tests.dir/mlocker.cpp.o
[ 91%] Building CXX object tests/unit_tests/CMakeFiles/unit_tests.dir/mnemonics.cpp.o
[ 91%] Building CXX object tests/unit_tests/CMakeFiles/unit_tests.dir/mul_div.cpp.o
[ 91%] Building CXX object tests/unit_tests/CMakeFiles/unit_tests.dir/multiexp.cpp.o
[ 92%] Building CXX object tests/unit_tests/CMakeFiles/unit_tests.dir/multisig.cpp.o
[ 92%] Building CXX object tests/unit_tests/CMakeFiles/unit_tests.dir/notify.cpp.o
[ 92%] Building CXX object tests/unit_tests/CMakeFiles/unit_tests.dir/output_distribution.cpp.o
[ 92%] Building CXX object tests/unit_tests/CMakeFiles/unit_tests.dir/parse_amount.cpp.o
[ 93%] Building CXX object tests/unit_tests/CMakeFiles/unit_tests.dir/random.cpp.o
[ 93%] Building CXX object tests/unit_tests/CMakeFiles/unit_tests.dir/serialization.cpp.o
[ 93%] Building CXX object tests/unit_tests/CMakeFiles/unit_tests.dir/sha256.cpp.o
[ 93%] Building CXX object tests/unit_tests/CMakeFiles/unit_tests.dir/slow_memmem.cpp.o
[ 94%] Building CXX object tests/unit_tests/CMakeFiles/unit_tests.dir/subaddress.cpp.o
[ 94%] Building CXX object tests/unit_tests/CMakeFiles/unit_tests.dir/test_tx_utils.cpp.o
[ 94%] Building CXX object tests/unit_tests/CMakeFiles/unit_tests.dir/test_peerlist.cpp.o
[ 94%] Building CXX object tests/unit_tests/CMakeFiles/unit_tests.dir/test_protocol_pack.cpp.o
[ 94%] Building CXX object tests/unit_tests/CMakeFiles/unit_tests.dir/threadpool.cpp.o
[ 95%] Building CXX object tests/unit_tests/CMakeFiles/unit_tests.dir/hardfork.cpp.o
[ 95%] Building CXX object tests/unit_tests/CMakeFiles/unit_tests.dir/unbound.cpp.o
[ 95%] Building CXX object tests/unit_tests/CMakeFiles/unit_tests.dir/uri.cpp.o
[ 95%] Building CXX object tests/unit_tests/CMakeFiles/unit_tests.dir/varint.cpp.o
[ 96%] Building CXX object tests/unit_tests/CMakeFiles/unit_tests.dir/ringct.cpp.o
[ 96%] Building CXX object tests/unit_tests/CMakeFiles/unit_tests.dir/output_selection.cpp.o
[ 96%] Building CXX object tests/unit_tests/CMakeFiles/unit_tests.dir/vercmp.cpp.o
[ 96%] Building CXX object tests/unit_tests/CMakeFiles/unit_tests.dir/ringdb.cpp.o
[ 97%] Building CXX object tests/unit_tests/CMakeFiles/unit_tests.dir/wipeable_string.cpp.o
[ 97%] Building CXX object tests/unit_tests/CMakeFiles/unit_tests.dir/is_hdd.cpp.o
[ 97%] Building CXX object tests/unit_tests/CMakeFiles/unit_tests.dir/aligned.cpp.o
[ 97%] Linking CXX executable unit_tests
make[3]: Leaving directory '/home/buildbot/builder/monero-static-ubuntu-amd64/build/build/release'
[ 97%] Built target unit_tests
make[3]: Entering directory '/home/buildbot/builder/monero-static-ubuntu-amd64/build/build/release'
Scanning dependencies of target test_notifier
make[3]: Leaving directory '/home/buildbot/builder/monero-static-ubuntu-amd64/build/build/release'
make[3]: Entering directory '/home/buildbot/builder/monero-static-ubuntu-amd64/build/build/release'
[ 97%] Building CXX object tests/unit_tests/CMakeFiles/test_notifier.dir/test_notifier.cpp.o
[ 97%] Linking CXX executable test_notifier
make[3]: Leaving directory '/home/buildbot/builder/monero-static-ubuntu-amd64/build/build/release'
[ 97%] Built target test_notifier
make[3]: Entering directory '/home/buildbot/builder/monero-static-ubuntu-amd64/build/build/release'
Scanning dependencies of target difficulty-tests
make[3]: Leaving directory '/home/buildbot/builder/monero-static-ubuntu-amd64/build/build/release'
make[3]: Entering directory '/home/buildbot/builder/monero-static-ubuntu-amd64/build/build/release'
[ 97%] Building CXX object tests/difficulty/CMakeFiles/difficulty-tests.dir/difficulty.cpp.o
[ 97%] Linking CXX executable difficulty-tests
make[3]: Leaving directory '/home/buildbot/builder/monero-static-ubuntu-amd64/build/build/release'
[ 97%] Built target difficulty-tests
make[3]: Entering directory '/home/buildbot/builder/monero-static-ubuntu-amd64/build/build/release'
Scanning dependencies of target hash-tests
make[3]: Leaving directory '/home/buildbot/builder/monero-static-ubuntu-amd64/build/build/release'
make[3]: Entering directory '/home/buildbot/builder/monero-static-ubuntu-amd64/build/build/release'
[ 97%] Building CXX object tests/hash/CMakeFiles/hash-tests.dir/main.cpp.o
[ 98%] Linking CXX executable hash-tests
make[3]: Leaving directory '/home/buildbot/builder/monero-static-ubuntu-amd64/build/build/release'
[ 98%] Built target hash-tests
make[3]: Entering directory '/home/buildbot/builder/monero-static-ubuntu-amd64/build/build/release'
Scanning dependencies of target net_load_tests_srv
make[3]: Leaving directory '/home/buildbot/builder/monero-static-ubuntu-amd64/build/build/release'
make[3]: Entering directory '/home/buildbot/builder/monero-static-ubuntu-amd64/build/build/release'
[100%] Building CXX object tests/net_load_tests/CMakeFiles/net_load_tests_srv.dir/srv.cpp.o
[100%] Linking CXX executable net_load_tests_srv
make[3]: Leaving directory '/home/buildbot/builder/monero-static-ubuntu-amd64/build/build/release'
[100%] Built target net_load_tests_srv
make[3]: Entering directory '/home/buildbot/builder/monero-static-ubuntu-amd64/build/build/release'
Scanning dependencies of target net_load_tests_clt
make[3]: Leaving directory '/home/buildbot/builder/monero-static-ubuntu-amd64/build/build/release'
make[3]: Entering directory '/home/buildbot/builder/monero-static-ubuntu-amd64/build/build/release'
[100%] Building CXX object tests/net_load_tests/CMakeFiles/net_load_tests_clt.dir/clt.cpp.o
[100%] Linking CXX executable net_load_tests_clt
make[3]: Leaving directory '/home/buildbot/builder/monero-static-ubuntu-amd64/build/build/release'
[100%] Built target net_load_tests_clt
make[2]: Leaving directory '/home/buildbot/builder/monero-static-ubuntu-amd64/build/build/release'
make[1]: Leaving directory '/home/buildbot/builder/monero-static-ubuntu-amd64/build/build/release'
make[1]: Entering directory '/home/buildbot/builder/monero-static-ubuntu-amd64/build/build/release'
Running tests...
Test project /home/buildbot/builder/monero-static-ubuntu-amd64/build/build/release
      Start  1: hash-target
 1/14 Test  #1: hash-target ......................   Passed    0.04 sec
      Start  2: cncrypto
 2/14 Test  #2: cncrypto .........................   Passed    6.64 sec
      Start  3: unit_tests
 3/14 Test  #3: unit_tests .......................***Exception: SegFault 17.01 sec
      Start  4: difficulty
 4/14 Test  #4: difficulty .......................   Passed    0.01 sec
      Start  5: hash-fast
 5/14 Test  #5: hash-fast ........................   Passed    0.00 sec
      Start  6: hash-slow
 6/14 Test  #6: hash-slow ........................   Passed    0.06 sec
      Start  7: hash-slow-1
 7/14 Test  #7: hash-slow-1 ......................   Passed    0.07 sec
      Start  8: hash-slow-2
 8/14 Test  #8: hash-slow-2 ......................   Passed    0.21 sec
      Start  9: hash-tree
 9/14 Test  #9: hash-tree ........................   Passed    0.00 sec
      Start 10: hash-extra-blake
10/14 Test #10: hash-extra-blake .................   Passed    0.00 sec
      Start 11: hash-extra-groestl
11/14 Test #11: hash-extra-groestl ...............   Passed    0.01 sec
      Start 12: hash-extra-jh
12/14 Test #12: hash-extra-jh ....................   Passed    0.00 sec
      Start 13: hash-extra-skein
13/14 Test #13: hash-extra-skein .................   Passed    0.00 sec
      Start 14: hash-variant2-int-sqrt
14/14 Test #14: hash-variant2-int-sqrt ...........   Passed  228.68 sec

93% tests passed, 1 tests failed out of 14

Total Test time (real) = 252.75 sec

The following tests FAILED:
	  3 - unit_tests (SEGFAULT)
Errors while running CTest
Makefile:97: recipe for target 'test' failed
make[1]: Leaving directory '/home/buildbot/builder/monero-static-ubuntu-amd64/build/build/release'
Makefile:90: recipe for target 'release-test' failed
make[1]: *** [test] Error 8
make: *** [release-test] Error 2
program finished with exit code 2
elapsedTime=1195.757201