(view as text)
gmake release-static
 in dir /home/buildbot/builder/monero-static-dragonflybsd-amd64/build (timeout 1200 secs)
 watching logfiles {}
 argv: ['gmake', 'release-static']
 environment:
  BLOCKSIZE=K
  EDITOR=vi
  ENV=/home/buildbot/.shrc
  FTP_PASSIVE_MODE=YES
  HOME=/home/buildbot
  LDVER=ld.bfd
  MAIL=/var/mail/buildbot
  PAGER=less
  PATH=/sbin:/bin:/usr/sbin:/usr/bin:/usr/games:/usr/local/sbin:/usr/local/bin:/usr/pkg/sbin:/usr/pkg/bin:/home/buildbot/bin
  PWD=/home/buildbot/builder/monero-static-dragonflybsd-amd64/build
  SHELL=/usr/local/bin/bash
  SHLVL=1
  TERM=xterm
  USER=buildbot
  _=/usr/local/bin/buildslave
 using PTY: False
mkdir -p build/"DragonFly/master"/release
cd build/"DragonFly/master"/release && cmake -D STATIC=ON -D ARCH="x86-64" -D BUILD_64=ON -D CMAKE_BUILD_TYPE=release ../../../.. && gmake
-- CMake version 3.11.2
-- The C compiler identification is GNU 5.4.1
-- The CXX compiler identification is GNU 5.4.1
-- Check for working C compiler: /usr/bin/cc
-- Check for working C compiler: /usr/bin/cc -- works
-- Detecting C compiler ABI info
-- Detecting C compiler ABI info - done
-- Detecting C compile features
-- Detecting C compile features - done
-- Check for working CXX compiler: /usr/bin/CC
-- Check for working CXX compiler: /usr/bin/CC -- works
-- Detecting CXX compiler ABI info
-- Detecting CXX compiler ABI info - done
-- Detecting CXX compile features
-- Detecting CXX compile features - done
-- Building without build tag
-- Found Git: /usr/local/bin/git (found version "2.17.1") 
-- Checking submodules
-- Submodule 'external/miniupnp' is up-to-date
-- Submodule 'external/unbound' is up-to-date
-- Submodule 'external/rapidjson' is up-to-date
-- Submodule 'external/trezor-common' is up-to-date
-- Could not find DEVELOPER_LOCAL_TOOLS in env (not required)
-- BOOST_IGNORE_SYSTEM_PATHS defaults to OFF
-- Could not find DEVELOPER_LIBUNBOUND_OLD in env (not required)
-- Building for a 64-bit system
-- Building internal libraries as static
-- Could not find DATABASE in env (not required unless you want to change database type from default: lmdb)
-- Using LMDB as default DB type
-- Stack trace on exception enabled (using easylogging++)
-- Looking for pthread.h
-- Looking for pthread.h - found
-- Looking for pthread_create
-- Looking for pthread_create - not found
-- Check if compiler accepts -pthread
-- Check if compiler accepts -pthread - yes
-- Found Threads: TRUE  
-- Performing Test _pthread_c
-- Performing Test _pthread_c - Success
-- Performing Test _pthread_cxx
-- Performing Test _pthread_cxx - Success
-- Found OpenSSL: /usr/local/lib/libcrypto.a (found version "2.0.0") 
-- Using OpenSSL include dir at /usr/local/include
-- Could NOT find HIDAPI (missing: HIDAPI_LIBRARY HIDAPI_INCLUDE_DIR) 
-- Looking for memset_s in c
-- Looking for memset_s in c - not found
-- Looking for explicit_bzero in c
-- Looking for explicit_bzero in c - not found
-- Looking for strptime
-- Looking for strptime - found
-- Could NOT find MiniUPnPc (missing: MINIUPNP_INCLUDE_DIR MINIUPNP_LIBRARY) 
-- Using in-tree miniupnpc
-- Looking for libunbound
-- Looking for arpa/inet.h
-- Looking for arpa/inet.h - found
-- Looking for endian.h
-- Looking for endian.h - not found
-- Looking for dlfcn.h
-- Looking for dlfcn.h - found
-- Looking for event.h
-- Looking for event.h - not found
-- Looking for getopt.h
-- Looking for getopt.h - found
-- Looking for glob.h
-- Looking for glob.h - found
-- Looking for grp.h
-- Looking for grp.h - found
-- Looking for inttypes.h
-- Looking for inttypes.h - found
-- Looking for iphlpapi.h
-- Looking for iphlpapi.h - not found
-- Looking for login_cap.h
-- Looking for login_cap.h - not found
-- Looking for memory.h
-- Looking for memory.h - found
-- Looking for netdb.h
-- Looking for netdb.h - found
-- Looking for netinet/in.h
-- Looking for netinet/in.h - found
-- Looking for pthread.h
-- Looking for pthread.h - found
-- Looking for pwd.h
-- Looking for pwd.h - found
-- Looking for stdarg.h
-- Looking for stdarg.h - found
-- Looking for stdbool.h
-- Looking for stdbool.h - found
-- Looking for stdint.h
-- Looking for stdint.h - found
-- Looking for stdlib.h
-- Looking for stdlib.h - found
-- Looking for strings.h
-- Looking for strings.h - found
-- Looking for string.h
-- Looking for string.h - found
-- Looking for sys/param.h
-- Looking for sys/param.h - found
-- Looking for sys/resource.h
-- Looking for sys/resource.h - found
-- Looking for sys/sha2.h
-- Looking for sys/sha2.h - not found
-- Looking for sys/socket.h
-- Looking for sys/socket.h - found
-- Looking for sys/stat.h
-- Looking for sys/stat.h - found
-- Looking for sys/sysctl.h
-- Looking for sys/sysctl.h - found
-- Looking for sys/types.h
-- Looking for sys/types.h - found
-- Looking for sys/uio.h
-- Looking for sys/uio.h - found
-- Looking for sys/un.h
-- Looking for sys/un.h - found
-- Looking for sys/wait.h
-- Looking for sys/wait.h - found
-- Looking for syslog.h
-- Looking for syslog.h - found
-- Looking for time.h
-- Looking for time.h - found
-- Looking for unistd.h
-- Looking for unistd.h - found
-- Looking for vfork.h
-- Looking for vfork.h - not found
-- Looking for windows.h
-- Looking for windows.h - not found
-- Looking for winsock2.h
-- Looking for winsock2.h - not found
-- Looking for ws2tcpip.h
-- Looking for ws2tcpip.h - not found
-- Looking for _beginthreadex
-- Looking for _beginthreadex - not found
-- Looking for arc4random
-- Looking for arc4random - found
-- Looking for arc4random_uniform
-- Looking for arc4random_uniform - found
-- Looking for chown
-- Looking for chown - found
-- Looking for chroot
-- Looking for chroot - found
-- Looking for ctime_r
-- Looking for ctime_r - found
-- Looking for daemon
-- Looking for daemon - found
-- Looking for endprotoent
-- Looking for endprotoent - found
-- Looking for endservent
-- Looking for endservent - found
-- Looking for fork
-- Looking for fork - found
-- Looking for fseeko
-- Looking for fseeko - found
-- Looking for fsync
-- Looking for fsync - found
-- Looking for getauxval
-- Looking for getauxval - not found
-- Looking for getentropy
-- Looking for getentropy - not found
-- Looking for getpwnam
-- Looking for getpwnam - found
-- Looking for getrlimit
-- Looking for getrlimit - found
-- Looking for glob
-- Looking for glob - found
-- Looking for gmtime_r
-- Looking for gmtime_r - found
-- Looking for fcntl
-- Looking for fcntl - found
-- Looking for inet_aton
-- Looking for inet_aton - found
-- Looking for inet_ntop
-- Looking for inet_ntop - found
-- Looking for inet_pton
-- Looking for inet_pton - found
-- Looking for initgroups
-- Looking for initgroups - found
-- Looking for ioctlsocket
-- Looking for ioctlsocket - not found
-- Looking for isblank
-- Looking for isblank - found
-- Looking for kill
-- Looking for kill - found
-- Looking for localtime_r
-- Looking for localtime_r - found
-- Looking for malloc
-- Looking for malloc - found
-- Looking for memmove
-- Looking for memmove - found
-- Looking for random
-- Looking for random - found
-- Looking for reallocarray
-- Looking for reallocarray - not found
-- Looking for recvmsg
-- Looking for recvmsg - found
-- Looking for sbrk
-- Looking for sbrk - found
-- Looking for sendmsg
-- Looking for sendmsg - found
-- Looking for setregid
-- Looking for setregid - found
-- Looking for setresgid
-- Looking for setresgid - found
-- Looking for setresuid
-- Looking for setresuid - found
-- Looking for setreuid
-- Looking for setreuid - found
-- Looking for setrlimit
-- Looking for setrlimit - found
-- Looking for setsid
-- Looking for setsid - found
-- Looking for setusercontent
-- Looking for setusercontent - not found
-- Looking for sigprocmask
-- Looking for sigprocmask - found
-- Looking for sleep
-- Looking for sleep - found
-- Looking for snprintf
-- Looking for snprintf - found
-- Looking for socketpair
-- Looking for socketpair - found
-- Looking for srandom
-- Looking for srandom - found
-- Looking for strsep
-- Looking for strsep - found
-- Looking for strftime
-- Looking for strftime - found
-- Looking for strlcat
-- Looking for strlcat - found
-- Looking for strlcpy
-- Looking for strlcpy - found
-- Looking for strptime
-- Looking for strptime - found
-- Looking for tzset
-- Looking for tzset - found
-- Looking for usleep
-- Looking for usleep - found
-- Looking for writev
-- Looking for writev - found
-- Looking for getaddrinfo
-- Looking for getaddrinfo - found
-- Looking for stddef.h
-- Looking for stddef.h - found
-- Check size of time_t
-- Check size of time_t - done
-- Check size of gid_t
-- Check size of gid_t - done
-- Check size of in_addr_t
-- Check size of in_addr_t - done
-- Check size of in_port_t
-- Check size of in_port_t - done
-- Check size of int16_t
-- Check size of int16_t - done
-- Check size of int32_t
-- Check size of int32_t - done
-- Check size of int64_t
-- Check size of int64_t - done
-- Check size of int8_t
-- Check size of int8_t - done
-- Check size of pid_t
-- Check size of pid_t - done
-- Check size of rlim_t
-- Check size of rlim_t - done
-- Check size of ssize_t
-- Check size of ssize_t - done
-- Check size of uid_t
-- Check size of uid_t - done
-- Check size of uint16_t
-- Check size of uint16_t - done
-- Check size of uint32_t
-- Check size of uint32_t - done
-- Check size of uint64_t
-- Check size of uint64_t - done
-- Check size of uint8_t
-- Check size of uint8_t - done
-- Looking for PTHREAD_PRIO_INHERIT
-- Looking for PTHREAD_PRIO_INHERIT - found
-- Looking for pthread_rwlock_t
-- Looking for pthread_rwlock_t - not found
-- Looking for pthread_spinlock_t
-- Looking for pthread_spinlock_t - not found
-- Looking for openssl/conf.h
-- Looking for openssl/conf.h - found
-- Looking for openssl/engine.h
-- Looking for openssl/engine.h - found
-- Looking for openssl/err.h
-- Looking for openssl/err.h - found
-- Looking for openssl/rand.h
-- Looking for openssl/rand.h - found
-- Looking for openssl/ssl.h
-- Looking for openssl/ssl.h - found
-- Looking for NID_secp384r1
-- Looking for NID_secp384r1 - found
-- Looking for NID_X9_62_prime256v1
-- Looking for NID_X9_62_prime256v1 - found
-- Looking for sk_SSL_COMP_pop_free
-- Looking for sk_SSL_COMP_pop_free - found
-- Looking for SSL_COMP_get_compression_methods
-- Looking for SSL_COMP_get_compression_methods - found
-- Looking for EVP_MD_CTX_new
-- Looking for EVP_MD_CTX_new - found
-- Looking for EVP_sha1
-- Looking for EVP_sha1 - found
-- Looking for EVP_sha256
-- Looking for EVP_sha256 - found
-- Looking for EVP_sha512
-- Looking for EVP_sha512 - found
-- Looking for FIPS_mode
-- Looking for FIPS_mode - not found
-- Looking for HMAC_Update
-- Looking for HMAC_Update - found
-- Looking for OPENSSL_config
-- Looking for OPENSSL_config - found
-- Looking for SHA512_Update
-- Looking for SHA512_Update - found
-- Found PkgConfig: /usr/local/bin/pkg-config (found version "1.4.2") 
-- Looking for LIBRESSL_VERSION_TEXT
-- Looking for LIBRESSL_VERSION_TEXT - not found
-- Using 64-bit LMDB from source tree
-- Could not find HIDAPI
-- Could NOT find Protobuf (missing: Protobuf_INCLUDE_DIR) 
-- Could NOT find Protobuf (missing: Protobuf_INCLUDE_DIR) 
-- Could not find Protobuf
-- Building on x86_64 for x86-64
-- AES support enabled
-- Performing Test _Wformat_c
-- Performing Test _Wformat_c - Success
-- Performing Test _Wformat_cxx
-- Performing Test _Wformat_cxx - Success
-- Performing Test _Wformat_security_c
-- Performing Test _Wformat_security_c - Success
-- Performing Test _Wformat_security_cxx
-- Performing Test _Wformat_security_cxx - Success
-- Performing Test _fstack_protector_c
-- Performing Test _fstack_protector_c - Success
-- Performing Test _fstack_protector_cxx
-- Performing Test _fstack_protector_cxx - Success
-- Performing Test _fstack_protector_strong_c
-- Performing Test _fstack_protector_strong_c - Success
-- Performing Test _fstack_protector_strong_cxx
-- Performing Test _fstack_protector_strong_cxx - Success
-- Performing Test _fcf_protection=full_c
-- Performing Test _fcf_protection=full_c - Failed
-- Performing Test _fcf_protection=full_cxx
-- Performing Test _fcf_protection=full_cxx - Failed
-- Performing Test _fstack_clash_protection_c
-- Performing Test _fstack_clash_protection_c - Failed
-- Performing Test _fstack_clash_protection_cxx
-- Performing Test _fstack_clash_protection_cxx - Failed
-- Performing Test _mmitigate_rop_c
-- Performing Test _mmitigate_rop_c - Failed
-- Performing Test _mmitigate_rop_cxx
-- Performing Test _mmitigate_rop_cxx - Failed
-- Looking for -pie linker flag
-- Looking for -pie linker flag - found
-- Looking for -Wl,-z,relro linker flag
-- Looking for -Wl,-z,relro linker flag - found
-- Looking for -Wl,-z,now linker flag
-- Looking for -Wl,-z,now linker flag - found
-- Looking for -Wl,-z,noexecstack linker flag
-- Looking for -Wl,-z,noexecstack linker flag - found
-- Looking for -Wl,-z,noexecheap linker flag
-- Looking for -Wl,-z,noexecheap linker flag - not found
-- Using C security hardening flags:  -Wformat -Wformat-security -fstack-protector -fstack-protector-strong
-- Using C++ security hardening flags:  -Wformat -Wformat-security -fstack-protector -fstack-protector-strong
-- Using linker security hardening flags:  -pie -Wl,-z,relro -Wl,-z,now -Wl,-z,noexecstack
-- Found Boost Version: 106700
-- Looking for rl_copy_text
-- Looking for rl_copy_text - not found
-- Looking for rl_filename_completion_function
-- Looking for rl_filename_completion_function - not found
-- Looking for rl_copy_text
-- Looking for rl_copy_text - found
-- Looking for rl_filename_completion_function
-- Looking for rl_filename_completion_function - found
-- Found readline library at: /usr/local
-- Found Git: /usr/local/bin/git
-- Trezor support disabled
Doxygen: graphviz not found - graphs disabled
-- Could NOT find Doxygen (missing: DOXYGEN_EXECUTABLE) 
-- Performing Test HAVE_C11
-- Performing Test HAVE_C11 - Success
-- Configuring done
-- Generating done
-- Build files have been written to: /home/buildbot/builder/monero-static-dragonflybsd-amd64/build/build/DragonFly/master/release
gmake[1]: Entering directory '/home/buildbot/builder/monero-static-dragonflybsd-amd64/build/build/DragonFly/master/release'
gmake[2]: Entering directory '/home/buildbot/builder/monero-static-dragonflybsd-amd64/build/build/DragonFly/master/release'
gmake[3]: Entering directory '/home/buildbot/builder/monero-static-dragonflybsd-amd64/build/build/DragonFly/master/release'
Scanning dependencies of target generate_translations_header
gmake[3]: Leaving directory '/home/buildbot/builder/monero-static-dragonflybsd-amd64/build/build/DragonFly/master/release'
gmake[3]: Entering directory '/home/buildbot/builder/monero-static-dragonflybsd-amd64/build/build/DragonFly/master/release'
[  0%] Creating directories for 'generate_translations_header'
[  0%] No download step for 'generate_translations_header'
[  0%] No patch step for 'generate_translations_header'
[  1%] No update step for 'generate_translations_header'
[  1%] Performing configure step for 'generate_translations_header'
-- The C compiler identification is GNU 5.4.1
-- The CXX compiler identification is GNU 5.4.1
-- Check for working C compiler: /usr/bin/cc
-- Check for working C compiler: /usr/bin/cc -- works
-- Detecting C compiler ABI info
-- Detecting C compiler ABI info - done
-- Detecting C compile features
-- Detecting C compile features - done
-- Check for working CXX compiler: /usr/bin/CC
-- Check for working CXX compiler: /usr/bin/CC -- works
-- Detecting CXX compiler ABI info
-- Detecting CXX compiler ABI info - done
-- Detecting CXX compile features
-- Detecting CXX compile features - done
CMake Warning at CMakeLists.txt:53 (message):
  lrelease program not found, translation files not built


-- Configuring done
-- Generating done
-- Build files have been written to: /home/buildbot/builder/monero-static-dragonflybsd-amd64/build/build/DragonFly/master/release/translations
[  2%] Performing build step for 'generate_translations_header'
gmake[4]: Entering directory '/home/buildbot/builder/monero-static-dragonflybsd-amd64/build/build/DragonFly/master/release/translations'
gmake[5]: Entering directory '/home/buildbot/builder/monero-static-dragonflybsd-amd64/build/build/DragonFly/master/release/translations'
gmake[6]: Entering directory '/home/buildbot/builder/monero-static-dragonflybsd-amd64/build/build/DragonFly/master/release/translations'
Scanning dependencies of target generate_translations_header
gmake[6]: Leaving directory '/home/buildbot/builder/monero-static-dragonflybsd-amd64/build/build/DragonFly/master/release/translations'
gmake[6]: Entering directory '/home/buildbot/builder/monero-static-dragonflybsd-amd64/build/build/DragonFly/master/release/translations'
[ 50%] Building C object CMakeFiles/generate_translations_header.dir/generate_translations_header.c.o
[100%] Linking C executable generate_translations_header
Generating embedded translations header
gmake[6]: Leaving directory '/home/buildbot/builder/monero-static-dragonflybsd-amd64/build/build/DragonFly/master/release/translations'
[100%] Built target generate_translations_header
gmake[5]: Leaving directory '/home/buildbot/builder/monero-static-dragonflybsd-amd64/build/build/DragonFly/master/release/translations'
gmake[4]: Leaving directory '/home/buildbot/builder/monero-static-dragonflybsd-amd64/build/build/DragonFly/master/release/translations'
[  3%] Performing install step for 'generate_translations_header'

[  3%] Completed 'generate_translations_header'
gmake[3]: Leaving directory '/home/buildbot/builder/monero-static-dragonflybsd-amd64/build/build/DragonFly/master/release'
[  3%] Built target generate_translations_header
gmake[3]: Entering directory '/home/buildbot/builder/monero-static-dragonflybsd-amd64/build/build/DragonFly/master/release'
Scanning dependencies of target libminiupnpc-static
gmake[3]: Leaving directory '/home/buildbot/builder/monero-static-dragonflybsd-amd64/build/build/DragonFly/master/release'
gmake[3]: Entering directory '/home/buildbot/builder/monero-static-dragonflybsd-amd64/build/build/DragonFly/master/release'
[  4%] Building C object external/miniupnp/miniupnpc/CMakeFiles/libminiupnpc-static.dir/igd_desc_parse.c.o
[  4%] Building C object external/miniupnp/miniupnpc/CMakeFiles/libminiupnpc-static.dir/miniupnpc.c.o
[  4%] Building C object external/miniupnp/miniupnpc/CMakeFiles/libminiupnpc-static.dir/minixml.c.o
[  5%] Building C object external/miniupnp/miniupnpc/CMakeFiles/libminiupnpc-static.dir/minisoap.c.o
[  5%] Building C object external/miniupnp/miniupnpc/CMakeFiles/libminiupnpc-static.dir/minissdpc.c.o
/home/buildbot/builder/monero-static-dragonflybsd-amd64/build/external/miniupnp/miniupnpc/minissdpc.c: In function 'ssdpDiscoverDevices':
/home/buildbot/builder/monero-static-dragonflybsd-amd64/build/external/miniupnp/miniupnpc/minissdpc.c:673:18: error: storage size of 'ifr' isn't known
     struct ifreq ifr;
                  ^
/home/buildbot/builder/monero-static-dragonflybsd-amd64/build/external/miniupnp/miniupnpc/minissdpc.c:675:40: error: 'IFNAMSIZ' undeclared (first use in this function)
     strncpy(ifr.ifr_name, multicastif, IFNAMSIZ);
                                        ^
/home/buildbot/builder/monero-static-dragonflybsd-amd64/build/external/miniupnp/miniupnpc/minissdpc.c:675:40: note: each undeclared identifier is reported only once for each function it appears in
In file included from /usr/include/sys/ttycom.h:42:0,
                 from /usr/include/sys/ioctl.h:45,
                 from /home/buildbot/builder/monero-static-dragonflybsd-amd64/build/external/miniupnp/miniupnpc/minissdpc.c:70:
/home/buildbot/builder/monero-static-dragonflybsd-amd64/build/external/miniupnp/miniupnpc/minissdpc.c:677:20: error: invalid application of 'sizeof' to incomplete type 'struct ifreq'
     if(ioctl(sudp, SIOCGIFADDR, &ifr, &ifrlen) < 0)
                    ^
gmake[3]: *** [external/miniupnp/miniupnpc/CMakeFiles/libminiupnpc-static.dir/build.make:115: external/miniupnp/miniupnpc/CMakeFiles/libminiupnpc-static.dir/minissdpc.c.o] Error 1
gmake[3]: Leaving directory '/home/buildbot/builder/monero-static-dragonflybsd-amd64/build/build/DragonFly/master/release'
gmake[2]: Leaving directory '/home/buildbot/builder/monero-static-dragonflybsd-amd64/build/build/DragonFly/master/release'
gmake[2]: *** [CMakeFiles/Makefile2:150: external/miniupnp/miniupnpc/CMakeFiles/libminiupnpc-static.dir/all] Error 2
gmake[1]: *** [Makefile:141: all] Error 2
gmake[1]: Leaving directory '/home/buildbot/builder/monero-static-dragonflybsd-amd64/build/build/DragonFly/master/release'
gmake: *** [Makefile:99: release-static] Error 2
program finished with exit code 2
elapsedTime=29.982702