(view as text)
Compiling the C compiler identification source file "CMakeCCompilerId.c" failed.
Compiler: /usr/lib/ccache/gcc 
Build flags: 
Id flags: 

The output was:
1
collect2: error: ld returned 1 exit status


The C compiler identification could not be found in "/opt/buildbot/builder/monero-linux-armv8/build/build/release/CMakeFiles/3.7.2/CompilerIdC/CMakeCCompilerId.o"

Compiling the C compiler identification source file "CMakeCCompilerId.c" failed.
Compiler: /usr/lib/ccache/gcc 
Build flags: 
Id flags: -Aa

The output was:
1
<command-line>:0:1: error: missing '(' after predicate


Determining if the C compiler works failed with the following output:
Change Dir: /opt/buildbot/builder/monero-linux-armv8/build/build/release/CMakeFiles/CMakeTmp

Run Build Command:"/usr/bin/make" "cmTC_23cd6/fast"
make[1]: Entering directory '/opt/buildbot/builder/monero-linux-armv8/build/build/release/CMakeFiles/CMakeTmp'
/usr/bin/make -f CMakeFiles/cmTC_23cd6.dir/build.make CMakeFiles/cmTC_23cd6.dir/build
make[2]: Entering directory '/opt/buildbot/builder/monero-linux-armv8/build/build/release/CMakeFiles/CMakeTmp'
Building C object CMakeFiles/cmTC_23cd6.dir/testCCompiler.c.o
/usr/lib/ccache/gcc     -o CMakeFiles/cmTC_23cd6.dir/testCCompiler.c.o   -c /opt/buildbot/builder/monero-linux-armv8/build/build/release/CMakeFiles/CMakeTmp/testCCompiler.c
/tmp/cc1VLlFw.s: Assembler messages:
/tmp/cc1VLlFw.s: Warning: end of file not at end of a line; newline inserted
Linking C executable cmTC_23cd6
/usr/bin/cmake -E cmake_link_script CMakeFiles/cmTC_23cd6.dir/link.txt --verbose=1
/usr/lib/ccache/gcc       CMakeFiles/cmTC_23cd6.dir/testCCompiler.c.o  -o cmTC_23cd6 -rdynamic 
                                                                                                                                                                                                                                                                              collect2: error: ld returned 1 exit status
CMakeFiles/cmTC_23cd6.dir/build.make:97: recipe for target 'cmTC_23cd6' failed
make[2]: *** [cmTC_23cd6] Error 1
make[2]: Leaving directory '/opt/buildbot/builder/monero-linux-armv8/build/build/release/CMakeFiles/CMakeTmp'
Makefile:126: recipe for target 'cmTC_23cd6/fast' failed
make[1]: *** [cmTC_23cd6/fast] Error 2
make[1]: Leaving directory '/opt/buildbot/builder/monero-linux-armv8/build/build/release/CMakeFiles/CMakeTmp'