(view as text)
Compiling the CXX compiler identification source file "CMakeCXXCompilerId.cpp" failed.
Compiler: /usr/lib/ccache/g++ 
Build flags: 
Id flags: 

The output was:
1
/tmp/cc69u6NG.s: Assembler messages:
/tmp/cc69u6NG.s: Warning: end of file not at end of a line; newline inserted
collect2: error: ld returned 1 exit status


The CXX compiler identification could not be found in "/opt/buildbot/builder/monero-linux-armv8/build/build/release/CMakeFiles/3.7.2/CompilerIdCXX/CMakeCXXCompilerId.o"

Checking whether the CXX compiler is IAR using "" did not match "IAR .+ Compiler":
g++: fatal error: no input files
compilation terminated.
Determining if the C compiler works failed with the following output:
Change Dir: /opt/buildbot/builder/monero-linux-armv8/build/build/release/CMakeFiles/CMakeTmp

Run Build Command:"/usr/bin/make" "cmTC_788c4/fast"
make[1]: Entering directory '/opt/buildbot/builder/monero-linux-armv8/build/build/release/CMakeFiles/CMakeTmp'
/usr/bin/make -f CMakeFiles/cmTC_788c4.dir/build.make CMakeFiles/cmTC_788c4.dir/build
make[2]: Entering directory '/opt/buildbot/builder/monero-linux-armv8/build/build/release/CMakeFiles/CMakeTmp'
Building C object CMakeFiles/cmTC_788c4.dir/testCCompiler.c.o
/usr/lib/ccache/gcc     -o CMakeFiles/cmTC_788c4.dir/testCCompiler.c.o   -c /opt/buildbot/builder/monero-linux-armv8/build/build/release/CMakeFiles/CMakeTmp/testCCompiler.c
/tmp/cc1VLlFw.s: Assembler messages:
/tmp/cc1VLlFw.s: Warning: end of file not at end of a line; newline inserted
Linking C executable cmTC_788c4
/usr/bin/cmake -E cmake_link_script CMakeFiles/cmTC_788c4.dir/link.txt --verbose=1
/usr/lib/ccache/gcc       CMakeFiles/cmTC_788c4.dir/testCCompiler.c.o  -o cmTC_788c4 -rdynamic 
/usr/lib/gcc/aarch64-linux-gnu/6/../../../aarch64-linux-gnu/Scrt1.o: In function `_start':
(.text+0x18): undefined reference to `main'
/usr/lib/gcc/aarch64-linux-gnu/6/../../../aarch64-linux-gnu/Scrt1.o: In function `_start':
(.text+0x1c): undefined reference to `main'
collect2: error: ld returned 1 exit status
CMakeFiles/cmTC_788c4.dir/build.make:97: recipe for target 'cmTC_788c4' failed
make[2]: *** [cmTC_788c4] Error 1
make[2]: Leaving directory '/opt/buildbot/builder/monero-linux-armv8/build/build/release/CMakeFiles/CMakeTmp'
Makefile:126: recipe for target 'cmTC_788c4/fast' failed
make[1]: *** [cmTC_788c4/fast] Error 2
make[1]: Leaving directory '/opt/buildbot/builder/monero-linux-armv8/build/build/release/CMakeFiles/CMakeTmp'