(view as text)
Determining if the pthread_create exist failed with the following output:
Change Dir: /home/buildbot/slave/monero-linux-armv7/build/build/release/CMakeFiles/CMakeTmp

Run Build Command:"/usr/bin/make" "cmTC_ed622/fast"
make[1]: Entering directory '/home/buildbot/slave/monero-linux-armv7/build/build/release/CMakeFiles/CMakeTmp'
/usr/bin/make -f CMakeFiles/cmTC_ed622.dir/build.make CMakeFiles/cmTC_ed622.dir/build
make[2]: Entering directory '/home/buildbot/slave/monero-linux-armv7/build/build/release/CMakeFiles/CMakeTmp'
Building C object CMakeFiles/cmTC_ed622.dir/CheckSymbolExists.c.o
/usr/lib/ccache/gcc     -o CMakeFiles/cmTC_ed622.dir/CheckSymbolExists.c.o   -c /home/buildbot/slave/monero-linux-armv7/build/build/release/CMakeFiles/CMakeTmp/CheckSymbolExists.c
Linking C executable cmTC_ed622
/usr/bin/cmake -E cmake_link_script CMakeFiles/cmTC_ed622.dir/link.txt --verbose=1
/usr/lib/ccache/gcc       CMakeFiles/cmTC_ed622.dir/CheckSymbolExists.c.o  -o cmTC_ed622 -rdynamic 
CMakeFiles/cmTC_ed622.dir/CheckSymbolExists.c.o: In function `main':
CheckSymbolExists.c:(.text+0xe): undefined reference to `pthread_create'
CheckSymbolExists.c:(.text+0x12): undefined reference to `pthread_create'
collect2: error: ld returned 1 exit status
CMakeFiles/cmTC_ed622.dir/build.make:97: recipe for target 'cmTC_ed622' failed
make[2]: *** [cmTC_ed622] Error 1
make[2]: Leaving directory '/home/buildbot/slave/monero-linux-armv7/build/build/release/CMakeFiles/CMakeTmp'
Makefile:126: recipe for target 'cmTC_ed622/fast' failed
make[1]: *** [cmTC_ed622/fast] Error 2
make[1]: Leaving directory '/home/buildbot/slave/monero-linux-armv7/build/build/release/CMakeFiles/CMakeTmp'

File /home/buildbot/slave/monero-linux-armv7/build/build/release/CMakeFiles/CMakeTmp/CheckSymbolExists.c:
/* */
#include <pthread.h>

int main(int argc, char** argv)
{
  (void)argv;
#ifndef pthread_create
  return ((int*)(&pthread_create))[argc];
#else
  (void)argc;
  return 0;
#endif
}

Determining if the function memset_s exists in the c failed with the following output:
Change Dir: /home/buildbot/slave/monero-linux-armv7/build/build/release/CMakeFiles/CMakeTmp

Run Build Command:"/usr/bin/make" "cmTC_d59ef/fast"
make[1]: Entering directory '/home/buildbot/slave/monero-linux-armv7/build/build/release/CMakeFiles/CMakeTmp'
/usr/bin/make -f CMakeFiles/cmTC_d59ef.dir/build.make CMakeFiles/cmTC_d59ef.dir/build
make[2]: Entering directory '/home/buildbot/slave/monero-linux-armv7/build/build/release/CMakeFiles/CMakeTmp'
Building C object CMakeFiles/cmTC_d59ef.dir/CheckFunctionExists.c.o
/usr/lib/ccache/gcc    -pthread -DCHECK_FUNCTION_EXISTS=memset_s   -o CMakeFiles/cmTC_d59ef.dir/CheckFunctionExists.c.o   -c /usr/share/cmake-3.5/Modules/CheckFunctionExists.c
Linking C executable cmTC_d59ef
/usr/bin/cmake -E cmake_link_script CMakeFiles/cmTC_d59ef.dir/link.txt --verbose=1
/usr/lib/ccache/gcc   -pthread -DCHECK_FUNCTION_EXISTS=memset_s    CMakeFiles/cmTC_d59ef.dir/CheckFunctionExists.c.o  -o cmTC_d59ef  -L/home/buildbot/slave/monero-linux-armv7/build/build/release/CMakeFiles/CMakeTmp/string.h -rdynamic -lc -Wl,-rpath,/home/buildbot/slave/monero-linux-armv7/build/build/release/CMakeFiles/CMakeTmp/string.h 
CMakeFiles/cmTC_d59ef.dir/CheckFunctionExists.c.o: In function `main':
CheckFunctionExists.c:(.text+0xa): undefined reference to `memset_s'
collect2: error: ld returned 1 exit status
CMakeFiles/cmTC_d59ef.dir/build.make:97: recipe for target 'cmTC_d59ef' failed
make[2]: *** [cmTC_d59ef] Error 1
make[2]: Leaving directory '/home/buildbot/slave/monero-linux-armv7/build/build/release/CMakeFiles/CMakeTmp'
Makefile:126: recipe for target 'cmTC_d59ef/fast' failed
make[1]: *** [cmTC_d59ef/fast] Error 2
make[1]: Leaving directory '/home/buildbot/slave/monero-linux-armv7/build/build/release/CMakeFiles/CMakeTmp'


Determining if the function explicit_bzero exists in the c failed with the following output:
Change Dir: /home/buildbot/slave/monero-linux-armv7/build/build/release/CMakeFiles/CMakeTmp

Run Build Command:"/usr/bin/make" "cmTC_fde4e/fast"
make[1]: Entering directory '/home/buildbot/slave/monero-linux-armv7/build/build/release/CMakeFiles/CMakeTmp'
/usr/bin/make -f CMakeFiles/cmTC_fde4e.dir/build.make CMakeFiles/cmTC_fde4e.dir/build
make[2]: Entering directory '/home/buildbot/slave/monero-linux-armv7/build/build/release/CMakeFiles/CMakeTmp'
Building C object CMakeFiles/cmTC_fde4e.dir/CheckFunctionExists.c.o
/usr/lib/ccache/gcc    -pthread -DCHECK_FUNCTION_EXISTS=explicit_bzero   -o CMakeFiles/cmTC_fde4e.dir/CheckFunctionExists.c.o   -c /usr/share/cmake-3.5/Modules/CheckFunctionExists.c
Linking C executable cmTC_fde4e
/usr/bin/cmake -E cmake_link_script CMakeFiles/cmTC_fde4e.dir/link.txt --verbose=1
/usr/lib/ccache/gcc   -pthread -DCHECK_FUNCTION_EXISTS=explicit_bzero    CMakeFiles/cmTC_fde4e.dir/CheckFunctionExists.c.o  -o cmTC_fde4e  -L/home/buildbot/slave/monero-linux-armv7/build/build/release/CMakeFiles/CMakeTmp/strings.h -rdynamic -lc -Wl,-rpath,/home/buildbot/slave/monero-linux-armv7/build/build/release/CMakeFiles/CMakeTmp/strings.h 
CMakeFiles/cmTC_fde4e.dir/CheckFunctionExists.c.o: In function `main':
CheckFunctionExists.c:(.text+0xa): undefined reference to `explicit_bzero'
collect2: error: ld returned 1 exit status
CMakeFiles/cmTC_fde4e.dir/build.make:97: recipe for target 'cmTC_fde4e' failed
make[2]: *** [cmTC_fde4e] Error 1
make[2]: Leaving directory '/home/buildbot/slave/monero-linux-armv7/build/build/release/CMakeFiles/CMakeTmp'
Makefile:126: recipe for target 'cmTC_fde4e/fast' failed
make[1]: *** [cmTC_fde4e/fast] Error 2
make[1]: Leaving directory '/home/buildbot/slave/monero-linux-armv7/build/build/release/CMakeFiles/CMakeTmp'


Performing C SOURCE FILE Test _fcf_protection=full_c failed with the following output:
Change Dir: /home/buildbot/slave/monero-linux-armv7/build/build/release/CMakeFiles/CMakeTmp

Run Build Command:"/usr/bin/make" "cmTC_bb19c/fast"
make[1]: Entering directory '/home/buildbot/slave/monero-linux-armv7/build/build/release/CMakeFiles/CMakeTmp'
/usr/bin/make -f CMakeFiles/cmTC_bb19c.dir/build.make CMakeFiles/cmTC_bb19c.dir/build
make[2]: Entering directory '/home/buildbot/slave/monero-linux-armv7/build/build/release/CMakeFiles/CMakeTmp'
Building C object CMakeFiles/cmTC_bb19c.dir/src.c.o
/usr/lib/ccache/gcc    -pthread -march=native -fno-strict-aliasing -D_fcf_protection=full_c   -fcf-protection=full -o CMakeFiles/cmTC_bb19c.dir/src.c.o   -c /home/buildbot/slave/monero-linux-armv7/build/build/release/CMakeFiles/CMakeTmp/src.c
gcc: error: unrecognized command line option '-fcf-protection=full'
CMakeFiles/cmTC_bb19c.dir/build.make:65: recipe for target 'CMakeFiles/cmTC_bb19c.dir/src.c.o' failed
make[2]: *** [CMakeFiles/cmTC_bb19c.dir/src.c.o] Error 1
make[2]: Leaving directory '/home/buildbot/slave/monero-linux-armv7/build/build/release/CMakeFiles/CMakeTmp'
Makefile:126: recipe for target 'cmTC_bb19c/fast' failed
make[1]: *** [cmTC_bb19c/fast] Error 2
make[1]: Leaving directory '/home/buildbot/slave/monero-linux-armv7/build/build/release/CMakeFiles/CMakeTmp'

Source file was:
int main(void) { return 0; }
Performing C++ SOURCE FILE Test _fcf_protection=full_cxx failed with the following output:
Change Dir: /home/buildbot/slave/monero-linux-armv7/build/build/release/CMakeFiles/CMakeTmp

Run Build Command:"/usr/bin/make" "cmTC_62a1e/fast"
make[1]: Entering directory '/home/buildbot/slave/monero-linux-armv7/build/build/release/CMakeFiles/CMakeTmp'
/usr/bin/make -f CMakeFiles/cmTC_62a1e.dir/build.make CMakeFiles/cmTC_62a1e.dir/build
make[2]: Entering directory '/home/buildbot/slave/monero-linux-armv7/build/build/release/CMakeFiles/CMakeTmp'
Building CXX object CMakeFiles/cmTC_62a1e.dir/src.cxx.o
/usr/lib/ccache/g++     -pthread -march=native -fno-strict-aliasing -D_fcf_protection=full_cxx   -fcf-protection=full -o CMakeFiles/cmTC_62a1e.dir/src.cxx.o -c /home/buildbot/slave/monero-linux-armv7/build/build/release/CMakeFiles/CMakeTmp/src.cxx
g++: error: unrecognized command line option '-fcf-protection=full'
CMakeFiles/cmTC_62a1e.dir/build.make:65: recipe for target 'CMakeFiles/cmTC_62a1e.dir/src.cxx.o' failed
make[2]: *** [CMakeFiles/cmTC_62a1e.dir/src.cxx.o] Error 1
make[2]: Leaving directory '/home/buildbot/slave/monero-linux-armv7/build/build/release/CMakeFiles/CMakeTmp'
Makefile:126: recipe for target 'cmTC_62a1e/fast' failed
make[1]: *** [cmTC_62a1e/fast] Error 2
make[1]: Leaving directory '/home/buildbot/slave/monero-linux-armv7/build/build/release/CMakeFiles/CMakeTmp'

Source file was:
int main() { return 0; }
Performing C SOURCE FILE Test _fstack_clash_protection_c failed with the following output:
Change Dir: /home/buildbot/slave/monero-linux-armv7/build/build/release/CMakeFiles/CMakeTmp

Run Build Command:"/usr/bin/make" "cmTC_7ebf2/fast"
make[1]: Entering directory '/home/buildbot/slave/monero-linux-armv7/build/build/release/CMakeFiles/CMakeTmp'
/usr/bin/make -f CMakeFiles/cmTC_7ebf2.dir/build.make CMakeFiles/cmTC_7ebf2.dir/build
make[2]: Entering directory '/home/buildbot/slave/monero-linux-armv7/build/build/release/CMakeFiles/CMakeTmp'
Building C object CMakeFiles/cmTC_7ebf2.dir/src.c.o
/usr/lib/ccache/gcc    -pthread -march=native -fno-strict-aliasing -D_fstack_clash_protection_c   -fstack-clash-protection -o CMakeFiles/cmTC_7ebf2.dir/src.c.o   -c /home/buildbot/slave/monero-linux-armv7/build/build/release/CMakeFiles/CMakeTmp/src.c
gcc: error: unrecognized command line option '-fstack-clash-protection'
CMakeFiles/cmTC_7ebf2.dir/build.make:65: recipe for target 'CMakeFiles/cmTC_7ebf2.dir/src.c.o' failed
make[2]: *** [CMakeFiles/cmTC_7ebf2.dir/src.c.o] Error 1
make[2]: Leaving directory '/home/buildbot/slave/monero-linux-armv7/build/build/release/CMakeFiles/CMakeTmp'
Makefile:126: recipe for target 'cmTC_7ebf2/fast' failed
make[1]: *** [cmTC_7ebf2/fast] Error 2
make[1]: Leaving directory '/home/buildbot/slave/monero-linux-armv7/build/build/release/CMakeFiles/CMakeTmp'

Source file was:
int main(void) { return 0; }
Performing C++ SOURCE FILE Test _fstack_clash_protection_cxx failed with the following output:
Change Dir: /home/buildbot/slave/monero-linux-armv7/build/build/release/CMakeFiles/CMakeTmp

Run Build Command:"/usr/bin/make" "cmTC_7f320/fast"
make[1]: Entering directory '/home/buildbot/slave/monero-linux-armv7/build/build/release/CMakeFiles/CMakeTmp'
/usr/bin/make -f CMakeFiles/cmTC_7f320.dir/build.make CMakeFiles/cmTC_7f320.dir/build
make[2]: Entering directory '/home/buildbot/slave/monero-linux-armv7/build/build/release/CMakeFiles/CMakeTmp'
Building CXX object CMakeFiles/cmTC_7f320.dir/src.cxx.o
/usr/lib/ccache/g++     -pthread -march=native -fno-strict-aliasing -D_fstack_clash_protection_cxx   -fstack-clash-protection -o CMakeFiles/cmTC_7f320.dir/src.cxx.o -c /home/buildbot/slave/monero-linux-armv7/build/build/release/CMakeFiles/CMakeTmp/src.cxx
g++: error: unrecognized command line option '-fstack-clash-protection'
CMakeFiles/cmTC_7f320.dir/build.make:65: recipe for target 'CMakeFiles/cmTC_7f320.dir/src.cxx.o' failed
make[2]: *** [CMakeFiles/cmTC_7f320.dir/src.cxx.o] Error 1
make[2]: Leaving directory '/home/buildbot/slave/monero-linux-armv7/build/build/release/CMakeFiles/CMakeTmp'
Makefile:126: recipe for target 'cmTC_7f320/fast' failed
make[1]: *** [cmTC_7f320/fast] Error 2
make[1]: Leaving directory '/home/buildbot/slave/monero-linux-armv7/build/build/release/CMakeFiles/CMakeTmp'

Source file was:
int main() { return 0; }
Performing C SOURCE FILE Test _mmitigate_rop_c failed with the following output:
Change Dir: /home/buildbot/slave/monero-linux-armv7/build/build/release/CMakeFiles/CMakeTmp

Run Build Command:"/usr/bin/make" "cmTC_35cd2/fast"
make[1]: Entering directory '/home/buildbot/slave/monero-linux-armv7/build/build/release/CMakeFiles/CMakeTmp'
/usr/bin/make -f CMakeFiles/cmTC_35cd2.dir/build.make CMakeFiles/cmTC_35cd2.dir/build
make[2]: Entering directory '/home/buildbot/slave/monero-linux-armv7/build/build/release/CMakeFiles/CMakeTmp'
Building C object CMakeFiles/cmTC_35cd2.dir/src.c.o
/usr/lib/ccache/gcc    -pthread -march=native -fno-strict-aliasing -D_mmitigate_rop_c   -mmitigate-rop -o CMakeFiles/cmTC_35cd2.dir/src.c.o   -c /home/buildbot/slave/monero-linux-armv7/build/build/release/CMakeFiles/CMakeTmp/src.c
gcc: error: unrecognized command line option '-mmitigate-rop'
CMakeFiles/cmTC_35cd2.dir/build.make:65: recipe for target 'CMakeFiles/cmTC_35cd2.dir/src.c.o' failed
make[2]: *** [CMakeFiles/cmTC_35cd2.dir/src.c.o] Error 1
make[2]: Leaving directory '/home/buildbot/slave/monero-linux-armv7/build/build/release/CMakeFiles/CMakeTmp'
Makefile:126: recipe for target 'cmTC_35cd2/fast' failed
make[1]: *** [cmTC_35cd2/fast] Error 2
make[1]: Leaving directory '/home/buildbot/slave/monero-linux-armv7/build/build/release/CMakeFiles/CMakeTmp'

Source file was:
int main(void) { return 0; }
Performing C++ SOURCE FILE Test _mmitigate_rop_cxx failed with the following output:
Change Dir: /home/buildbot/slave/monero-linux-armv7/build/build/release/CMakeFiles/CMakeTmp

Run Build Command:"/usr/bin/make" "cmTC_52fc1/fast"
make[1]: Entering directory '/home/buildbot/slave/monero-linux-armv7/build/build/release/CMakeFiles/CMakeTmp'
/usr/bin/make -f CMakeFiles/cmTC_52fc1.dir/build.make CMakeFiles/cmTC_52fc1.dir/build
make[2]: Entering directory '/home/buildbot/slave/monero-linux-armv7/build/build/release/CMakeFiles/CMakeTmp'
Building CXX object CMakeFiles/cmTC_52fc1.dir/src.cxx.o
/usr/lib/ccache/g++     -pthread -march=native -fno-strict-aliasing -D_mmitigate_rop_cxx   -mmitigate-rop -o CMakeFiles/cmTC_52fc1.dir/src.cxx.o -c /home/buildbot/slave/monero-linux-armv7/build/build/release/CMakeFiles/CMakeTmp/src.cxx
g++: error: unrecognized command line option '-mmitigate-rop'
CMakeFiles/cmTC_52fc1.dir/build.make:65: recipe for target 'CMakeFiles/cmTC_52fc1.dir/src.cxx.o' failed
make[2]: *** [CMakeFiles/cmTC_52fc1.dir/src.cxx.o] Error 1
make[2]: Leaving directory '/home/buildbot/slave/monero-linux-armv7/build/build/release/CMakeFiles/CMakeTmp'
Makefile:126: recipe for target 'cmTC_52fc1/fast' failed
make[1]: *** [cmTC_52fc1/fast] Error 2
make[1]: Leaving directory '/home/buildbot/slave/monero-linux-armv7/build/build/release/CMakeFiles/CMakeTmp'

Source file was:
int main() { return 0; }
Determining if the -Wl,-z,noexecheap linker flag is supported failed with the following output:
Change Dir: /home/buildbot/slave/monero-linux-armv7/build/build/release/CMakeFiles/CMakeTmp

Run Build Command:"/usr/bin/make" "cmTC_a4ec6/fast"
make[1]: Entering directory '/home/buildbot/slave/monero-linux-armv7/build/build/release/CMakeFiles/CMakeTmp'
/usr/bin/make -f CMakeFiles/cmTC_a4ec6.dir/build.make CMakeFiles/cmTC_a4ec6.dir/build
make[2]: Entering directory '/home/buildbot/slave/monero-linux-armv7/build/build/release/CMakeFiles/CMakeTmp'
Building C object CMakeFiles/cmTC_a4ec6.dir/CheckLinkerFlag.c.o
/usr/lib/ccache/gcc    -Wl,-z,noexecheap    -Wl,-z,noexecheap -o CMakeFiles/cmTC_a4ec6.dir/CheckLinkerFlag.c.o   -c /home/buildbot/slave/monero-linux-armv7/build/cmake/CheckLinkerFlag.c
Linking C executable cmTC_a4ec6
/usr/bin/cmake -E cmake_link_script CMakeFiles/cmTC_a4ec6.dir/link.txt --verbose=1
/usr/lib/ccache/gcc  -Wl,-z,noexecheap     CMakeFiles/cmTC_a4ec6.dir/CheckLinkerFlag.c.o  -o cmTC_a4ec6 -rdynamic 
/usr/bin/ld: warning: -z noexecheap ignored.
make[2]: Leaving directory '/home/buildbot/slave/monero-linux-armv7/build/build/release/CMakeFiles/CMakeTmp'
make[1]: Leaving directory '/home/buildbot/slave/monero-linux-armv7/build/build/release/CMakeFiles/CMakeTmp'


Determining if the CXX compiler accepts the flag -mfpu=vfp3-d16 failed with the following output:
Change Dir: /home/buildbot/slave/monero-linux-armv7/build/build/release/CMakeFiles/CMakeTmp

Run Build Command:"/usr/bin/make" "cmTC_54565/fast"
make[1]: Entering directory '/home/buildbot/slave/monero-linux-armv7/build/build/release/CMakeFiles/CMakeTmp'
/usr/bin/make -f CMakeFiles/cmTC_54565.dir/build.make CMakeFiles/cmTC_54565.dir/build
make[2]: Entering directory '/home/buildbot/slave/monero-linux-armv7/build/build/release/CMakeFiles/CMakeTmp'
Building CXX object CMakeFiles/cmTC_54565.dir/DummyCXXFile.cxx.o
/usr/lib/ccache/g++     -pthread -march=native -fno-strict-aliasing -std=c++11 -D_GNU_SOURCE   -Wall -Wextra -Wpointer-arith -Wundef -Wvla -Wwrite-strings -Wno-error=extra -Wno-error=deprecated-declarations -Wno-unused-parameter -Wno-unused-variable -Wno-error=unused-variable -Wno-error=undef -Wno-error=uninitialized -Wlogical-op -Wno-error=maybe-uninitialized -Wno-error=cpp -Wno-reorder -Wno-missing-field-initializers  -fPIC  -Wformat -Wformat-security -fstack-protector -fstack-protector-strong -fno-strict-aliasing -mfpu=vfp3-d16   -o CMakeFiles/cmTC_54565.dir/DummyCXXFile.cxx.o -c /usr/share/cmake-3.5/Modules/DummyCXXFile.cxx
g++: error: unrecognized argument in option ‘-mfpu=vfp3-d16’
g++: note: valid arguments to ‘-mfpu=’ are: crypto-neon-fp-armv8 fp-armv8 fpv4-sp-d16 fpv5-d16 fpv5-sp-d16 neon neon-fp-armv8 neon-fp16 neon-vfpv4 vfp vfp3 vfpv3 vfpv3-d16 vfpv3-d16-fp16 vfpv3-fp16 vfpv3xd vfpv3xd-fp16 vfpv4 vfpv4-d16
CMakeFiles/cmTC_54565.dir/build.make:65: recipe for target 'CMakeFiles/cmTC_54565.dir/DummyCXXFile.cxx.o' failed
make[2]: *** [CMakeFiles/cmTC_54565.dir/DummyCXXFile.cxx.o] Error 1
make[2]: Leaving directory '/home/buildbot/slave/monero-linux-armv7/build/build/release/CMakeFiles/CMakeTmp'
Makefile:126: recipe for target 'cmTC_54565/fast' failed
make[1]: *** [cmTC_54565/fast] Error 2
make[1]: Leaving directory '/home/buildbot/slave/monero-linux-armv7/build/build/release/CMakeFiles/CMakeTmp'


Determining if the CXX compiler accepts the flag -mfpu=vfp4 failed with the following output:
Change Dir: /home/buildbot/slave/monero-linux-armv7/build/build/release/CMakeFiles/CMakeTmp

Run Build Command:"/usr/bin/make" "cmTC_2a692/fast"
make[1]: Entering directory '/home/buildbot/slave/monero-linux-armv7/build/build/release/CMakeFiles/CMakeTmp'
/usr/bin/make -f CMakeFiles/cmTC_2a692.dir/build.make CMakeFiles/cmTC_2a692.dir/build
make[2]: Entering directory '/home/buildbot/slave/monero-linux-armv7/build/build/release/CMakeFiles/CMakeTmp'
Building CXX object CMakeFiles/cmTC_2a692.dir/DummyCXXFile.cxx.o
/usr/lib/ccache/g++     -pthread -march=native -fno-strict-aliasing -std=c++11 -D_GNU_SOURCE   -Wall -Wextra -Wpointer-arith -Wundef -Wvla -Wwrite-strings -Wno-error=extra -Wno-error=deprecated-declarations -Wno-unused-parameter -Wno-unused-variable -Wno-error=unused-variable -Wno-error=undef -Wno-error=uninitialized -Wlogical-op -Wno-error=maybe-uninitialized -Wno-error=cpp -Wno-reorder -Wno-missing-field-initializers  -fPIC  -Wformat -Wformat-security -fstack-protector -fstack-protector-strong -fno-strict-aliasing -mfpu=vfp4   -o CMakeFiles/cmTC_2a692.dir/DummyCXXFile.cxx.o -c /usr/share/cmake-3.5/Modules/DummyCXXFile.cxx
g++: error: unrecognized argument in option ‘-mfpu=vfp4’
g++: note: valid arguments to ‘-mfpu=’ are: crypto-neon-fp-armv8 fp-armv8 fpv4-sp-d16 fpv5-d16 fpv5-sp-d16 neon neon-fp-armv8 neon-fp16 neon-vfpv4 vfp vfp3 vfpv3 vfpv3-d16 vfpv3-d16-fp16 vfpv3-fp16 vfpv3xd vfpv3xd-fp16 vfpv4 vfpv4-d16
CMakeFiles/cmTC_2a692.dir/build.make:65: recipe for target 'CMakeFiles/cmTC_2a692.dir/DummyCXXFile.cxx.o' failed
make[2]: *** [CMakeFiles/cmTC_2a692.dir/DummyCXXFile.cxx.o] Error 1
make[2]: Leaving directory '/home/buildbot/slave/monero-linux-armv7/build/build/release/CMakeFiles/CMakeTmp'
Makefile:126: recipe for target 'cmTC_2a692/fast' failed
make[1]: *** [cmTC_2a692/fast] Error 2
make[1]: Leaving directory '/home/buildbot/slave/monero-linux-armv7/build/build/release/CMakeFiles/CMakeTmp'


Determining if the CXX compiler accepts the flag -mfloat-abi=softfp failed with the following output:
Change Dir: /home/buildbot/slave/monero-linux-armv7/build/build/release/CMakeFiles/CMakeTmp

Run Build Command:"/usr/bin/make" "cmTC_603f6/fast"
make[1]: Entering directory '/home/buildbot/slave/monero-linux-armv7/build/build/release/CMakeFiles/CMakeTmp'
/usr/bin/make -f CMakeFiles/cmTC_603f6.dir/build.make CMakeFiles/cmTC_603f6.dir/build
make[2]: Entering directory '/home/buildbot/slave/monero-linux-armv7/build/build/release/CMakeFiles/CMakeTmp'
Building CXX object CMakeFiles/cmTC_603f6.dir/DummyCXXFile.cxx.o
/usr/lib/ccache/g++     -pthread -march=native -fno-strict-aliasing -std=c++11 -D_GNU_SOURCE   -Wall -Wextra -Wpointer-arith -Wundef -Wvla -Wwrite-strings -Wno-error=extra -Wno-error=deprecated-declarations -Wno-unused-parameter -Wno-unused-variable -Wno-error=unused-variable -Wno-error=undef -Wno-error=uninitialized -Wlogical-op -Wno-error=maybe-uninitialized -Wno-error=cpp -Wno-reorder -Wno-missing-field-initializers  -fPIC  -Wformat -Wformat-security -fstack-protector -fstack-protector-strong -fno-strict-aliasing -mfloat-abi=softfp   -o CMakeFiles/cmTC_603f6.dir/DummyCXXFile.cxx.o -c /usr/share/cmake-3.5/Modules/DummyCXXFile.cxx
Linking CXX executable cmTC_603f6
/usr/bin/cmake -E cmake_link_script CMakeFiles/cmTC_603f6.dir/link.txt --verbose=1
/usr/lib/ccache/g++    -pthread -march=native -fno-strict-aliasing -std=c++11 -D_GNU_SOURCE   -Wall -Wextra -Wpointer-arith -Wundef -Wvla -Wwrite-strings -Wno-error=extra -Wno-error=deprecated-declarations -Wno-unused-parameter -Wno-unused-variable -Wno-error=unused-variable -Wno-error=undef -Wno-error=uninitialized -Wlogical-op -Wno-error=maybe-uninitialized -Wno-error=cpp -Wno-reorder -Wno-missing-field-initializers  -fPIC  -Wformat -Wformat-security -fstack-protector -fstack-protector-strong -fno-strict-aliasing -mfloat-abi=softfp    CMakeFiles/cmTC_603f6.dir/DummyCXXFile.cxx.o  -o cmTC_603f6 -rdynamic 
/usr/bin/ld: cannot find crt1.o: No such file or directory
/usr/bin/ld: cannot find crti.o: No such file or directory
collect2: error: ld returned 1 exit status
CMakeFiles/cmTC_603f6.dir/build.make:97: recipe for target 'cmTC_603f6' failed
make[2]: *** [cmTC_603f6] Error 1
make[2]: Leaving directory '/home/buildbot/slave/monero-linux-armv7/build/build/release/CMakeFiles/CMakeTmp'
Makefile:126: recipe for target 'cmTC_603f6/fast' failed
make[1]: *** [cmTC_603f6/fast] Error 2
make[1]: Leaving directory '/home/buildbot/slave/monero-linux-armv7/build/build/release/CMakeFiles/CMakeTmp'