(view as text)
Determining if the pthread_create exist failed with the following output:
Change Dir: /home/buildbot/slave/monero-linux-armv7/build/build/release/CMakeFiles/CMakeTmp

Run Build Command:"/usr/bin/make" "cmTC_cdbd4/fast"
make[1]: Entering directory '/home/buildbot/slave/monero-linux-armv7/build/build/release/CMakeFiles/CMakeTmp'
/usr/bin/make -f CMakeFiles/cmTC_cdbd4.dir/build.make CMakeFiles/cmTC_cdbd4.dir/build
make[2]: Entering directory '/home/buildbot/slave/monero-linux-armv7/build/build/release/CMakeFiles/CMakeTmp'
Building C object CMakeFiles/cmTC_cdbd4.dir/CheckSymbolExists.c.o
/usr/lib/ccache/gcc     -o CMakeFiles/cmTC_cdbd4.dir/CheckSymbolExists.c.o   -c /home/buildbot/slave/monero-linux-armv7/build/build/release/CMakeFiles/CMakeTmp/CheckSymbolExists.c
Linking C executable cmTC_cdbd4
/usr/bin/cmake -E cmake_link_script CMakeFiles/cmTC_cdbd4.dir/link.txt --verbose=1
/usr/lib/ccache/gcc       CMakeFiles/cmTC_cdbd4.dir/CheckSymbolExists.c.o  -o cmTC_cdbd4 -rdynamic 
CMakeFiles/cmTC_cdbd4.dir/CheckSymbolExists.c.o: In function `main':
CheckSymbolExists.c:(.text+0xe): undefined reference to `pthread_create'
CheckSymbolExists.c:(.text+0x12): undefined reference to `pthread_create'
collect2: error: ld returned 1 exit status
CMakeFiles/cmTC_cdbd4.dir/build.make:97: recipe for target 'cmTC_cdbd4' failed
make[2]: *** [cmTC_cdbd4] Error 1
make[2]: Leaving directory '/home/buildbot/slave/monero-linux-armv7/build/build/release/CMakeFiles/CMakeTmp'
Makefile:126: recipe for target 'cmTC_cdbd4/fast' failed
make[1]: *** [cmTC_cdbd4/fast] Error 2
make[1]: Leaving directory '/home/buildbot/slave/monero-linux-armv7/build/build/release/CMakeFiles/CMakeTmp'

File /home/buildbot/slave/monero-linux-armv7/build/build/release/CMakeFiles/CMakeTmp/CheckSymbolExists.c:
/* */
#include <pthread.h>

int main(int argc, char** argv)
{
  (void)argv;
#ifndef pthread_create
  return ((int*)(&pthread_create))[argc];
#else
  (void)argc;
  return 0;
#endif
}

Determining if the function memset_s exists in the c failed with the following output:
Change Dir: /home/buildbot/slave/monero-linux-armv7/build/build/release/CMakeFiles/CMakeTmp

Run Build Command:"/usr/bin/make" "cmTC_3052a/fast"
make[1]: Entering directory '/home/buildbot/slave/monero-linux-armv7/build/build/release/CMakeFiles/CMakeTmp'
/usr/bin/make -f CMakeFiles/cmTC_3052a.dir/build.make CMakeFiles/cmTC_3052a.dir/build
make[2]: Entering directory '/home/buildbot/slave/monero-linux-armv7/build/build/release/CMakeFiles/CMakeTmp'
Building C object CMakeFiles/cmTC_3052a.dir/CheckFunctionExists.c.o
/usr/lib/ccache/gcc    -pthread -DCHECK_FUNCTION_EXISTS=memset_s   -o CMakeFiles/cmTC_3052a.dir/CheckFunctionExists.c.o   -c /usr/share/cmake-3.5/Modules/CheckFunctionExists.c
Linking C executable cmTC_3052a
/usr/bin/cmake -E cmake_link_script CMakeFiles/cmTC_3052a.dir/link.txt --verbose=1
/usr/lib/ccache/gcc   -pthread -DCHECK_FUNCTION_EXISTS=memset_s    CMakeFiles/cmTC_3052a.dir/CheckFunctionExists.c.o  -o cmTC_3052a  -L/home/buildbot/slave/monero-linux-armv7/build/build/release/CMakeFiles/CMakeTmp/string.h -rdynamic -lc -Wl,-rpath,/home/buildbot/slave/monero-linux-armv7/build/build/release/CMakeFiles/CMakeTmp/string.h 
CMakeFiles/cmTC_3052a.dir/CheckFunctionExists.c.o: In function `main':
CheckFunctionExists.c:(.text+0xa): undefined reference to `memset_s'
collect2: error: ld returned 1 exit status
CMakeFiles/cmTC_3052a.dir/build.make:97: recipe for target 'cmTC_3052a' failed
make[2]: *** [cmTC_3052a] Error 1
make[2]: Leaving directory '/home/buildbot/slave/monero-linux-armv7/build/build/release/CMakeFiles/CMakeTmp'
Makefile:126: recipe for target 'cmTC_3052a/fast' failed
make[1]: *** [cmTC_3052a/fast] Error 2
make[1]: Leaving directory '/home/buildbot/slave/monero-linux-armv7/build/build/release/CMakeFiles/CMakeTmp'


Determining if the function explicit_bzero exists in the c failed with the following output:
Change Dir: /home/buildbot/slave/monero-linux-armv7/build/build/release/CMakeFiles/CMakeTmp

Run Build Command:"/usr/bin/make" "cmTC_46278/fast"
make[1]: Entering directory '/home/buildbot/slave/monero-linux-armv7/build/build/release/CMakeFiles/CMakeTmp'
/usr/bin/make -f CMakeFiles/cmTC_46278.dir/build.make CMakeFiles/cmTC_46278.dir/build
make[2]: Entering directory '/home/buildbot/slave/monero-linux-armv7/build/build/release/CMakeFiles/CMakeTmp'
Building C object CMakeFiles/cmTC_46278.dir/CheckFunctionExists.c.o
/usr/lib/ccache/gcc    -pthread -DCHECK_FUNCTION_EXISTS=explicit_bzero   -o CMakeFiles/cmTC_46278.dir/CheckFunctionExists.c.o   -c /usr/share/cmake-3.5/Modules/CheckFunctionExists.c
Linking C executable cmTC_46278
/usr/bin/cmake -E cmake_link_script CMakeFiles/cmTC_46278.dir/link.txt --verbose=1
/usr/lib/ccache/gcc   -pthread -DCHECK_FUNCTION_EXISTS=explicit_bzero    CMakeFiles/cmTC_46278.dir/CheckFunctionExists.c.o  -o cmTC_46278  -L/home/buildbot/slave/monero-linux-armv7/build/build/release/CMakeFiles/CMakeTmp/strings.h -rdynamic -lc -Wl,-rpath,/home/buildbot/slave/monero-linux-armv7/build/build/release/CMakeFiles/CMakeTmp/strings.h 
CMakeFiles/cmTC_46278.dir/CheckFunctionExists.c.o: In function `main':
CheckFunctionExists.c:(.text+0xa): undefined reference to `explicit_bzero'
collect2: error: ld returned 1 exit status
CMakeFiles/cmTC_46278.dir/build.make:97: recipe for target 'cmTC_46278' failed
make[2]: *** [cmTC_46278] Error 1
make[2]: Leaving directory '/home/buildbot/slave/monero-linux-armv7/build/build/release/CMakeFiles/CMakeTmp'
Makefile:126: recipe for target 'cmTC_46278/fast' failed
make[1]: *** [cmTC_46278/fast] Error 2
make[1]: Leaving directory '/home/buildbot/slave/monero-linux-armv7/build/build/release/CMakeFiles/CMakeTmp'


Performing C SOURCE FILE Test _fcf_protection=full_c failed with the following output:
Change Dir: /home/buildbot/slave/monero-linux-armv7/build/build/release/CMakeFiles/CMakeTmp

Run Build Command:"/usr/bin/make" "cmTC_7b5f5/fast"
make[1]: Entering directory '/home/buildbot/slave/monero-linux-armv7/build/build/release/CMakeFiles/CMakeTmp'
/usr/bin/make -f CMakeFiles/cmTC_7b5f5.dir/build.make CMakeFiles/cmTC_7b5f5.dir/build
make[2]: Entering directory '/home/buildbot/slave/monero-linux-armv7/build/build/release/CMakeFiles/CMakeTmp'
Building C object CMakeFiles/cmTC_7b5f5.dir/src.c.o
/usr/lib/ccache/gcc    -pthread -march=native -fno-strict-aliasing -D_fcf_protection=full_c   -fcf-protection=full -o CMakeFiles/cmTC_7b5f5.dir/src.c.o   -c /home/buildbot/slave/monero-linux-armv7/build/build/release/CMakeFiles/CMakeTmp/src.c
gcc: error: unrecognized command line option '-fcf-protection=full'
CMakeFiles/cmTC_7b5f5.dir/build.make:65: recipe for target 'CMakeFiles/cmTC_7b5f5.dir/src.c.o' failed
make[2]: *** [CMakeFiles/cmTC_7b5f5.dir/src.c.o] Error 1
make[2]: Leaving directory '/home/buildbot/slave/monero-linux-armv7/build/build/release/CMakeFiles/CMakeTmp'
Makefile:126: recipe for target 'cmTC_7b5f5/fast' failed
make[1]: *** [cmTC_7b5f5/fast] Error 2
make[1]: Leaving directory '/home/buildbot/slave/monero-linux-armv7/build/build/release/CMakeFiles/CMakeTmp'

Source file was:
int main(void) { return 0; }
Performing C++ SOURCE FILE Test _fcf_protection=full_cxx failed with the following output:
Change Dir: /home/buildbot/slave/monero-linux-armv7/build/build/release/CMakeFiles/CMakeTmp

Run Build Command:"/usr/bin/make" "cmTC_d6b05/fast"
make[1]: Entering directory '/home/buildbot/slave/monero-linux-armv7/build/build/release/CMakeFiles/CMakeTmp'
/usr/bin/make -f CMakeFiles/cmTC_d6b05.dir/build.make CMakeFiles/cmTC_d6b05.dir/build
make[2]: Entering directory '/home/buildbot/slave/monero-linux-armv7/build/build/release/CMakeFiles/CMakeTmp'
Building CXX object CMakeFiles/cmTC_d6b05.dir/src.cxx.o
/usr/lib/ccache/g++     -pthread -march=native -fno-strict-aliasing -D_fcf_protection=full_cxx   -fcf-protection=full -o CMakeFiles/cmTC_d6b05.dir/src.cxx.o -c /home/buildbot/slave/monero-linux-armv7/build/build/release/CMakeFiles/CMakeTmp/src.cxx
g++: error: unrecognized command line option '-fcf-protection=full'
CMakeFiles/cmTC_d6b05.dir/build.make:65: recipe for target 'CMakeFiles/cmTC_d6b05.dir/src.cxx.o' failed
make[2]: *** [CMakeFiles/cmTC_d6b05.dir/src.cxx.o] Error 1
make[2]: Leaving directory '/home/buildbot/slave/monero-linux-armv7/build/build/release/CMakeFiles/CMakeTmp'
Makefile:126: recipe for target 'cmTC_d6b05/fast' failed
make[1]: *** [cmTC_d6b05/fast] Error 2
make[1]: Leaving directory '/home/buildbot/slave/monero-linux-armv7/build/build/release/CMakeFiles/CMakeTmp'

Source file was:
int main() { return 0; }
Performing C SOURCE FILE Test _fstack_clash_protection_c failed with the following output:
Change Dir: /home/buildbot/slave/monero-linux-armv7/build/build/release/CMakeFiles/CMakeTmp

Run Build Command:"/usr/bin/make" "cmTC_d8148/fast"
make[1]: Entering directory '/home/buildbot/slave/monero-linux-armv7/build/build/release/CMakeFiles/CMakeTmp'
/usr/bin/make -f CMakeFiles/cmTC_d8148.dir/build.make CMakeFiles/cmTC_d8148.dir/build
make[2]: Entering directory '/home/buildbot/slave/monero-linux-armv7/build/build/release/CMakeFiles/CMakeTmp'
Building C object CMakeFiles/cmTC_d8148.dir/src.c.o
/usr/lib/ccache/gcc    -pthread -march=native -fno-strict-aliasing -D_fstack_clash_protection_c   -fstack-clash-protection -o CMakeFiles/cmTC_d8148.dir/src.c.o   -c /home/buildbot/slave/monero-linux-armv7/build/build/release/CMakeFiles/CMakeTmp/src.c
gcc: error: unrecognized command line option '-fstack-clash-protection'
CMakeFiles/cmTC_d8148.dir/build.make:65: recipe for target 'CMakeFiles/cmTC_d8148.dir/src.c.o' failed
make[2]: *** [CMakeFiles/cmTC_d8148.dir/src.c.o] Error 1
make[2]: Leaving directory '/home/buildbot/slave/monero-linux-armv7/build/build/release/CMakeFiles/CMakeTmp'
Makefile:126: recipe for target 'cmTC_d8148/fast' failed
make[1]: *** [cmTC_d8148/fast] Error 2
make[1]: Leaving directory '/home/buildbot/slave/monero-linux-armv7/build/build/release/CMakeFiles/CMakeTmp'

Source file was:
int main(void) { return 0; }
Performing C++ SOURCE FILE Test _fstack_clash_protection_cxx failed with the following output:
Change Dir: /home/buildbot/slave/monero-linux-armv7/build/build/release/CMakeFiles/CMakeTmp

Run Build Command:"/usr/bin/make" "cmTC_75a44/fast"
make[1]: Entering directory '/home/buildbot/slave/monero-linux-armv7/build/build/release/CMakeFiles/CMakeTmp'
/usr/bin/make -f CMakeFiles/cmTC_75a44.dir/build.make CMakeFiles/cmTC_75a44.dir/build
make[2]: Entering directory '/home/buildbot/slave/monero-linux-armv7/build/build/release/CMakeFiles/CMakeTmp'
Building CXX object CMakeFiles/cmTC_75a44.dir/src.cxx.o
/usr/lib/ccache/g++     -pthread -march=native -fno-strict-aliasing -D_fstack_clash_protection_cxx   -fstack-clash-protection -o CMakeFiles/cmTC_75a44.dir/src.cxx.o -c /home/buildbot/slave/monero-linux-armv7/build/build/release/CMakeFiles/CMakeTmp/src.cxx
g++: error: unrecognized command line option '-fstack-clash-protection'
CMakeFiles/cmTC_75a44.dir/build.make:65: recipe for target 'CMakeFiles/cmTC_75a44.dir/src.cxx.o' failed
make[2]: *** [CMakeFiles/cmTC_75a44.dir/src.cxx.o] Error 1
make[2]: Leaving directory '/home/buildbot/slave/monero-linux-armv7/build/build/release/CMakeFiles/CMakeTmp'
Makefile:126: recipe for target 'cmTC_75a44/fast' failed
make[1]: *** [cmTC_75a44/fast] Error 2
make[1]: Leaving directory '/home/buildbot/slave/monero-linux-armv7/build/build/release/CMakeFiles/CMakeTmp'

Source file was:
int main() { return 0; }
Performing C SOURCE FILE Test _mmitigate_rop_c failed with the following output:
Change Dir: /home/buildbot/slave/monero-linux-armv7/build/build/release/CMakeFiles/CMakeTmp

Run Build Command:"/usr/bin/make" "cmTC_ac02b/fast"
make[1]: Entering directory '/home/buildbot/slave/monero-linux-armv7/build/build/release/CMakeFiles/CMakeTmp'
/usr/bin/make -f CMakeFiles/cmTC_ac02b.dir/build.make CMakeFiles/cmTC_ac02b.dir/build
make[2]: Entering directory '/home/buildbot/slave/monero-linux-armv7/build/build/release/CMakeFiles/CMakeTmp'
Building C object CMakeFiles/cmTC_ac02b.dir/src.c.o
/usr/lib/ccache/gcc    -pthread -march=native -fno-strict-aliasing -D_mmitigate_rop_c   -mmitigate-rop -o CMakeFiles/cmTC_ac02b.dir/src.c.o   -c /home/buildbot/slave/monero-linux-armv7/build/build/release/CMakeFiles/CMakeTmp/src.c
gcc: error: unrecognized command line option '-mmitigate-rop'
CMakeFiles/cmTC_ac02b.dir/build.make:65: recipe for target 'CMakeFiles/cmTC_ac02b.dir/src.c.o' failed
make[2]: *** [CMakeFiles/cmTC_ac02b.dir/src.c.o] Error 1
make[2]: Leaving directory '/home/buildbot/slave/monero-linux-armv7/build/build/release/CMakeFiles/CMakeTmp'
Makefile:126: recipe for target 'cmTC_ac02b/fast' failed
make[1]: *** [cmTC_ac02b/fast] Error 2
make[1]: Leaving directory '/home/buildbot/slave/monero-linux-armv7/build/build/release/CMakeFiles/CMakeTmp'

Source file was:
int main(void) { return 0; }
Performing C++ SOURCE FILE Test _mmitigate_rop_cxx failed with the following output:
Change Dir: /home/buildbot/slave/monero-linux-armv7/build/build/release/CMakeFiles/CMakeTmp

Run Build Command:"/usr/bin/make" "cmTC_1e65c/fast"
make[1]: Entering directory '/home/buildbot/slave/monero-linux-armv7/build/build/release/CMakeFiles/CMakeTmp'
/usr/bin/make -f CMakeFiles/cmTC_1e65c.dir/build.make CMakeFiles/cmTC_1e65c.dir/build
make[2]: Entering directory '/home/buildbot/slave/monero-linux-armv7/build/build/release/CMakeFiles/CMakeTmp'
Building CXX object CMakeFiles/cmTC_1e65c.dir/src.cxx.o
/usr/lib/ccache/g++     -pthread -march=native -fno-strict-aliasing -D_mmitigate_rop_cxx   -mmitigate-rop -o CMakeFiles/cmTC_1e65c.dir/src.cxx.o -c /home/buildbot/slave/monero-linux-armv7/build/build/release/CMakeFiles/CMakeTmp/src.cxx
g++: error: unrecognized command line option '-mmitigate-rop'
CMakeFiles/cmTC_1e65c.dir/build.make:65: recipe for target 'CMakeFiles/cmTC_1e65c.dir/src.cxx.o' failed
make[2]: *** [CMakeFiles/cmTC_1e65c.dir/src.cxx.o] Error 1
make[2]: Leaving directory '/home/buildbot/slave/monero-linux-armv7/build/build/release/CMakeFiles/CMakeTmp'
Makefile:126: recipe for target 'cmTC_1e65c/fast' failed
make[1]: *** [cmTC_1e65c/fast] Error 2
make[1]: Leaving directory '/home/buildbot/slave/monero-linux-armv7/build/build/release/CMakeFiles/CMakeTmp'

Source file was:
int main() { return 0; }
Determining if the -Wl,-z,noexecheap linker flag is supported failed with the following output:
Change Dir: /home/buildbot/slave/monero-linux-armv7/build/build/release/CMakeFiles/CMakeTmp

Run Build Command:"/usr/bin/make" "cmTC_ed82d/fast"
make[1]: Entering directory '/home/buildbot/slave/monero-linux-armv7/build/build/release/CMakeFiles/CMakeTmp'
/usr/bin/make -f CMakeFiles/cmTC_ed82d.dir/build.make CMakeFiles/cmTC_ed82d.dir/build
make[2]: Entering directory '/home/buildbot/slave/monero-linux-armv7/build/build/release/CMakeFiles/CMakeTmp'
Building C object CMakeFiles/cmTC_ed82d.dir/CheckLinkerFlag.c.o
/usr/lib/ccache/gcc    -Wl,-z,noexecheap    -Wl,-z,noexecheap -o CMakeFiles/cmTC_ed82d.dir/CheckLinkerFlag.c.o   -c /home/buildbot/slave/monero-linux-armv7/build/cmake/CheckLinkerFlag.c
Linking C executable cmTC_ed82d
/usr/bin/cmake -E cmake_link_script CMakeFiles/cmTC_ed82d.dir/link.txt --verbose=1
/usr/lib/ccache/gcc  -Wl,-z,noexecheap     CMakeFiles/cmTC_ed82d.dir/CheckLinkerFlag.c.o  -o cmTC_ed82d -rdynamic 
/usr/bin/ld: warning: -z noexecheap ignored.
make[2]: Leaving directory '/home/buildbot/slave/monero-linux-armv7/build/build/release/CMakeFiles/CMakeTmp'
make[1]: Leaving directory '/home/buildbot/slave/monero-linux-armv7/build/build/release/CMakeFiles/CMakeTmp'


Determining if the CXX compiler accepts the flag -mfpu=vfp3-d16 failed with the following output:
Change Dir: /home/buildbot/slave/monero-linux-armv7/build/build/release/CMakeFiles/CMakeTmp

Run Build Command:"/usr/bin/make" "cmTC_1e095/fast"
make[1]: Entering directory '/home/buildbot/slave/monero-linux-armv7/build/build/release/CMakeFiles/CMakeTmp'
/usr/bin/make -f CMakeFiles/cmTC_1e095.dir/build.make CMakeFiles/cmTC_1e095.dir/build
make[2]: Entering directory '/home/buildbot/slave/monero-linux-armv7/build/build/release/CMakeFiles/CMakeTmp'
Building CXX object CMakeFiles/cmTC_1e095.dir/DummyCXXFile.cxx.o
/usr/lib/ccache/g++     -pthread -march=native -fno-strict-aliasing -std=c++11 -D_GNU_SOURCE   -Wall -Wextra -Wpointer-arith -Wundef -Wvla -Wwrite-strings -Wno-error=extra -Wno-error=deprecated-declarations -Wno-unused-parameter -Wno-unused-variable -Wno-error=unused-variable -Wno-error=undef -Wno-error=uninitialized -Wlogical-op -Wno-error=maybe-uninitialized -Wno-error=cpp -Wno-reorder -Wno-missing-field-initializers  -fPIC  -Wformat -Wformat-security -fstack-protector -fstack-protector-strong -fno-strict-aliasing -mfpu=vfp3-d16   -o CMakeFiles/cmTC_1e095.dir/DummyCXXFile.cxx.o -c /usr/share/cmake-3.5/Modules/DummyCXXFile.cxx
g++: error: unrecognized argument in option ‘-mfpu=vfp3-d16’
g++: note: valid arguments to ‘-mfpu=’ are: crypto-neon-fp-armv8 fp-armv8 fpv4-sp-d16 fpv5-d16 fpv5-sp-d16 neon neon-fp-armv8 neon-fp16 neon-vfpv4 vfp vfp3 vfpv3 vfpv3-d16 vfpv3-d16-fp16 vfpv3-fp16 vfpv3xd vfpv3xd-fp16 vfpv4 vfpv4-d16
CMakeFiles/cmTC_1e095.dir/build.make:65: recipe for target 'CMakeFiles/cmTC_1e095.dir/DummyCXXFile.cxx.o' failed
make[2]: *** [CMakeFiles/cmTC_1e095.dir/DummyCXXFile.cxx.o] Error 1
make[2]: Leaving directory '/home/buildbot/slave/monero-linux-armv7/build/build/release/CMakeFiles/CMakeTmp'
Makefile:126: recipe for target 'cmTC_1e095/fast' failed
make[1]: *** [cmTC_1e095/fast] Error 2
make[1]: Leaving directory '/home/buildbot/slave/monero-linux-armv7/build/build/release/CMakeFiles/CMakeTmp'


Determining if the CXX compiler accepts the flag -mfpu=vfp4 failed with the following output:
Change Dir: /home/buildbot/slave/monero-linux-armv7/build/build/release/CMakeFiles/CMakeTmp

Run Build Command:"/usr/bin/make" "cmTC_0312f/fast"
make[1]: Entering directory '/home/buildbot/slave/monero-linux-armv7/build/build/release/CMakeFiles/CMakeTmp'
/usr/bin/make -f CMakeFiles/cmTC_0312f.dir/build.make CMakeFiles/cmTC_0312f.dir/build
make[2]: Entering directory '/home/buildbot/slave/monero-linux-armv7/build/build/release/CMakeFiles/CMakeTmp'
Building CXX object CMakeFiles/cmTC_0312f.dir/DummyCXXFile.cxx.o
/usr/lib/ccache/g++     -pthread -march=native -fno-strict-aliasing -std=c++11 -D_GNU_SOURCE   -Wall -Wextra -Wpointer-arith -Wundef -Wvla -Wwrite-strings -Wno-error=extra -Wno-error=deprecated-declarations -Wno-unused-parameter -Wno-unused-variable -Wno-error=unused-variable -Wno-error=undef -Wno-error=uninitialized -Wlogical-op -Wno-error=maybe-uninitialized -Wno-error=cpp -Wno-reorder -Wno-missing-field-initializers  -fPIC  -Wformat -Wformat-security -fstack-protector -fstack-protector-strong -fno-strict-aliasing -mfpu=vfp4   -o CMakeFiles/cmTC_0312f.dir/DummyCXXFile.cxx.o -c /usr/share/cmake-3.5/Modules/DummyCXXFile.cxx
g++: error: unrecognized argument in option ‘-mfpu=vfp4’
g++: note: valid arguments to ‘-mfpu=’ are: crypto-neon-fp-armv8 fp-armv8 fpv4-sp-d16 fpv5-d16 fpv5-sp-d16 neon neon-fp-armv8 neon-fp16 neon-vfpv4 vfp vfp3 vfpv3 vfpv3-d16 vfpv3-d16-fp16 vfpv3-fp16 vfpv3xd vfpv3xd-fp16 vfpv4 vfpv4-d16
CMakeFiles/cmTC_0312f.dir/build.make:65: recipe for target 'CMakeFiles/cmTC_0312f.dir/DummyCXXFile.cxx.o' failed
make[2]: *** [CMakeFiles/cmTC_0312f.dir/DummyCXXFile.cxx.o] Error 1
make[2]: Leaving directory '/home/buildbot/slave/monero-linux-armv7/build/build/release/CMakeFiles/CMakeTmp'
Makefile:126: recipe for target 'cmTC_0312f/fast' failed
make[1]: *** [cmTC_0312f/fast] Error 2
make[1]: Leaving directory '/home/buildbot/slave/monero-linux-armv7/build/build/release/CMakeFiles/CMakeTmp'


Determining if the CXX compiler accepts the flag -mfloat-abi=softfp failed with the following output:
Change Dir: /home/buildbot/slave/monero-linux-armv7/build/build/release/CMakeFiles/CMakeTmp

Run Build Command:"/usr/bin/make" "cmTC_73752/fast"
make[1]: Entering directory '/home/buildbot/slave/monero-linux-armv7/build/build/release/CMakeFiles/CMakeTmp'
/usr/bin/make -f CMakeFiles/cmTC_73752.dir/build.make CMakeFiles/cmTC_73752.dir/build
make[2]: Entering directory '/home/buildbot/slave/monero-linux-armv7/build/build/release/CMakeFiles/CMakeTmp'
Building CXX object CMakeFiles/cmTC_73752.dir/DummyCXXFile.cxx.o
/usr/lib/ccache/g++     -pthread -march=native -fno-strict-aliasing -std=c++11 -D_GNU_SOURCE   -Wall -Wextra -Wpointer-arith -Wundef -Wvla -Wwrite-strings -Wno-error=extra -Wno-error=deprecated-declarations -Wno-unused-parameter -Wno-unused-variable -Wno-error=unused-variable -Wno-error=undef -Wno-error=uninitialized -Wlogical-op -Wno-error=maybe-uninitialized -Wno-error=cpp -Wno-reorder -Wno-missing-field-initializers  -fPIC  -Wformat -Wformat-security -fstack-protector -fstack-protector-strong -fno-strict-aliasing -mfloat-abi=softfp   -o CMakeFiles/cmTC_73752.dir/DummyCXXFile.cxx.o -c /usr/share/cmake-3.5/Modules/DummyCXXFile.cxx
Linking CXX executable cmTC_73752
/usr/bin/cmake -E cmake_link_script CMakeFiles/cmTC_73752.dir/link.txt --verbose=1
/usr/lib/ccache/g++    -pthread -march=native -fno-strict-aliasing -std=c++11 -D_GNU_SOURCE   -Wall -Wextra -Wpointer-arith -Wundef -Wvla -Wwrite-strings -Wno-error=extra -Wno-error=deprecated-declarations -Wno-unused-parameter -Wno-unused-variable -Wno-error=unused-variable -Wno-error=undef -Wno-error=uninitialized -Wlogical-op -Wno-error=maybe-uninitialized -Wno-error=cpp -Wno-reorder -Wno-missing-field-initializers  -fPIC  -Wformat -Wformat-security -fstack-protector -fstack-protector-strong -fno-strict-aliasing -mfloat-abi=softfp    CMakeFiles/cmTC_73752.dir/DummyCXXFile.cxx.o  -o cmTC_73752 -rdynamic 
/usr/bin/ld: cannot find crt1.o: No such file or directory
/usr/bin/ld: cannot find crti.o: No such file or directory
collect2: error: ld returned 1 exit status
CMakeFiles/cmTC_73752.dir/build.make:97: recipe for target 'cmTC_73752' failed
make[2]: *** [cmTC_73752] Error 1
make[2]: Leaving directory '/home/buildbot/slave/monero-linux-armv7/build/build/release/CMakeFiles/CMakeTmp'
Makefile:126: recipe for target 'cmTC_73752/fast' failed
make[1]: *** [cmTC_73752/fast] Error 2
make[1]: Leaving directory '/home/buildbot/slave/monero-linux-armv7/build/build/release/CMakeFiles/CMakeTmp'