(view as text)
Determining if the pthread_create exist failed with the following output:
Change Dir: /home/buildbot/slave/monero-linux-armv7/build/build/release/CMakeFiles/CMakeTmp

Run Build Command:"/usr/bin/make" "cmTC_6bbb1/fast"
make[1]: Entering directory '/home/buildbot/slave/monero-linux-armv7/build/build/release/CMakeFiles/CMakeTmp'
/usr/bin/make -f CMakeFiles/cmTC_6bbb1.dir/build.make CMakeFiles/cmTC_6bbb1.dir/build
make[2]: Entering directory '/home/buildbot/slave/monero-linux-armv7/build/build/release/CMakeFiles/CMakeTmp'
Building C object CMakeFiles/cmTC_6bbb1.dir/CheckSymbolExists.c.o
/usr/lib/ccache/gcc     -o CMakeFiles/cmTC_6bbb1.dir/CheckSymbolExists.c.o   -c /home/buildbot/slave/monero-linux-armv7/build/build/release/CMakeFiles/CMakeTmp/CheckSymbolExists.c
Linking C executable cmTC_6bbb1
/usr/bin/cmake -E cmake_link_script CMakeFiles/cmTC_6bbb1.dir/link.txt --verbose=1
/usr/lib/ccache/gcc       CMakeFiles/cmTC_6bbb1.dir/CheckSymbolExists.c.o  -o cmTC_6bbb1 -rdynamic 
CMakeFiles/cmTC_6bbb1.dir/CheckSymbolExists.c.o: In function `main':
CheckSymbolExists.c:(.text+0xe): undefined reference to `pthread_create'
CheckSymbolExists.c:(.text+0x12): undefined reference to `pthread_create'
collect2: error: ld returned 1 exit status
CMakeFiles/cmTC_6bbb1.dir/build.make:97: recipe for target 'cmTC_6bbb1' failed
make[2]: *** [cmTC_6bbb1] Error 1
make[2]: Leaving directory '/home/buildbot/slave/monero-linux-armv7/build/build/release/CMakeFiles/CMakeTmp'
Makefile:126: recipe for target 'cmTC_6bbb1/fast' failed
make[1]: *** [cmTC_6bbb1/fast] Error 2
make[1]: Leaving directory '/home/buildbot/slave/monero-linux-armv7/build/build/release/CMakeFiles/CMakeTmp'

File /home/buildbot/slave/monero-linux-armv7/build/build/release/CMakeFiles/CMakeTmp/CheckSymbolExists.c:
/* */
#include <pthread.h>

int main(int argc, char** argv)
{
  (void)argv;
#ifndef pthread_create
  return ((int*)(&pthread_create))[argc];
#else
  (void)argc;
  return 0;
#endif
}

Determining if the function memset_s exists in the c failed with the following output:
Change Dir: /home/buildbot/slave/monero-linux-armv7/build/build/release/CMakeFiles/CMakeTmp

Run Build Command:"/usr/bin/make" "cmTC_2517d/fast"
make[1]: Entering directory '/home/buildbot/slave/monero-linux-armv7/build/build/release/CMakeFiles/CMakeTmp'
/usr/bin/make -f CMakeFiles/cmTC_2517d.dir/build.make CMakeFiles/cmTC_2517d.dir/build
make[2]: Entering directory '/home/buildbot/slave/monero-linux-armv7/build/build/release/CMakeFiles/CMakeTmp'
Building C object CMakeFiles/cmTC_2517d.dir/CheckFunctionExists.c.o
/usr/lib/ccache/gcc    -pthread -DCHECK_FUNCTION_EXISTS=memset_s   -o CMakeFiles/cmTC_2517d.dir/CheckFunctionExists.c.o   -c /usr/share/cmake-3.5/Modules/CheckFunctionExists.c
Linking C executable cmTC_2517d
/usr/bin/cmake -E cmake_link_script CMakeFiles/cmTC_2517d.dir/link.txt --verbose=1
/usr/lib/ccache/gcc   -pthread -DCHECK_FUNCTION_EXISTS=memset_s    CMakeFiles/cmTC_2517d.dir/CheckFunctionExists.c.o  -o cmTC_2517d  -L/home/buildbot/slave/monero-linux-armv7/build/build/release/CMakeFiles/CMakeTmp/string.h -rdynamic -lc -Wl,-rpath,/home/buildbot/slave/monero-linux-armv7/build/build/release/CMakeFiles/CMakeTmp/string.h 
CMakeFiles/cmTC_2517d.dir/CheckFunctionExists.c.o: In function `main':
CheckFunctionExists.c:(.text+0xa): undefined reference to `memset_s'
collect2: error: ld returned 1 exit status
CMakeFiles/cmTC_2517d.dir/build.make:97: recipe for target 'cmTC_2517d' failed
make[2]: *** [cmTC_2517d] Error 1
make[2]: Leaving directory '/home/buildbot/slave/monero-linux-armv7/build/build/release/CMakeFiles/CMakeTmp'
Makefile:126: recipe for target 'cmTC_2517d/fast' failed
make[1]: *** [cmTC_2517d/fast] Error 2
make[1]: Leaving directory '/home/buildbot/slave/monero-linux-armv7/build/build/release/CMakeFiles/CMakeTmp'


Determining if the function explicit_bzero exists in the c failed with the following output:
Change Dir: /home/buildbot/slave/monero-linux-armv7/build/build/release/CMakeFiles/CMakeTmp

Run Build Command:"/usr/bin/make" "cmTC_b1523/fast"
make[1]: Entering directory '/home/buildbot/slave/monero-linux-armv7/build/build/release/CMakeFiles/CMakeTmp'
/usr/bin/make -f CMakeFiles/cmTC_b1523.dir/build.make CMakeFiles/cmTC_b1523.dir/build
make[2]: Entering directory '/home/buildbot/slave/monero-linux-armv7/build/build/release/CMakeFiles/CMakeTmp'
Building C object CMakeFiles/cmTC_b1523.dir/CheckFunctionExists.c.o
/usr/lib/ccache/gcc    -pthread -DCHECK_FUNCTION_EXISTS=explicit_bzero   -o CMakeFiles/cmTC_b1523.dir/CheckFunctionExists.c.o   -c /usr/share/cmake-3.5/Modules/CheckFunctionExists.c
Linking C executable cmTC_b1523
/usr/bin/cmake -E cmake_link_script CMakeFiles/cmTC_b1523.dir/link.txt --verbose=1
/usr/lib/ccache/gcc   -pthread -DCHECK_FUNCTION_EXISTS=explicit_bzero    CMakeFiles/cmTC_b1523.dir/CheckFunctionExists.c.o  -o cmTC_b1523  -L/home/buildbot/slave/monero-linux-armv7/build/build/release/CMakeFiles/CMakeTmp/strings.h -rdynamic -lc -Wl,-rpath,/home/buildbot/slave/monero-linux-armv7/build/build/release/CMakeFiles/CMakeTmp/strings.h 
CMakeFiles/cmTC_b1523.dir/CheckFunctionExists.c.o: In function `main':
CheckFunctionExists.c:(.text+0xa): undefined reference to `explicit_bzero'
collect2: error: ld returned 1 exit status
CMakeFiles/cmTC_b1523.dir/build.make:97: recipe for target 'cmTC_b1523' failed
make[2]: *** [cmTC_b1523] Error 1
make[2]: Leaving directory '/home/buildbot/slave/monero-linux-armv7/build/build/release/CMakeFiles/CMakeTmp'
Makefile:126: recipe for target 'cmTC_b1523/fast' failed
make[1]: *** [cmTC_b1523/fast] Error 2
make[1]: Leaving directory '/home/buildbot/slave/monero-linux-armv7/build/build/release/CMakeFiles/CMakeTmp'


Performing C SOURCE FILE Test _fcf_protection=full_c failed with the following output:
Change Dir: /home/buildbot/slave/monero-linux-armv7/build/build/release/CMakeFiles/CMakeTmp

Run Build Command:"/usr/bin/make" "cmTC_2c6de/fast"
make[1]: Entering directory '/home/buildbot/slave/monero-linux-armv7/build/build/release/CMakeFiles/CMakeTmp'
/usr/bin/make -f CMakeFiles/cmTC_2c6de.dir/build.make CMakeFiles/cmTC_2c6de.dir/build
make[2]: Entering directory '/home/buildbot/slave/monero-linux-armv7/build/build/release/CMakeFiles/CMakeTmp'
Building C object CMakeFiles/cmTC_2c6de.dir/src.c.o
/usr/lib/ccache/gcc    -pthread -march=native -fno-strict-aliasing -D_fcf_protection=full_c   -fcf-protection=full -o CMakeFiles/cmTC_2c6de.dir/src.c.o   -c /home/buildbot/slave/monero-linux-armv7/build/build/release/CMakeFiles/CMakeTmp/src.c
gcc: error: unrecognized command line option '-fcf-protection=full'
CMakeFiles/cmTC_2c6de.dir/build.make:65: recipe for target 'CMakeFiles/cmTC_2c6de.dir/src.c.o' failed
make[2]: *** [CMakeFiles/cmTC_2c6de.dir/src.c.o] Error 1
make[2]: Leaving directory '/home/buildbot/slave/monero-linux-armv7/build/build/release/CMakeFiles/CMakeTmp'
Makefile:126: recipe for target 'cmTC_2c6de/fast' failed
make[1]: *** [cmTC_2c6de/fast] Error 2
make[1]: Leaving directory '/home/buildbot/slave/monero-linux-armv7/build/build/release/CMakeFiles/CMakeTmp'

Source file was:
int main(void) { return 0; }
Performing C++ SOURCE FILE Test _fcf_protection=full_cxx failed with the following output:
Change Dir: /home/buildbot/slave/monero-linux-armv7/build/build/release/CMakeFiles/CMakeTmp

Run Build Command:"/usr/bin/make" "cmTC_ae0f9/fast"
make[1]: Entering directory '/home/buildbot/slave/monero-linux-armv7/build/build/release/CMakeFiles/CMakeTmp'
/usr/bin/make -f CMakeFiles/cmTC_ae0f9.dir/build.make CMakeFiles/cmTC_ae0f9.dir/build
make[2]: Entering directory '/home/buildbot/slave/monero-linux-armv7/build/build/release/CMakeFiles/CMakeTmp'
Building CXX object CMakeFiles/cmTC_ae0f9.dir/src.cxx.o
/usr/lib/ccache/g++     -pthread -march=native -fno-strict-aliasing -D_fcf_protection=full_cxx   -fcf-protection=full -o CMakeFiles/cmTC_ae0f9.dir/src.cxx.o -c /home/buildbot/slave/monero-linux-armv7/build/build/release/CMakeFiles/CMakeTmp/src.cxx
g++: error: unrecognized command line option '-fcf-protection=full'
CMakeFiles/cmTC_ae0f9.dir/build.make:65: recipe for target 'CMakeFiles/cmTC_ae0f9.dir/src.cxx.o' failed
make[2]: *** [CMakeFiles/cmTC_ae0f9.dir/src.cxx.o] Error 1
make[2]: Leaving directory '/home/buildbot/slave/monero-linux-armv7/build/build/release/CMakeFiles/CMakeTmp'
Makefile:126: recipe for target 'cmTC_ae0f9/fast' failed
make[1]: *** [cmTC_ae0f9/fast] Error 2
make[1]: Leaving directory '/home/buildbot/slave/monero-linux-armv7/build/build/release/CMakeFiles/CMakeTmp'

Source file was:
int main() { return 0; }
Performing C SOURCE FILE Test _fstack_clash_protection_c failed with the following output:
Change Dir: /home/buildbot/slave/monero-linux-armv7/build/build/release/CMakeFiles/CMakeTmp

Run Build Command:"/usr/bin/make" "cmTC_fb9b2/fast"
make[1]: Entering directory '/home/buildbot/slave/monero-linux-armv7/build/build/release/CMakeFiles/CMakeTmp'
/usr/bin/make -f CMakeFiles/cmTC_fb9b2.dir/build.make CMakeFiles/cmTC_fb9b2.dir/build
make[2]: Entering directory '/home/buildbot/slave/monero-linux-armv7/build/build/release/CMakeFiles/CMakeTmp'
Building C object CMakeFiles/cmTC_fb9b2.dir/src.c.o
/usr/lib/ccache/gcc    -pthread -march=native -fno-strict-aliasing -D_fstack_clash_protection_c   -fstack-clash-protection -o CMakeFiles/cmTC_fb9b2.dir/src.c.o   -c /home/buildbot/slave/monero-linux-armv7/build/build/release/CMakeFiles/CMakeTmp/src.c
gcc: error: unrecognized command line option '-fstack-clash-protection'
CMakeFiles/cmTC_fb9b2.dir/build.make:65: recipe for target 'CMakeFiles/cmTC_fb9b2.dir/src.c.o' failed
make[2]: *** [CMakeFiles/cmTC_fb9b2.dir/src.c.o] Error 1
make[2]: Leaving directory '/home/buildbot/slave/monero-linux-armv7/build/build/release/CMakeFiles/CMakeTmp'
Makefile:126: recipe for target 'cmTC_fb9b2/fast' failed
make[1]: *** [cmTC_fb9b2/fast] Error 2
make[1]: Leaving directory '/home/buildbot/slave/monero-linux-armv7/build/build/release/CMakeFiles/CMakeTmp'

Source file was:
int main(void) { return 0; }
Performing C++ SOURCE FILE Test _fstack_clash_protection_cxx failed with the following output:
Change Dir: /home/buildbot/slave/monero-linux-armv7/build/build/release/CMakeFiles/CMakeTmp

Run Build Command:"/usr/bin/make" "cmTC_896ed/fast"
make[1]: Entering directory '/home/buildbot/slave/monero-linux-armv7/build/build/release/CMakeFiles/CMakeTmp'
/usr/bin/make -f CMakeFiles/cmTC_896ed.dir/build.make CMakeFiles/cmTC_896ed.dir/build
make[2]: Entering directory '/home/buildbot/slave/monero-linux-armv7/build/build/release/CMakeFiles/CMakeTmp'
Building CXX object CMakeFiles/cmTC_896ed.dir/src.cxx.o
/usr/lib/ccache/g++     -pthread -march=native -fno-strict-aliasing -D_fstack_clash_protection_cxx   -fstack-clash-protection -o CMakeFiles/cmTC_896ed.dir/src.cxx.o -c /home/buildbot/slave/monero-linux-armv7/build/build/release/CMakeFiles/CMakeTmp/src.cxx
g++: error: unrecognized command line option '-fstack-clash-protection'
CMakeFiles/cmTC_896ed.dir/build.make:65: recipe for target 'CMakeFiles/cmTC_896ed.dir/src.cxx.o' failed
make[2]: *** [CMakeFiles/cmTC_896ed.dir/src.cxx.o] Error 1
make[2]: Leaving directory '/home/buildbot/slave/monero-linux-armv7/build/build/release/CMakeFiles/CMakeTmp'
Makefile:126: recipe for target 'cmTC_896ed/fast' failed
make[1]: *** [cmTC_896ed/fast] Error 2
make[1]: Leaving directory '/home/buildbot/slave/monero-linux-armv7/build/build/release/CMakeFiles/CMakeTmp'

Source file was:
int main() { return 0; }
Performing C SOURCE FILE Test _mmitigate_rop_c failed with the following output:
Change Dir: /home/buildbot/slave/monero-linux-armv7/build/build/release/CMakeFiles/CMakeTmp

Run Build Command:"/usr/bin/make" "cmTC_53469/fast"
make[1]: Entering directory '/home/buildbot/slave/monero-linux-armv7/build/build/release/CMakeFiles/CMakeTmp'
/usr/bin/make -f CMakeFiles/cmTC_53469.dir/build.make CMakeFiles/cmTC_53469.dir/build
make[2]: Entering directory '/home/buildbot/slave/monero-linux-armv7/build/build/release/CMakeFiles/CMakeTmp'
Building C object CMakeFiles/cmTC_53469.dir/src.c.o
/usr/lib/ccache/gcc    -pthread -march=native -fno-strict-aliasing -D_mmitigate_rop_c   -mmitigate-rop -o CMakeFiles/cmTC_53469.dir/src.c.o   -c /home/buildbot/slave/monero-linux-armv7/build/build/release/CMakeFiles/CMakeTmp/src.c
gcc: error: unrecognized command line option '-mmitigate-rop'
CMakeFiles/cmTC_53469.dir/build.make:65: recipe for target 'CMakeFiles/cmTC_53469.dir/src.c.o' failed
make[2]: *** [CMakeFiles/cmTC_53469.dir/src.c.o] Error 1
make[2]: Leaving directory '/home/buildbot/slave/monero-linux-armv7/build/build/release/CMakeFiles/CMakeTmp'
Makefile:126: recipe for target 'cmTC_53469/fast' failed
make[1]: *** [cmTC_53469/fast] Error 2
make[1]: Leaving directory '/home/buildbot/slave/monero-linux-armv7/build/build/release/CMakeFiles/CMakeTmp'

Source file was:
int main(void) { return 0; }
Performing C++ SOURCE FILE Test _mmitigate_rop_cxx failed with the following output:
Change Dir: /home/buildbot/slave/monero-linux-armv7/build/build/release/CMakeFiles/CMakeTmp

Run Build Command:"/usr/bin/make" "cmTC_24587/fast"
make[1]: Entering directory '/home/buildbot/slave/monero-linux-armv7/build/build/release/CMakeFiles/CMakeTmp'
/usr/bin/make -f CMakeFiles/cmTC_24587.dir/build.make CMakeFiles/cmTC_24587.dir/build
make[2]: Entering directory '/home/buildbot/slave/monero-linux-armv7/build/build/release/CMakeFiles/CMakeTmp'
Building CXX object CMakeFiles/cmTC_24587.dir/src.cxx.o
/usr/lib/ccache/g++     -pthread -march=native -fno-strict-aliasing -D_mmitigate_rop_cxx   -mmitigate-rop -o CMakeFiles/cmTC_24587.dir/src.cxx.o -c /home/buildbot/slave/monero-linux-armv7/build/build/release/CMakeFiles/CMakeTmp/src.cxx
g++: error: unrecognized command line option '-mmitigate-rop'
CMakeFiles/cmTC_24587.dir/build.make:65: recipe for target 'CMakeFiles/cmTC_24587.dir/src.cxx.o' failed
make[2]: *** [CMakeFiles/cmTC_24587.dir/src.cxx.o] Error 1
make[2]: Leaving directory '/home/buildbot/slave/monero-linux-armv7/build/build/release/CMakeFiles/CMakeTmp'
Makefile:126: recipe for target 'cmTC_24587/fast' failed
make[1]: *** [cmTC_24587/fast] Error 2
make[1]: Leaving directory '/home/buildbot/slave/monero-linux-armv7/build/build/release/CMakeFiles/CMakeTmp'

Source file was:
int main() { return 0; }
Determining if the -Wl,-z,noexecheap linker flag is supported failed with the following output:
Change Dir: /home/buildbot/slave/monero-linux-armv7/build/build/release/CMakeFiles/CMakeTmp

Run Build Command:"/usr/bin/make" "cmTC_04cba/fast"
make[1]: Entering directory '/home/buildbot/slave/monero-linux-armv7/build/build/release/CMakeFiles/CMakeTmp'
/usr/bin/make -f CMakeFiles/cmTC_04cba.dir/build.make CMakeFiles/cmTC_04cba.dir/build
make[2]: Entering directory '/home/buildbot/slave/monero-linux-armv7/build/build/release/CMakeFiles/CMakeTmp'
Building C object CMakeFiles/cmTC_04cba.dir/CheckLinkerFlag.c.o
/usr/lib/ccache/gcc    -Wl,-z,noexecheap    -Wl,-z,noexecheap -o CMakeFiles/cmTC_04cba.dir/CheckLinkerFlag.c.o   -c /home/buildbot/slave/monero-linux-armv7/build/cmake/CheckLinkerFlag.c
Linking C executable cmTC_04cba
/usr/bin/cmake -E cmake_link_script CMakeFiles/cmTC_04cba.dir/link.txt --verbose=1
/usr/lib/ccache/gcc  -Wl,-z,noexecheap     CMakeFiles/cmTC_04cba.dir/CheckLinkerFlag.c.o  -o cmTC_04cba -rdynamic 
/usr/bin/ld: warning: -z noexecheap ignored.
make[2]: Leaving directory '/home/buildbot/slave/monero-linux-armv7/build/build/release/CMakeFiles/CMakeTmp'
make[1]: Leaving directory '/home/buildbot/slave/monero-linux-armv7/build/build/release/CMakeFiles/CMakeTmp'


Determining if the CXX compiler accepts the flag -mfpu=vfp3-d16 failed with the following output:
Change Dir: /home/buildbot/slave/monero-linux-armv7/build/build/release/CMakeFiles/CMakeTmp

Run Build Command:"/usr/bin/make" "cmTC_5090f/fast"
make[1]: Entering directory '/home/buildbot/slave/monero-linux-armv7/build/build/release/CMakeFiles/CMakeTmp'
/usr/bin/make -f CMakeFiles/cmTC_5090f.dir/build.make CMakeFiles/cmTC_5090f.dir/build
make[2]: Entering directory '/home/buildbot/slave/monero-linux-armv7/build/build/release/CMakeFiles/CMakeTmp'
Building CXX object CMakeFiles/cmTC_5090f.dir/DummyCXXFile.cxx.o
/usr/lib/ccache/g++     -pthread -march=native -fno-strict-aliasing -std=c++11 -D_GNU_SOURCE   -Wall -Wextra -Wpointer-arith -Wundef -Wvla -Wwrite-strings -Wno-error=extra -Wno-error=deprecated-declarations -Wno-unused-parameter -Wno-unused-variable -Wno-error=unused-variable -Wno-error=undef -Wno-error=uninitialized -Wlogical-op -Wno-error=maybe-uninitialized -Wno-error=cpp -Wno-reorder -Wno-missing-field-initializers  -fPIC  -Wformat -Wformat-security -fstack-protector -fstack-protector-strong -fno-strict-aliasing -mfpu=vfp3-d16   -o CMakeFiles/cmTC_5090f.dir/DummyCXXFile.cxx.o -c /usr/share/cmake-3.5/Modules/DummyCXXFile.cxx
g++: error: unrecognized argument in option ‘-mfpu=vfp3-d16’
g++: note: valid arguments to ‘-mfpu=’ are: crypto-neon-fp-armv8 fp-armv8 fpv4-sp-d16 fpv5-d16 fpv5-sp-d16 neon neon-fp-armv8 neon-fp16 neon-vfpv4 vfp vfp3 vfpv3 vfpv3-d16 vfpv3-d16-fp16 vfpv3-fp16 vfpv3xd vfpv3xd-fp16 vfpv4 vfpv4-d16
CMakeFiles/cmTC_5090f.dir/build.make:65: recipe for target 'CMakeFiles/cmTC_5090f.dir/DummyCXXFile.cxx.o' failed
make[2]: *** [CMakeFiles/cmTC_5090f.dir/DummyCXXFile.cxx.o] Error 1
make[2]: Leaving directory '/home/buildbot/slave/monero-linux-armv7/build/build/release/CMakeFiles/CMakeTmp'
Makefile:126: recipe for target 'cmTC_5090f/fast' failed
make[1]: *** [cmTC_5090f/fast] Error 2
make[1]: Leaving directory '/home/buildbot/slave/monero-linux-armv7/build/build/release/CMakeFiles/CMakeTmp'


Determining if the CXX compiler accepts the flag -mfpu=vfp4 failed with the following output:
Change Dir: /home/buildbot/slave/monero-linux-armv7/build/build/release/CMakeFiles/CMakeTmp

Run Build Command:"/usr/bin/make" "cmTC_fd4d0/fast"
make[1]: Entering directory '/home/buildbot/slave/monero-linux-armv7/build/build/release/CMakeFiles/CMakeTmp'
/usr/bin/make -f CMakeFiles/cmTC_fd4d0.dir/build.make CMakeFiles/cmTC_fd4d0.dir/build
make[2]: Entering directory '/home/buildbot/slave/monero-linux-armv7/build/build/release/CMakeFiles/CMakeTmp'
Building CXX object CMakeFiles/cmTC_fd4d0.dir/DummyCXXFile.cxx.o
/usr/lib/ccache/g++     -pthread -march=native -fno-strict-aliasing -std=c++11 -D_GNU_SOURCE   -Wall -Wextra -Wpointer-arith -Wundef -Wvla -Wwrite-strings -Wno-error=extra -Wno-error=deprecated-declarations -Wno-unused-parameter -Wno-unused-variable -Wno-error=unused-variable -Wno-error=undef -Wno-error=uninitialized -Wlogical-op -Wno-error=maybe-uninitialized -Wno-error=cpp -Wno-reorder -Wno-missing-field-initializers  -fPIC  -Wformat -Wformat-security -fstack-protector -fstack-protector-strong -fno-strict-aliasing -mfpu=vfp4   -o CMakeFiles/cmTC_fd4d0.dir/DummyCXXFile.cxx.o -c /usr/share/cmake-3.5/Modules/DummyCXXFile.cxx
g++: error: unrecognized argument in option ‘-mfpu=vfp4’
g++: note: valid arguments to ‘-mfpu=’ are: crypto-neon-fp-armv8 fp-armv8 fpv4-sp-d16 fpv5-d16 fpv5-sp-d16 neon neon-fp-armv8 neon-fp16 neon-vfpv4 vfp vfp3 vfpv3 vfpv3-d16 vfpv3-d16-fp16 vfpv3-fp16 vfpv3xd vfpv3xd-fp16 vfpv4 vfpv4-d16
CMakeFiles/cmTC_fd4d0.dir/build.make:65: recipe for target 'CMakeFiles/cmTC_fd4d0.dir/DummyCXXFile.cxx.o' failed
make[2]: *** [CMakeFiles/cmTC_fd4d0.dir/DummyCXXFile.cxx.o] Error 1
make[2]: Leaving directory '/home/buildbot/slave/monero-linux-armv7/build/build/release/CMakeFiles/CMakeTmp'
Makefile:126: recipe for target 'cmTC_fd4d0/fast' failed
make[1]: *** [cmTC_fd4d0/fast] Error 2
make[1]: Leaving directory '/home/buildbot/slave/monero-linux-armv7/build/build/release/CMakeFiles/CMakeTmp'


Determining if the CXX compiler accepts the flag -mfloat-abi=softfp failed with the following output:
Change Dir: /home/buildbot/slave/monero-linux-armv7/build/build/release/CMakeFiles/CMakeTmp

Run Build Command:"/usr/bin/make" "cmTC_aeb81/fast"
make[1]: Entering directory '/home/buildbot/slave/monero-linux-armv7/build/build/release/CMakeFiles/CMakeTmp'
/usr/bin/make -f CMakeFiles/cmTC_aeb81.dir/build.make CMakeFiles/cmTC_aeb81.dir/build
make[2]: Entering directory '/home/buildbot/slave/monero-linux-armv7/build/build/release/CMakeFiles/CMakeTmp'
Building CXX object CMakeFiles/cmTC_aeb81.dir/DummyCXXFile.cxx.o
/usr/lib/ccache/g++     -pthread -march=native -fno-strict-aliasing -std=c++11 -D_GNU_SOURCE   -Wall -Wextra -Wpointer-arith -Wundef -Wvla -Wwrite-strings -Wno-error=extra -Wno-error=deprecated-declarations -Wno-unused-parameter -Wno-unused-variable -Wno-error=unused-variable -Wno-error=undef -Wno-error=uninitialized -Wlogical-op -Wno-error=maybe-uninitialized -Wno-error=cpp -Wno-reorder -Wno-missing-field-initializers  -fPIC  -Wformat -Wformat-security -fstack-protector -fstack-protector-strong -fno-strict-aliasing -mfloat-abi=softfp   -o CMakeFiles/cmTC_aeb81.dir/DummyCXXFile.cxx.o -c /usr/share/cmake-3.5/Modules/DummyCXXFile.cxx
Linking CXX executable cmTC_aeb81
/usr/bin/cmake -E cmake_link_script CMakeFiles/cmTC_aeb81.dir/link.txt --verbose=1
/usr/lib/ccache/g++    -pthread -march=native -fno-strict-aliasing -std=c++11 -D_GNU_SOURCE   -Wall -Wextra -Wpointer-arith -Wundef -Wvla -Wwrite-strings -Wno-error=extra -Wno-error=deprecated-declarations -Wno-unused-parameter -Wno-unused-variable -Wno-error=unused-variable -Wno-error=undef -Wno-error=uninitialized -Wlogical-op -Wno-error=maybe-uninitialized -Wno-error=cpp -Wno-reorder -Wno-missing-field-initializers  -fPIC  -Wformat -Wformat-security -fstack-protector -fstack-protector-strong -fno-strict-aliasing -mfloat-abi=softfp    CMakeFiles/cmTC_aeb81.dir/DummyCXXFile.cxx.o  -o cmTC_aeb81 -rdynamic 
/usr/bin/ld: cannot find crt1.o: No such file or directory
/usr/bin/ld: cannot find crti.o: No such file or directory
collect2: error: ld returned 1 exit status
CMakeFiles/cmTC_aeb81.dir/build.make:97: recipe for target 'cmTC_aeb81' failed
make[2]: *** [cmTC_aeb81] Error 1
make[2]: Leaving directory '/home/buildbot/slave/monero-linux-armv7/build/build/release/CMakeFiles/CMakeTmp'
Makefile:126: recipe for target 'cmTC_aeb81/fast' failed
make[1]: *** [cmTC_aeb81/fast] Error 2
make[1]: Leaving directory '/home/buildbot/slave/monero-linux-armv7/build/build/release/CMakeFiles/CMakeTmp'