(view as text)
ccache make release-all
 in dir /home/buildbot/slave/monero-linux-armv7/build
 watching logfiles {'CMakeOutput.log': 'build/CMakeFiles/CMakeOutput.log', 'CMakeError.log': 'build/release/CMakeFiles/CMakeError.log'}
 argv: ['ccache', 'make', 'release-all']
 environment:
  CC=/usr/lib/ccache/gcc
  CXX=/usr/lib/ccache/g++
  HOME=/home/buildbot
  LANG=en_US.UTF-8
  LOGNAME=buildbot
  MAIL=/var/mail/buildbot
  PATH=/usr/local/bin:/usr/bin:/bin:/usr/local/games:/usr/games
  PWD=/home/buildbot/slave/monero-linux-armv7/build
  SHELL=/bin/bash
  SHLVL=1
  TERM=xterm
  USER=buildbot
  _=/usr/bin/buildslave
 using PTY: False
mkdir -p build/"Linux/refs_pull_5277_head"/release
cd build/"Linux/refs_pull_5277_head"/release && cmake -D BUILD_TESTS=ON -D CMAKE_BUILD_TYPE=release ../../../.. && /usr/bin/make
-- CMake version 3.5.1
-- The C compiler identification is GNU 5.4.0
-- The CXX compiler identification is GNU 5.4.0
-- Check for working C compiler: /usr/lib/ccache/gcc
-- Check for working C compiler: /usr/lib/ccache/gcc -- works
-- Detecting C compiler ABI info
-- Detecting C compiler ABI info - done
-- Detecting C compile features
-- Detecting C compile features - done
-- Check for working CXX compiler: /usr/lib/ccache/g++
-- Check for working CXX compiler: /usr/lib/ccache/g++ -- works
-- Detecting CXX compiler ABI info
-- Detecting CXX compiler ABI info - done
-- Detecting CXX compile features
-- Detecting CXX compile features - done
-- The ASM compiler identification is GNU
-- Found assembler: /usr/lib/ccache/gcc
-- Building without build tag
-- Found Git: /usr/bin/git (found version "2.7.4") 
-- Checking submodules
-- Submodule 'external/miniupnp' is up-to-date
-- Submodule 'external/unbound' is up-to-date
-- Submodule 'external/rapidjson' is up-to-date
-- Submodule 'external/trezor-common' is up-to-date
-- Could not find DEVELOPER_LOCAL_TOOLS in env (not required)
-- BOOST_IGNORE_SYSTEM_PATHS defaults to OFF
-- Could not find DEVELOPER_LIBUNBOUND_OLD in env (not required)
-- Building for a 32-bit system
-- Building internal libraries as static
-- Could not find DATABASE in env (not required unless you want to change database type from default: lmdb)
-- Using LMDB as default DB type
-- Stack trace on exception enabled (using easylogging++)
-- Looking for pthread.h
-- Looking for pthread.h - found
-- Looking for pthread_create
-- Looking for pthread_create - not found
-- Check if compiler accepts -pthread
-- Check if compiler accepts -pthread - yes
-- Found Threads: TRUE  
-- Performing Test _pthread_c
-- Performing Test _pthread_c - Success
-- Performing Test _pthread_cxx
-- Performing Test _pthread_cxx - Success
-- Found OpenSSL: /usr/lib/arm-linux-gnueabihf/libssl.so;/usr/lib/arm-linux-gnueabihf/libcrypto.so (found version "1.0.2g") 
-- Using OpenSSL include dir at /usr/include
-- Found HIDAPI: /usr/local/lib/libhidapi-libusb.so  
-- Looking for memset_s in c
-- Looking for memset_s in c - not found
-- Looking for explicit_bzero in c
-- Looking for explicit_bzero in c - not found
-- Looking for strptime
-- Looking for strptime - found
-- Could NOT find MiniUPnPc (missing:  MINIUPNP_INCLUDE_DIR MINIUPNP_LIBRARY) 
-- Using in-tree miniupnpc
-- Looking for libunbound
-- Found libunbound include (unbound.h) in /usr/include
-- Found libunbound shared library
-- Using 32-bit LMDB from source tree
-- Using HIDAPI include dir at /usr/local/include/hidapi
-- Could NOT find Protobuf (missing:  PROTOBUF_LIBRARY PROTOBUF_INCLUDE_DIR) 
-- Could NOT find Protobuf (missing:  PROTOBUF_LIBRARY PROTOBUF_INCLUDE_DIR) 
-- Could not find Protobuf
-- Building on armv7l for native
-- Performing Test CC_SUPPORTS_MARCH_NATIVE
-- Performing Test CC_SUPPORTS_MARCH_NATIVE - Success
-- AES support not available on ARMv7
-- Performing Test _Wformat_c
-- Performing Test _Wformat_c - Success
-- Performing Test _Wformat_cxx
-- Performing Test _Wformat_cxx - Success
-- Performing Test _Wformat_security_c
-- Performing Test _Wformat_security_c - Success
-- Performing Test _Wformat_security_cxx
-- Performing Test _Wformat_security_cxx - Success
-- Performing Test _fstack_protector_c
-- Performing Test _fstack_protector_c - Success
-- Performing Test _fstack_protector_cxx
-- Performing Test _fstack_protector_cxx - Success
-- Performing Test _fstack_protector_strong_c
-- Performing Test _fstack_protector_strong_c - Success
-- Performing Test _fstack_protector_strong_cxx
-- Performing Test _fstack_protector_strong_cxx - Success
-- Performing Test _fcf_protection=full_c
-- Performing Test _fcf_protection=full_c - Failed
-- Performing Test _fcf_protection=full_cxx
-- Performing Test _fcf_protection=full_cxx - Failed
-- Performing Test _fstack_clash_protection_c
-- Performing Test _fstack_clash_protection_c - Failed
-- Performing Test _fstack_clash_protection_cxx
-- Performing Test _fstack_clash_protection_cxx - Failed
-- Performing Test _mmitigate_rop_c
-- Performing Test _mmitigate_rop_c - Failed
-- Performing Test _mmitigate_rop_cxx
-- Performing Test _mmitigate_rop_cxx - Failed
-- Looking for -pie linker flag
-- Looking for -pie linker flag - found
-- Looking for -Wl,-z,relro linker flag
-- Looking for -Wl,-z,relro linker flag - found
-- Looking for -Wl,-z,now linker flag
-- Looking for -Wl,-z,now linker flag - found
-- Looking for -Wl,-z,noexecstack linker flag
-- Looking for -Wl,-z,noexecstack linker flag - found
-- Looking for -Wl,-z,noexecheap linker flag
-- Looking for -Wl,-z,noexecheap linker flag - not found
-- Using C security hardening flags:  -Wformat -Wformat-security -fstack-protector -fstack-protector-strong
-- Using C++ security hardening flags:  -Wformat -Wformat-security -fstack-protector -fstack-protector-strong
-- Using linker security hardening flags:  -pie -Wl,-z,relro -Wl,-z,now -Wl,-z,noexecstack
-- Setting FPU Flags for ARM Processors
-- Checking to see if CXX compiler accepts flag -mfpu=vfp3-d16
-- Checking to see if CXX compiler accepts flag -mfpu=vfp3-d16 - no
-- Checking to see if CXX compiler accepts flag -mfpu=vfp4
-- Checking to see if CXX compiler accepts flag -mfpu=vfp4 - no
-- Checking to see if CXX compiler accepts flag -mfloat-abi=hard
-- Checking to see if CXX compiler accepts flag -mfloat-abi=hard - yes
-- Checking to see if CXX compiler accepts flag -mfloat-abi=softfp
-- Checking to see if CXX compiler accepts flag -mfloat-abi=softfp - no
-- Setting Hardware ABI for Floating Point
CMake Warning at /usr/share/cmake-3.5/Modules/FindBoost.cmake:725 (message):
  Imported targets not available for Boost version 106600
Call Stack (most recent call first):
  /usr/share/cmake-3.5/Modules/FindBoost.cmake:763 (_Boost_COMPONENT_DEPENDENCIES)
  /usr/share/cmake-3.5/Modules/FindBoost.cmake:1332 (_Boost_MISSING_DEPENDENCIES)
  CMakeLists.txt:886 (find_package)


CMake Warning at /usr/share/cmake-3.5/Modules/FindBoost.cmake:725 (message):
  Imported targets not available for Boost version 106600
Call Stack (most recent call first):
  /usr/share/cmake-3.5/Modules/FindBoost.cmake:763 (_Boost_COMPONENT_DEPENDENCIES)
  /usr/share/cmake-3.5/Modules/FindBoost.cmake:1332 (_Boost_MISSING_DEPENDENCIES)
  CMakeLists.txt:886 (find_package)


CMake Warning at /usr/share/cmake-3.5/Modules/FindBoost.cmake:725 (message):
  Imported targets not available for Boost version 106600
Call Stack (most recent call first):
  /usr/share/cmake-3.5/Modules/FindBoost.cmake:763 (_Boost_COMPONENT_DEPENDENCIES)
  /usr/share/cmake-3.5/Modules/FindBoost.cmake:1332 (_Boost_MISSING_DEPENDENCIES)
  CMakeLists.txt:886 (find_package)


CMake Warning at /usr/share/cmake-3.5/Modules/FindBoost.cmake:725 (message):
  Imported targets not available for Boost version 106600
Call Stack (most recent call first):
  /usr/share/cmake-3.5/Modules/FindBoost.cmake:763 (_Boost_COMPONENT_DEPENDENCIES)
  /usr/share/cmake-3.5/Modules/FindBoost.cmake:1332 (_Boost_MISSING_DEPENDENCIES)
  CMakeLists.txt:886 (find_package)


CMake Warning at /usr/share/cmake-3.5/Modules/FindBoost.cmake:725 (message):
  Imported targets not available for Boost version 106600
Call Stack (most recent call first):
  /usr/share/cmake-3.5/Modules/FindBoost.cmake:763 (_Boost_COMPONENT_DEPENDENCIES)
  /usr/share/cmake-3.5/Modules/FindBoost.cmake:1332 (_Boost_MISSING_DEPENDENCIES)
  CMakeLists.txt:886 (find_package)


CMake Warning at /usr/share/cmake-3.5/Modules/FindBoost.cmake:725 (message):
  Imported targets not available for Boost version 106600
Call Stack (most recent call first):
  /usr/share/cmake-3.5/Modules/FindBoost.cmake:763 (_Boost_COMPONENT_DEPENDENCIES)
  /usr/share/cmake-3.5/Modules/FindBoost.cmake:1332 (_Boost_MISSING_DEPENDENCIES)
  CMakeLists.txt:886 (find_package)


CMake Warning at /usr/share/cmake-3.5/Modules/FindBoost.cmake:725 (message):
  Imported targets not available for Boost version 106600
Call Stack (most recent call first):
  /usr/share/cmake-3.5/Modules/FindBoost.cmake:763 (_Boost_COMPONENT_DEPENDENCIES)
  /usr/share/cmake-3.5/Modules/FindBoost.cmake:1332 (_Boost_MISSING_DEPENDENCIES)
  CMakeLists.txt:886 (find_package)


CMake Warning at /usr/share/cmake-3.5/Modules/FindBoost.cmake:725 (message):
  Imported targets not available for Boost version 106600
Call Stack (most recent call first):
  /usr/share/cmake-3.5/Modules/FindBoost.cmake:763 (_Boost_COMPONENT_DEPENDENCIES)
  /usr/share/cmake-3.5/Modules/FindBoost.cmake:1332 (_Boost_MISSING_DEPENDENCIES)
  CMakeLists.txt:886 (find_package)


CMake Warning at /usr/share/cmake-3.5/Modules/FindBoost.cmake:725 (message):
  Imported targets not available for Boost version 106600
Call Stack (most recent call first):
  /usr/share/cmake-3.5/Modules/FindBoost.cmake:763 (_Boost_COMPONENT_DEPENDENCIES)
  /usr/share/cmake-3.5/Modules/FindBoost.cmake:1332 (_Boost_MISSING_DEPENDENCIES)
  CMakeLists.txt:886 (find_package)


-- Found Boost Version: 106600
-- Found Readline: /usr/include  
-- Looking for rl_copy_text
-- Looking for rl_copy_text - found
-- Looking for rl_filename_completion_function
-- Looking for rl_filename_completion_function - found
-- Found readline library at: /usr
-- Found Git: /usr/bin/git
-- Trezor support disabled
-- Could NOT find GTest (missing:  GTEST_LIBRARY GTEST_MAIN_LIBRARY) 
-- GTest not found on the system: will use GTest bundled with this source
-- Found Doxygen: /usr/bin/doxygen (found version "1.8.11") 
-- Performing Test HAVE_C11
-- Performing Test HAVE_C11 - Success
-- Configuring done
-- Generating done
-- Build files have been written to: /home/buildbot/slave/monero-linux-armv7/build/build/Linux/refs_pull_5277_head/release
make[1]: Entering directory '/home/buildbot/slave/monero-linux-armv7/build/build/Linux/refs_pull_5277_head/release'
make[2]: Entering directory '/home/buildbot/slave/monero-linux-armv7/build/build/Linux/refs_pull_5277_head/release'
make[3]: Entering directory '/home/buildbot/slave/monero-linux-armv7/build/build/Linux/refs_pull_5277_head/release'
Scanning dependencies of target generate_translations_header
make[3]: Leaving directory '/home/buildbot/slave/monero-linux-armv7/build/build/Linux/refs_pull_5277_head/release'
make[3]: Entering directory '/home/buildbot/slave/monero-linux-armv7/build/build/Linux/refs_pull_5277_head/release'
[  1%] Creating directories for 'generate_translations_header'
[  1%] No download step for 'generate_translations_header'
[  1%] No patch step for 'generate_translations_header'
[  1%] No update step for 'generate_translations_header'
[  2%] Performing configure step for 'generate_translations_header'
-- The C compiler identification is GNU 5.4.0
-- The CXX compiler identification is GNU 5.4.0
-- Check for working C compiler: /usr/lib/ccache/gcc
-- Check for working C compiler: /usr/lib/ccache/gcc -- works
-- Detecting C compiler ABI info
-- Detecting C compiler ABI info - done
-- Detecting C compile features
-- Detecting C compile features - done
-- Check for working CXX compiler: /usr/lib/ccache/g++
-- Check for working CXX compiler: /usr/lib/ccache/g++ -- works
-- Detecting CXX compiler ABI info
-- Detecting CXX compiler ABI info - done
-- Detecting CXX compile features
-- Detecting CXX compile features - done
lrelease: could not find a Qt installation of ''
CMake Warning at CMakeLists.txt:59 (message):
  lrelease program not working, translation files not built


-- Configuring done
-- Generating done
-- Build files have been written to: /home/buildbot/slave/monero-linux-armv7/build/build/Linux/refs_pull_5277_head/release/translations
[  2%] Performing build step for 'generate_translations_header'
make[4]: Entering directory '/home/buildbot/slave/monero-linux-armv7/build/build/Linux/refs_pull_5277_head/release/translations'
make[5]: Entering directory '/home/buildbot/slave/monero-linux-armv7/build/build/Linux/refs_pull_5277_head/release/translations'
make[6]: Entering directory '/home/buildbot/slave/monero-linux-armv7/build/build/Linux/refs_pull_5277_head/release/translations'
Scanning dependencies of target generate_translations_header
make[6]: Leaving directory '/home/buildbot/slave/monero-linux-armv7/build/build/Linux/refs_pull_5277_head/release/translations'
make[6]: Entering directory '/home/buildbot/slave/monero-linux-armv7/build/build/Linux/refs_pull_5277_head/release/translations'
[ 50%] Building C object CMakeFiles/generate_translations_header.dir/generate_translations_header.c.o
[100%] Linking C executable generate_translations_header
Generating embedded translations header
make[6]: Leaving directory '/home/buildbot/slave/monero-linux-armv7/build/build/Linux/refs_pull_5277_head/release/translations'
[100%] Built target generate_translations_header
make[5]: Leaving directory '/home/buildbot/slave/monero-linux-armv7/build/build/Linux/refs_pull_5277_head/release/translations'
make[4]: Leaving directory '/home/buildbot/slave/monero-linux-armv7/build/build/Linux/refs_pull_5277_head/release/translations'
[  2%] Performing install step for 'generate_translations_header'

[  2%] Completed 'generate_translations_header'
make[3]: Leaving directory '/home/buildbot/slave/monero-linux-armv7/build/build/Linux/refs_pull_5277_head/release'
[  2%] Built target generate_translations_header
make[3]: Entering directory '/home/buildbot/slave/monero-linux-armv7/build/build/Linux/refs_pull_5277_head/release'
Scanning dependencies of target libminiupnpc-static
make[3]: Leaving directory '/home/buildbot/slave/monero-linux-armv7/build/build/Linux/refs_pull_5277_head/release'
make[3]: Entering directory '/home/buildbot/slave/monero-linux-armv7/build/build/Linux/refs_pull_5277_head/release'
[  2%] Building C object external/miniupnp/miniupnpc/CMakeFiles/libminiupnpc-static.dir/igd_desc_parse.c.o
[  2%] Building C object external/miniupnp/miniupnpc/CMakeFiles/libminiupnpc-static.dir/miniupnpc.c.o
[  3%] Building C object external/miniupnp/miniupnpc/CMakeFiles/libminiupnpc-static.dir/minixml.c.o
[  3%] Building C object external/miniupnp/miniupnpc/CMakeFiles/libminiupnpc-static.dir/minisoap.c.o
[  3%] Building C object external/miniupnp/miniupnpc/CMakeFiles/libminiupnpc-static.dir/minissdpc.c.o
[  4%] Building C object external/miniupnp/miniupnpc/CMakeFiles/libminiupnpc-static.dir/miniwget.c.o
[  4%] Building C object external/miniupnp/miniupnpc/CMakeFiles/libminiupnpc-static.dir/upnpcommands.c.o
[  4%] Building C object external/miniupnp/miniupnpc/CMakeFiles/libminiupnpc-static.dir/upnpdev.c.o
[  4%] Building C object external/miniupnp/miniupnpc/CMakeFiles/libminiupnpc-static.dir/upnpreplyparse.c.o
[  5%] Building C object external/miniupnp/miniupnpc/CMakeFiles/libminiupnpc-static.dir/upnperrors.c.o
[  5%] Building C object external/miniupnp/miniupnpc/CMakeFiles/libminiupnpc-static.dir/connecthostport.c.o
[  5%] Building C object external/miniupnp/miniupnpc/CMakeFiles/libminiupnpc-static.dir/portlistingparse.c.o
[  5%] Building C object external/miniupnp/miniupnpc/CMakeFiles/libminiupnpc-static.dir/receivedata.c.o
[  6%] Linking C static library libminiupnpc.a
make[3]: Leaving directory '/home/buildbot/slave/monero-linux-armv7/build/build/Linux/refs_pull_5277_head/release'
[  6%] Built target libminiupnpc-static
make[3]: Entering directory '/home/buildbot/slave/monero-linux-armv7/build/build/Linux/refs_pull_5277_head/release'
Scanning dependencies of target lmdb
make[3]: Leaving directory '/home/buildbot/slave/monero-linux-armv7/build/build/Linux/refs_pull_5277_head/release'
make[3]: Entering directory '/home/buildbot/slave/monero-linux-armv7/build/build/Linux/refs_pull_5277_head/release'
[  6%] Building C object external/db_drivers/liblmdb/CMakeFiles/lmdb.dir/mdb.c.o
[  6%] Building C object external/db_drivers/liblmdb/CMakeFiles/lmdb.dir/midl.c.o
[  6%] Linking C static library liblmdb.a
make[3]: Leaving directory '/home/buildbot/slave/monero-linux-armv7/build/build/Linux/refs_pull_5277_head/release'
[  6%] Built target lmdb
make[3]: Entering directory '/home/buildbot/slave/monero-linux-armv7/build/build/Linux/refs_pull_5277_head/release'
Scanning dependencies of target easylogging
make[3]: Leaving directory '/home/buildbot/slave/monero-linux-armv7/build/build/Linux/refs_pull_5277_head/release'
make[3]: Entering directory '/home/buildbot/slave/monero-linux-armv7/build/build/Linux/refs_pull_5277_head/release'
[  7%] Building CXX object external/easylogging++/CMakeFiles/easylogging.dir/easylogging++.cc.o
[  7%] Linking CXX static library libeasylogging.a
make[3]: Leaving directory '/home/buildbot/slave/monero-linux-armv7/build/build/Linux/refs_pull_5277_head/release'
[  7%] Built target easylogging
make[3]: Entering directory '/home/buildbot/slave/monero-linux-armv7/build/build/Linux/refs_pull_5277_head/release'
Scanning dependencies of target epee
make[3]: Leaving directory '/home/buildbot/slave/monero-linux-armv7/build/build/Linux/refs_pull_5277_head/release'
make[3]: Entering directory '/home/buildbot/slave/monero-linux-armv7/build/build/Linux/refs_pull_5277_head/release'
[  7%] Building CXX object contrib/epee/src/CMakeFiles/epee.dir/hex.cpp.o
[  7%] Building CXX object contrib/epee/src/CMakeFiles/epee.dir/http_auth.cpp.o
[  8%] Building CXX object contrib/epee/src/CMakeFiles/epee.dir/mlog.cpp.o
[  8%] Building CXX object contrib/epee/src/CMakeFiles/epee.dir/net_utils_base.cpp.o
[  8%] Building CXX object contrib/epee/src/CMakeFiles/epee.dir/string_tools.cpp.o
[  9%] Building CXX object contrib/epee/src/CMakeFiles/epee.dir/wipeable_string.cpp.o
[  9%] Building C object contrib/epee/src/CMakeFiles/epee.dir/memwipe.c.o
[  9%] Building CXX object contrib/epee/src/CMakeFiles/epee.dir/connection_basic.cpp.o
[  9%] Building CXX object contrib/epee/src/CMakeFiles/epee.dir/network_throttle.cpp.o
[ 10%] Building CXX object contrib/epee/src/CMakeFiles/epee.dir/network_throttle-detail.cpp.o
[ 10%] Building CXX object contrib/epee/src/CMakeFiles/epee.dir/mlocker.cpp.o
[ 10%] Building CXX object contrib/epee/src/CMakeFiles/epee.dir/buffer.cpp.o
[ 10%] Building CXX object contrib/epee/src/CMakeFiles/epee.dir/net_ssl.cpp.o
[ 11%] Linking CXX static library libepee.a
make[3]: Leaving directory '/home/buildbot/slave/monero-linux-armv7/build/build/Linux/refs_pull_5277_head/release'
[ 11%] Built target epee
make[3]: Entering directory '/home/buildbot/slave/monero-linux-armv7/build/build/Linux/refs_pull_5277_head/release'
Scanning dependencies of target epee_readline
make[3]: Leaving directory '/home/buildbot/slave/monero-linux-armv7/build/build/Linux/refs_pull_5277_head/release'
make[3]: Entering directory '/home/buildbot/slave/monero-linux-armv7/build/build/Linux/refs_pull_5277_head/release'
[ 11%] Building CXX object contrib/epee/src/CMakeFiles/epee_readline.dir/readline_buffer.cpp.o
[ 11%] Linking CXX static library libepee_readline.a
make[3]: Leaving directory '/home/buildbot/slave/monero-linux-armv7/build/build/Linux/refs_pull_5277_head/release'
[ 11%] Built target epee_readline
make[3]: Entering directory '/home/buildbot/slave/monero-linux-armv7/build/build/Linux/refs_pull_5277_head/release'
Scanning dependencies of target genversion
make[3]: Leaving directory '/home/buildbot/slave/monero-linux-armv7/build/build/Linux/refs_pull_5277_head/release'
make[3]: Entering directory '/home/buildbot/slave/monero-linux-armv7/build/build/Linux/refs_pull_5277_head/release'
[ 11%] Generating ../version.cpp
-- You are currently on commit adf6d77
-- The most recent tag was at 6cadbdc
-- You are ahead of or behind a tagged release
make[3]: Leaving directory '/home/buildbot/slave/monero-linux-armv7/build/build/Linux/refs_pull_5277_head/release'
[ 11%] Built target genversion
make[3]: Entering directory '/home/buildbot/slave/monero-linux-armv7/build/build/Linux/refs_pull_5277_head/release'
Scanning dependencies of target obj_version
make[3]: Leaving directory '/home/buildbot/slave/monero-linux-armv7/build/build/Linux/refs_pull_5277_head/release'
make[3]: Entering directory '/home/buildbot/slave/monero-linux-armv7/build/build/Linux/refs_pull_5277_head/release'
[ 11%] Building CXX object src/CMakeFiles/obj_version.dir/__/version.cpp.o
make[3]: Leaving directory '/home/buildbot/slave/monero-linux-armv7/build/build/Linux/refs_pull_5277_head/release'
[ 11%] Built target obj_version
make[3]: Entering directory '/home/buildbot/slave/monero-linux-armv7/build/build/Linux/refs_pull_5277_head/release'
Scanning dependencies of target version
make[3]: Leaving directory '/home/buildbot/slave/monero-linux-armv7/build/build/Linux/refs_pull_5277_head/release'
make[3]: Entering directory '/home/buildbot/slave/monero-linux-armv7/build/build/Linux/refs_pull_5277_head/release'
[ 11%] Linking CXX static library libversion.a
make[3]: Leaving directory '/home/buildbot/slave/monero-linux-armv7/build/build/Linux/refs_pull_5277_head/release'
[ 11%] Built target version
make[3]: Entering directory '/home/buildbot/slave/monero-linux-armv7/build/build/Linux/refs_pull_5277_head/release'
Scanning dependencies of target obj_common
make[3]: Leaving directory '/home/buildbot/slave/monero-linux-armv7/build/build/Linux/refs_pull_5277_head/release'
make[3]: Entering directory '/home/buildbot/slave/monero-linux-armv7/build/build/Linux/refs_pull_5277_head/release'
[ 12%] Building CXX object src/common/CMakeFiles/obj_common.dir/base58.cpp.o
[ 12%] Building CXX object src/common/CMakeFiles/obj_common.dir/command_line.cpp.o
[ 12%] Building CXX object src/common/CMakeFiles/obj_common.dir/dns_utils.cpp.o
[ 13%] Building CXX object src/common/CMakeFiles/obj_common.dir/download.cpp.o
[ 13%] Building CXX object src/common/CMakeFiles/obj_common.dir/error.cpp.o
[ 13%] Building CXX object src/common/CMakeFiles/obj_common.dir/expect.cpp.o
[ 13%] Building CXX object src/common/CMakeFiles/obj_common.dir/util.cpp.o
[ 14%] Building CXX object src/common/CMakeFiles/obj_common.dir/i18n.cpp.o
[ 14%] Building CXX object src/common/CMakeFiles/obj_common.dir/notify.cpp.o
[ 14%] Building CXX object src/common/CMakeFiles/obj_common.dir/password.cpp.o
[ 14%] Building CXX object src/common/CMakeFiles/obj_common.dir/perf_timer.cpp.o
[ 15%] Building CXX object src/common/CMakeFiles/obj_common.dir/pruning.cpp.o
[ 15%] Building CXX object src/common/CMakeFiles/obj_common.dir/spawn.cpp.o
[ 15%] Building CXX object src/common/CMakeFiles/obj_common.dir/threadpool.cpp.o
[ 15%] Building CXX object src/common/CMakeFiles/obj_common.dir/updates.cpp.o
[ 16%] Building C object src/common/CMakeFiles/obj_common.dir/aligned.c.o
[ 16%] Building CXX object src/common/CMakeFiles/obj_common.dir/timings.cc.o
[ 16%] Building CXX object src/common/CMakeFiles/obj_common.dir/combinator.cpp.o
[ 16%] Building CXX object src/common/CMakeFiles/obj_common.dir/stack_trace.cpp.o
make[3]: Leaving directory '/home/buildbot/slave/monero-linux-armv7/build/build/Linux/refs_pull_5277_head/release'
[ 16%] Built target obj_common
make[3]: Entering directory '/home/buildbot/slave/monero-linux-armv7/build/build/Linux/refs_pull_5277_head/release'
Scanning dependencies of target obj_cncrypto
make[3]: Leaving directory '/home/buildbot/slave/monero-linux-armv7/build/build/Linux/refs_pull_5277_head/release'
make[3]: Entering directory '/home/buildbot/slave/monero-linux-armv7/build/build/Linux/refs_pull_5277_head/release'
[ 16%] Building C object src/crypto/CMakeFiles/obj_cncrypto.dir/aesb.c.o
[ 16%] Building C object src/crypto/CMakeFiles/obj_cncrypto.dir/blake256.c.o
[ 17%] Building C object src/crypto/CMakeFiles/obj_cncrypto.dir/chacha.c.o
[ 17%] Building C object src/crypto/CMakeFiles/obj_cncrypto.dir/crypto-ops-data.c.o
[ 17%] Building C object src/crypto/CMakeFiles/obj_cncrypto.dir/crypto-ops.c.o
[ 18%] Building CXX object src/crypto/CMakeFiles/obj_cncrypto.dir/crypto.cpp.o
[ 18%] Building C object src/crypto/CMakeFiles/obj_cncrypto.dir/groestl.c.o
[ 18%] Building C object src/crypto/CMakeFiles/obj_cncrypto.dir/hash-extra-blake.c.o
[ 18%] Building C object src/crypto/CMakeFiles/obj_cncrypto.dir/hash-extra-groestl.c.o
[ 19%] Building C object src/crypto/CMakeFiles/obj_cncrypto.dir/hash-extra-jh.c.o
[ 19%] Building C object src/crypto/CMakeFiles/obj_cncrypto.dir/hash-extra-skein.c.o
[ 19%] Building C object src/crypto/CMakeFiles/obj_cncrypto.dir/hash.c.o
[ 19%] Building C object src/crypto/CMakeFiles/obj_cncrypto.dir/hmac-keccak.c.o
[ 20%] Building C object src/crypto/CMakeFiles/obj_cncrypto.dir/jh.c.o
[ 20%] Building C object src/crypto/CMakeFiles/obj_cncrypto.dir/keccak.c.o
[ 20%] Building C object src/crypto/CMakeFiles/obj_cncrypto.dir/oaes_lib.c.o
[ 20%] Building C object src/crypto/CMakeFiles/obj_cncrypto.dir/random.c.o
[ 21%] Building C object src/crypto/CMakeFiles/obj_cncrypto.dir/skein.c.o
[ 21%] Building C object src/crypto/CMakeFiles/obj_cncrypto.dir/slow-hash.c.o
[ 21%] Building C object src/crypto/CMakeFiles/obj_cncrypto.dir/CryptonightR_JIT.c.o
[ 21%] Building C object src/crypto/CMakeFiles/obj_cncrypto.dir/tree-hash.c.o
/home/buildbot/slave/monero-linux-armv7/build/src/crypto/tree-hash.c: In function ‘tree_hash’:
/home/buildbot/slave/monero-linux-armv7/build/src/crypto/tree-hash.c:85:5: warning: ISO C90 forbids variable length array ‘ints’ [-Wvla]
     char ints[cnt][HASH_SIZE];
     ^
make[3]: Leaving directory '/home/buildbot/slave/monero-linux-armv7/build/build/Linux/refs_pull_5277_head/release'
[ 21%] Built target obj_cncrypto
make[3]: Entering directory '/home/buildbot/slave/monero-linux-armv7/build/build/Linux/refs_pull_5277_head/release'
Scanning dependencies of target cncrypto
make[3]: Leaving directory '/home/buildbot/slave/monero-linux-armv7/build/build/Linux/refs_pull_5277_head/release'
make[3]: Entering directory '/home/buildbot/slave/monero-linux-armv7/build/build/Linux/refs_pull_5277_head/release'
[ 21%] Linking CXX static library libcncrypto.a
make[3]: Leaving directory '/home/buildbot/slave/monero-linux-armv7/build/build/Linux/refs_pull_5277_head/release'
[ 21%] Built target cncrypto
make[3]: Entering directory '/home/buildbot/slave/monero-linux-armv7/build/build/Linux/refs_pull_5277_head/release'
Scanning dependencies of target common
make[3]: Leaving directory '/home/buildbot/slave/monero-linux-armv7/build/build/Linux/refs_pull_5277_head/release'
make[3]: Entering directory '/home/buildbot/slave/monero-linux-armv7/build/build/Linux/refs_pull_5277_head/release'
[ 21%] Linking CXX static library libcommon.a
make[3]: Leaving directory '/home/buildbot/slave/monero-linux-armv7/build/build/Linux/refs_pull_5277_head/release'
[ 21%] Built target common
make[3]: Entering directory '/home/buildbot/slave/monero-linux-armv7/build/build/Linux/refs_pull_5277_head/release'
Scanning dependencies of target obj_ringct
make[3]: Leaving directory '/home/buildbot/slave/monero-linux-armv7/build/build/Linux/refs_pull_5277_head/release'
make[3]: Entering directory '/home/buildbot/slave/monero-linux-armv7/build/build/Linux/refs_pull_5277_head/release'
[ 21%] Building CXX object src/ringct/CMakeFiles/obj_ringct.dir/rctSigs.cpp.o
make[3]: Leaving directory '/home/buildbot/slave/monero-linux-armv7/build/build/Linux/refs_pull_5277_head/release'
[ 21%] Built target obj_ringct
make[3]: Entering directory '/home/buildbot/slave/monero-linux-armv7/build/build/Linux/refs_pull_5277_head/release'
Scanning dependencies of target obj_ringct_basic
make[3]: Leaving directory '/home/buildbot/slave/monero-linux-armv7/build/build/Linux/refs_pull_5277_head/release'
make[3]: Entering directory '/home/buildbot/slave/monero-linux-armv7/build/build/Linux/refs_pull_5277_head/release'
[ 22%] Building CXX object src/ringct/CMakeFiles/obj_ringct_basic.dir/rctOps.cpp.o
[ 22%] Building CXX object src/ringct/CMakeFiles/obj_ringct_basic.dir/rctTypes.cpp.o
[ 22%] Building C object src/ringct/CMakeFiles/obj_ringct_basic.dir/rctCryptoOps.c.o
[ 22%] Building CXX object src/ringct/CMakeFiles/obj_ringct_basic.dir/multiexp.cc.o
[ 23%] Building CXX object src/ringct/CMakeFiles/obj_ringct_basic.dir/bulletproofs.cc.o
make[3]: Leaving directory '/home/buildbot/slave/monero-linux-armv7/build/build/Linux/refs_pull_5277_head/release'
[ 23%] Built target obj_ringct_basic
make[3]: Entering directory '/home/buildbot/slave/monero-linux-armv7/build/build/Linux/refs_pull_5277_head/release'
Scanning dependencies of target ringct_basic
make[3]: Leaving directory '/home/buildbot/slave/monero-linux-armv7/build/build/Linux/refs_pull_5277_head/release'
make[3]: Entering directory '/home/buildbot/slave/monero-linux-armv7/build/build/Linux/refs_pull_5277_head/release'
[ 23%] Linking CXX static library libringct_basic.a
make[3]: Leaving directory '/home/buildbot/slave/monero-linux-armv7/build/build/Linux/refs_pull_5277_head/release'
[ 23%] Built target ringct_basic
make[3]: Entering directory '/home/buildbot/slave/monero-linux-armv7/build/build/Linux/refs_pull_5277_head/release'
Scanning dependencies of target obj_device
make[3]: Leaving directory '/home/buildbot/slave/monero-linux-armv7/build/build/Linux/refs_pull_5277_head/release'
make[3]: Entering directory '/home/buildbot/slave/monero-linux-armv7/build/build/Linux/refs_pull_5277_head/release'
[ 23%] Building CXX object src/device/CMakeFiles/obj_device.dir/device.cpp.o
[ 24%] Building CXX object src/device/CMakeFiles/obj_device.dir/device_default.cpp.o
[ 24%] Building CXX object src/device/CMakeFiles/obj_device.dir/log.cpp.o
[ 24%] Building CXX object src/device/CMakeFiles/obj_device.dir/device_ledger.cpp.o
[ 24%] Building CXX object src/device/CMakeFiles/obj_device.dir/device_io_hid.cpp.o
make[3]: Leaving directory '/home/buildbot/slave/monero-linux-armv7/build/build/Linux/refs_pull_5277_head/release'
[ 24%] Built target obj_device
make[3]: Entering directory '/home/buildbot/slave/monero-linux-armv7/build/build/Linux/refs_pull_5277_head/release'
Scanning dependencies of target device
make[3]: Leaving directory '/home/buildbot/slave/monero-linux-armv7/build/build/Linux/refs_pull_5277_head/release'
make[3]: Entering directory '/home/buildbot/slave/monero-linux-armv7/build/build/Linux/refs_pull_5277_head/release'
[ 24%] Linking CXX static library libdevice.a
make[3]: Leaving directory '/home/buildbot/slave/monero-linux-armv7/build/build/Linux/refs_pull_5277_head/release'
[ 24%] Built target device
make[3]: Entering directory '/home/buildbot/slave/monero-linux-armv7/build/build/Linux/refs_pull_5277_head/release'
Scanning dependencies of target obj_checkpoints
make[3]: Leaving directory '/home/buildbot/slave/monero-linux-armv7/build/build/Linux/refs_pull_5277_head/release'
make[3]: Entering directory '/home/buildbot/slave/monero-linux-armv7/build/build/Linux/refs_pull_5277_head/release'
[ 24%] Building CXX object src/checkpoints/CMakeFiles/obj_checkpoints.dir/checkpoints.cpp.o
make[3]: Leaving directory '/home/buildbot/slave/monero-linux-armv7/build/build/Linux/refs_pull_5277_head/release'
[ 24%] Built target obj_checkpoints
make[3]: Entering directory '/home/buildbot/slave/monero-linux-armv7/build/build/Linux/refs_pull_5277_head/release'
Scanning dependencies of target checkpoints
make[3]: Leaving directory '/home/buildbot/slave/monero-linux-armv7/build/build/Linux/refs_pull_5277_head/release'
make[3]: Entering directory '/home/buildbot/slave/monero-linux-armv7/build/build/Linux/refs_pull_5277_head/release'
[ 24%] Linking CXX static library libcheckpoints.a
make[3]: Leaving directory '/home/buildbot/slave/monero-linux-armv7/build/build/Linux/refs_pull_5277_head/release'
[ 24%] Built target checkpoints
make[3]: Entering directory '/home/buildbot/slave/monero-linux-armv7/build/build/Linux/refs_pull_5277_head/release'
Scanning dependencies of target obj_cryptonote_basic
make[3]: Leaving directory '/home/buildbot/slave/monero-linux-armv7/build/build/Linux/refs_pull_5277_head/release'
make[3]: Entering directory '/home/buildbot/slave/monero-linux-armv7/build/build/Linux/refs_pull_5277_head/release'
[ 25%] Building CXX object src/cryptonote_basic/CMakeFiles/obj_cryptonote_basic.dir/account.cpp.o
[ 25%] Building CXX object src/cryptonote_basic/CMakeFiles/obj_cryptonote_basic.dir/cryptonote_basic_impl.cpp.o
[ 25%] Building CXX object src/cryptonote_basic/CMakeFiles/obj_cryptonote_basic.dir/cryptonote_format_utils.cpp.o
[ 26%] Building CXX object src/cryptonote_basic/CMakeFiles/obj_cryptonote_basic.dir/difficulty.cpp.o
[ 26%] Building CXX object src/cryptonote_basic/CMakeFiles/obj_cryptonote_basic.dir/hardfork.cpp.o
[ 26%] Building CXX object src/cryptonote_basic/CMakeFiles/obj_cryptonote_basic.dir/miner.cpp.o
make[3]: Leaving directory '/home/buildbot/slave/monero-linux-armv7/build/build/Linux/refs_pull_5277_head/release'
[ 26%] Built target obj_cryptonote_basic
make[3]: Entering directory '/home/buildbot/slave/monero-linux-armv7/build/build/Linux/refs_pull_5277_head/release'
Scanning dependencies of target cryptonote_basic
make[3]: Leaving directory '/home/buildbot/slave/monero-linux-armv7/build/build/Linux/refs_pull_5277_head/release'
make[3]: Entering directory '/home/buildbot/slave/monero-linux-armv7/build/build/Linux/refs_pull_5277_head/release'
[ 26%] Linking CXX static library libcryptonote_basic.a
make[3]: Leaving directory '/home/buildbot/slave/monero-linux-armv7/build/build/Linux/refs_pull_5277_head/release'
[ 26%] Built target cryptonote_basic
make[3]: Entering directory '/home/buildbot/slave/monero-linux-armv7/build/build/Linux/refs_pull_5277_head/release'
Scanning dependencies of target ringct
make[3]: Leaving directory '/home/buildbot/slave/monero-linux-armv7/build/build/Linux/refs_pull_5277_head/release'
make[3]: Entering directory '/home/buildbot/slave/monero-linux-armv7/build/build/Linux/refs_pull_5277_head/release'
[ 27%] Linking CXX static library libringct.a
make[3]: Leaving directory '/home/buildbot/slave/monero-linux-armv7/build/build/Linux/refs_pull_5277_head/release'
[ 27%] Built target ringct
make[3]: Entering directory '/home/buildbot/slave/monero-linux-armv7/build/build/Linux/refs_pull_5277_head/release'
Scanning dependencies of target obj_cryptonote_core
make[3]: Leaving directory '/home/buildbot/slave/monero-linux-armv7/build/build/Linux/refs_pull_5277_head/release'
make[3]: Entering directory '/home/buildbot/slave/monero-linux-armv7/build/build/Linux/refs_pull_5277_head/release'
[ 27%] Building CXX object src/cryptonote_core/CMakeFiles/obj_cryptonote_core.dir/blockchain.cpp.o
[ 28%] Building CXX object src/cryptonote_core/CMakeFiles/obj_cryptonote_core.dir/cryptonote_core.cpp.o
[ 28%] Building CXX object src/cryptonote_core/CMakeFiles/obj_cryptonote_core.dir/tx_pool.cpp.o
[ 28%] Building CXX object src/cryptonote_core/CMakeFiles/obj_cryptonote_core.dir/cryptonote_tx_utils.cpp.o
make[3]: Leaving directory '/home/buildbot/slave/monero-linux-armv7/build/build/Linux/refs_pull_5277_head/release'
[ 28%] Built target obj_cryptonote_core
make[3]: Entering directory '/home/buildbot/slave/monero-linux-armv7/build/build/Linux/refs_pull_5277_head/release'
Scanning dependencies of target obj_multisig
make[3]: Leaving directory '/home/buildbot/slave/monero-linux-armv7/build/build/Linux/refs_pull_5277_head/release'
make[3]: Entering directory '/home/buildbot/slave/monero-linux-armv7/build/build/Linux/refs_pull_5277_head/release'
[ 28%] Building CXX object src/multisig/CMakeFiles/obj_multisig.dir/multisig.cpp.o
make[3]: Leaving directory '/home/buildbot/slave/monero-linux-armv7/build/build/Linux/refs_pull_5277_head/release'
[ 28%] Built target obj_multisig
make[3]: Entering directory '/home/buildbot/slave/monero-linux-armv7/build/build/Linux/refs_pull_5277_head/release'
Scanning dependencies of target multisig
make[3]: Leaving directory '/home/buildbot/slave/monero-linux-armv7/build/build/Linux/refs_pull_5277_head/release'
make[3]: Entering directory '/home/buildbot/slave/monero-linux-armv7/build/build/Linux/refs_pull_5277_head/release'
[ 28%] Linking CXX static library libmultisig.a
make[3]: Leaving directory '/home/buildbot/slave/monero-linux-armv7/build/build/Linux/refs_pull_5277_head/release'
[ 28%] Built target multisig
make[3]: Entering directory '/home/buildbot/slave/monero-linux-armv7/build/build/Linux/refs_pull_5277_head/release'
Scanning dependencies of target obj_blockchain_db
make[3]: Leaving directory '/home/buildbot/slave/monero-linux-armv7/build/build/Linux/refs_pull_5277_head/release'
make[3]: Entering directory '/home/buildbot/slave/monero-linux-armv7/build/build/Linux/refs_pull_5277_head/release'
[ 28%] Building CXX object src/blockchain_db/CMakeFiles/obj_blockchain_db.dir/blockchain_db.cpp.o
[ 29%] Building CXX object src/blockchain_db/CMakeFiles/obj_blockchain_db.dir/lmdb/db_lmdb.cpp.o
make[3]: Leaving directory '/home/buildbot/slave/monero-linux-armv7/build/build/Linux/refs_pull_5277_head/release'
[ 29%] Built target obj_blockchain_db
make[3]: Entering directory '/home/buildbot/slave/monero-linux-armv7/build/build/Linux/refs_pull_5277_head/release'
Scanning dependencies of target blockchain_db
make[3]: Leaving directory '/home/buildbot/slave/monero-linux-armv7/build/build/Linux/refs_pull_5277_head/release'
make[3]: Entering directory '/home/buildbot/slave/monero-linux-armv7/build/build/Linux/refs_pull_5277_head/release'
[ 29%] Linking CXX static library libblockchain_db.a
make[3]: Leaving directory '/home/buildbot/slave/monero-linux-armv7/build/build/Linux/refs_pull_5277_head/release'
[ 29%] Built target blockchain_db
make[3]: Entering directory '/home/buildbot/slave/monero-linux-armv7/build/build/Linux/refs_pull_5277_head/release'
Scanning dependencies of target cryptonote_core
make[3]: Leaving directory '/home/buildbot/slave/monero-linux-armv7/build/build/Linux/refs_pull_5277_head/release'
make[3]: Entering directory '/home/buildbot/slave/monero-linux-armv7/build/build/Linux/refs_pull_5277_head/release'
[ 29%] Linking CXX static library libcryptonote_core.a
make[3]: Leaving directory '/home/buildbot/slave/monero-linux-armv7/build/build/Linux/refs_pull_5277_head/release'
[ 29%] Built target cryptonote_core
make[3]: Entering directory '/home/buildbot/slave/monero-linux-armv7/build/build/Linux/refs_pull_5277_head/release'
Scanning dependencies of target obj_lmdb_lib
make[3]: Leaving directory '/home/buildbot/slave/monero-linux-armv7/build/build/Linux/refs_pull_5277_head/release'
make[3]: Entering directory '/home/buildbot/slave/monero-linux-armv7/build/build/Linux/refs_pull_5277_head/release'
[ 29%] Building CXX object src/lmdb/CMakeFiles/obj_lmdb_lib.dir/database.cpp.o
/home/buildbot/slave/monero-linux-armv7/build/src/lmdb/database.cpp: In member function ‘expect<void> lmdb::database::resize()’:
/home/buildbot/slave/monero-linux-armv7/build/src/lmdb/database.cpp:139:72: error: no matching function for call to ‘min(mdb_size_t&, const size_t&)’
         const std::size_t resize = std::min(info.me_mapsize, max_resize);
                                                                        ^
In file included from /usr/include/c++/5/memory:62:0,
                 from /home/buildbot/slave/monero-linux-armv7/build/src/lmdb/database.h:32,
                 from /home/buildbot/slave/monero-linux-armv7/build/src/lmdb/database.cpp:27:
/usr/include/c++/5/bits/stl_algobase.h:195:5: note: candidate: template<class _Tp> const _Tp& std::min(const _Tp&, const _Tp&)
     min(const _Tp& __a, const _Tp& __b)
     ^
/usr/include/c++/5/bits/stl_algobase.h:195:5: note:   template argument deduction/substitution failed:
/home/buildbot/slave/monero-linux-armv7/build/src/lmdb/database.cpp:139:72: note:   deduced conflicting types for parameter ‘const _Tp’ (‘long long unsigned int’ and ‘std::size_t {aka unsigned int}’)
         const std::size_t resize = std::min(info.me_mapsize, max_resize);
                                                                        ^
In file included from /usr/include/c++/5/memory:62:0,
                 from /home/buildbot/slave/monero-linux-armv7/build/src/lmdb/database.h:32,
                 from /home/buildbot/slave/monero-linux-armv7/build/src/lmdb/database.cpp:27:
/usr/include/c++/5/bits/stl_algobase.h:243:5: note: candidate: template<class _Tp, class _Compare> const _Tp& std::min(const _Tp&, const _Tp&, _Compare)
     min(const _Tp& __a, const _Tp& __b, _Compare __comp)
     ^
/usr/include/c++/5/bits/stl_algobase.h:243:5: note:   template argument deduction/substitution failed:
/home/buildbot/slave/monero-linux-armv7/build/src/lmdb/database.cpp:139:72: note:   deduced conflicting types for parameter ‘const _Tp’ (‘long long unsigned int’ and ‘std::size_t {aka unsigned int}’)
         const std::size_t resize = std::min(info.me_mapsize, max_resize);
                                                                        ^
In file included from /usr/include/c++/5/algorithm:62:0,
                 from /home/buildbot/slave/monero-linux-armv7/build/contrib/epee/include/span.h:31,
                 from /home/buildbot/slave/monero-linux-armv7/build/src/lmdb/util.h:35,
                 from /home/buildbot/slave/monero-linux-armv7/build/src/lmdb/database.cpp:29:
/usr/include/c++/5/bits/stl_algo.h:3445:5: note: candidate: template<class _Tp> _Tp std::min(std::initializer_list<_Tp>)
     min(initializer_list<_Tp> __l)
     ^
/usr/include/c++/5/bits/stl_algo.h:3445:5: note:   template argument deduction/substitution failed:
/home/buildbot/slave/monero-linux-armv7/build/src/lmdb/database.cpp:139:72: note:   mismatched types ‘std::initializer_list<_Tp>’ and ‘long long unsigned int’
         const std::size_t resize = std::min(info.me_mapsize, max_resize);
                                                                        ^
In file included from /usr/include/c++/5/algorithm:62:0,
                 from /home/buildbot/slave/monero-linux-armv7/build/contrib/epee/include/span.h:31,
                 from /home/buildbot/slave/monero-linux-armv7/build/src/lmdb/util.h:35,
                 from /home/buildbot/slave/monero-linux-armv7/build/src/lmdb/database.cpp:29:
/usr/include/c++/5/bits/stl_algo.h:3451:5: note: candidate: template<class _Tp, class _Compare> _Tp std::min(std::initializer_list<_Tp>, _Compare)
     min(initializer_list<_Tp> __l, _Compare __comp)
     ^
/usr/include/c++/5/bits/stl_algo.h:3451:5: note:   template argument deduction/substitution failed:
/home/buildbot/slave/monero-linux-armv7/build/src/lmdb/database.cpp:139:72: note:   mismatched types ‘std::initializer_list<_Tp>’ and ‘long long unsigned int’
         const std::size_t resize = std::min(info.me_mapsize, max_resize);
                                                                        ^
/home/buildbot/slave/monero-linux-armv7/build/src/lmdb/database.cpp:143:37: error: could not convert ‘{<expression error>}’ from ‘<brace-enclosed initializer list>’ to ‘expect<void>’
             return {lmdb::error(err)};
                                     ^
src/lmdb/CMakeFiles/obj_lmdb_lib.dir/build.make:62: recipe for target 'src/lmdb/CMakeFiles/obj_lmdb_lib.dir/database.cpp.o' failed
make[3]: Leaving directory '/home/buildbot/slave/monero-linux-armv7/build/build/Linux/refs_pull_5277_head/release'
make[3]: *** [src/lmdb/CMakeFiles/obj_lmdb_lib.dir/database.cpp.o] Error 1
CMakeFiles/Makefile2:1380: recipe for target 'src/lmdb/CMakeFiles/obj_lmdb_lib.dir/all' failed
make[2]: Leaving directory '/home/buildbot/slave/monero-linux-armv7/build/build/Linux/refs_pull_5277_head/release'
make[2]: *** [src/lmdb/CMakeFiles/obj_lmdb_lib.dir/all] Error 2
Makefile:138: recipe for target 'all' failed
make[1]: Leaving directory '/home/buildbot/slave/monero-linux-armv7/build/build/Linux/refs_pull_5277_head/release'
make[1]: *** [all] Error 2
Makefile:98: recipe for target 'release-all' failed
make: *** [release-all] Error 2
program finished with exit code 2
elapsedTime=1052.661129