(view as text)
ccache make release-all
 in dir /home/buildbot/slave/monero-linux-armv7/build
 watching logfiles {'CMakeOutput.log': 'build/CMakeFiles/CMakeOutput.log', 'CMakeError.log': 'build/release/CMakeFiles/CMakeError.log'}
 argv: ['ccache', 'make', 'release-all']
 environment:
  CC=/usr/lib/ccache/gcc
  CXX=/usr/lib/ccache/g++
  HOME=/home/buildbot
  LANG=en_US.UTF-8
  LOGNAME=buildbot
  MAIL=/var/mail/buildbot
  PATH=/usr/local/bin:/usr/bin:/bin:/usr/local/games:/usr/games
  PWD=/home/buildbot/slave/monero-linux-armv7/build
  SHELL=/bin/bash
  SHLVL=1
  TERM=xterm
  USER=buildbot
  _=/usr/bin/buildslave
 using PTY: False
mkdir -p build/"Linux/refs_pull_4054_head"/release
cd build/"Linux/refs_pull_4054_head"/release && cmake -D BUILD_TESTS=ON -D CMAKE_BUILD_TYPE=release ../../../.. && /usr/bin/make
-- CMake version 3.5.1
-- The C compiler identification is GNU 5.4.0
-- The CXX compiler identification is GNU 5.4.0
-- Check for working C compiler: /usr/lib/ccache/gcc
-- Check for working C compiler: /usr/lib/ccache/gcc -- works
-- Detecting C compiler ABI info
-- Detecting C compiler ABI info - done
-- Detecting C compile features
-- Detecting C compile features - done
-- Check for working CXX compiler: /usr/lib/ccache/g++
-- Check for working CXX compiler: /usr/lib/ccache/g++ -- works
-- Detecting CXX compiler ABI info
-- Detecting CXX compiler ABI info - done
-- Detecting CXX compile features
-- Detecting CXX compile features - done
-- Building without build tag
-- Found Git: /usr/bin/git (found version "2.7.4") 
-- Checking submodules
-- Submodule 'external/miniupnp' is up-to-date
-- Submodule 'external/unbound' is up-to-date
-- Submodule 'external/rapidjson' is up-to-date
-- Submodule 'external/trezor-common' is up-to-date
-- Could not find DEVELOPER_LOCAL_TOOLS in env (not required)
-- BOOST_IGNORE_SYSTEM_PATHS defaults to OFF
-- Could not find DEVELOPER_LIBUNBOUND_OLD in env (not required)
-- Building for a 32-bit system
-- Building internal libraries as static
-- Could not find DATABASE in env (not required unless you want to change database type from default: lmdb)
-- Using LMDB as default DB type
-- Stack trace on exception enabled (using easylogging++)
-- Looking for pthread.h
-- Looking for pthread.h - found
-- Looking for pthread_create
-- Looking for pthread_create - not found
-- Check if compiler accepts -pthread
-- Check if compiler accepts -pthread - yes
-- Found Threads: TRUE  
-- Performing Test _pthread_c
-- Performing Test _pthread_c - Success
-- Performing Test _pthread_cxx
-- Performing Test _pthread_cxx - Success
-- Found OpenSSL: /usr/lib/arm-linux-gnueabihf/libssl.so;/usr/lib/arm-linux-gnueabihf/libcrypto.so (found version "1.0.2g") 
-- Using OpenSSL include dir at /usr/include
-- Found HIDAPI: /usr/local/lib/libhidapi-libusb.so  
-- Looking for memset_s in c
-- Looking for memset_s in c - not found
-- Looking for explicit_bzero in c
-- Looking for explicit_bzero in c - not found
-- Looking for strptime
-- Looking for strptime - found
-- Could NOT find MiniUPnPc (missing:  MINIUPNP_INCLUDE_DIR MINIUPNP_LIBRARY) 
-- Using in-tree miniupnpc
-- Looking for libunbound
-- Found libunbound include (unbound.h) in /usr/include
-- Found libunbound shared library
-- Using 32-bit LMDB from source tree
-- Using HIDAPI include dir at /usr/local/include/hidapi
-- Could NOT find Protobuf (missing:  PROTOBUF_LIBRARY PROTOBUF_INCLUDE_DIR) 
-- Could NOT find Protobuf (missing:  PROTOBUF_LIBRARY PROTOBUF_INCLUDE_DIR) 
-- Could not find Protobuf
-- Building on armv7l for native
-- Performing Test CC_SUPPORTS_MARCH_NATIVE
-- Performing Test CC_SUPPORTS_MARCH_NATIVE - Success
-- AES support not available on ARMv7
-- Performing Test _Wformat_c
-- Performing Test _Wformat_c - Success
-- Performing Test _Wformat_cxx
-- Performing Test _Wformat_cxx - Success
-- Performing Test _Wformat_security_c
-- Performing Test _Wformat_security_c - Success
-- Performing Test _Wformat_security_cxx
-- Performing Test _Wformat_security_cxx - Success
-- Performing Test _fstack_protector_c
-- Performing Test _fstack_protector_c - Success
-- Performing Test _fstack_protector_cxx
-- Performing Test _fstack_protector_cxx - Success
-- Performing Test _fstack_protector_strong_c
-- Performing Test _fstack_protector_strong_c - Success
-- Performing Test _fstack_protector_strong_cxx
-- Performing Test _fstack_protector_strong_cxx - Success
-- Performing Test _fcf_protection=full_c
-- Performing Test _fcf_protection=full_c - Failed
-- Performing Test _fcf_protection=full_cxx
-- Performing Test _fcf_protection=full_cxx - Failed
-- Performing Test _fstack_clash_protection_c
-- Performing Test _fstack_clash_protection_c - Failed
-- Performing Test _fstack_clash_protection_cxx
-- Performing Test _fstack_clash_protection_cxx - Failed
-- Performing Test _mmitigate_rop_c
-- Performing Test _mmitigate_rop_c - Failed
-- Performing Test _mmitigate_rop_cxx
-- Performing Test _mmitigate_rop_cxx - Failed
-- Looking for -pie linker flag
-- Looking for -pie linker flag - found
-- Looking for -Wl,-z,relro linker flag
-- Looking for -Wl,-z,relro linker flag - found
-- Looking for -Wl,-z,now linker flag
-- Looking for -Wl,-z,now linker flag - found
-- Looking for -Wl,-z,noexecstack linker flag
-- Looking for -Wl,-z,noexecstack linker flag - found
-- Looking for -Wl,-z,noexecheap linker flag
-- Looking for -Wl,-z,noexecheap linker flag - not found
-- Using C security hardening flags:  -Wformat -Wformat-security -fstack-protector -fstack-protector-strong
-- Using C++ security hardening flags:  -Wformat -Wformat-security -fstack-protector -fstack-protector-strong
-- Using linker security hardening flags:  -pie -Wl,-z,relro -Wl,-z,now -Wl,-z,noexecstack
-- Setting FPU Flags for ARM Processors
-- Checking to see if CXX compiler accepts flag -mfpu=vfp3-d16
-- Checking to see if CXX compiler accepts flag -mfpu=vfp3-d16 - no
-- Checking to see if CXX compiler accepts flag -mfpu=vfp4
-- Checking to see if CXX compiler accepts flag -mfpu=vfp4 - no
-- Checking to see if CXX compiler accepts flag -mfloat-abi=hard
-- Checking to see if CXX compiler accepts flag -mfloat-abi=hard - yes
-- Checking to see if CXX compiler accepts flag -mfloat-abi=softfp
-- Checking to see if CXX compiler accepts flag -mfloat-abi=softfp - no
-- Setting Hardware ABI for Floating Point
CMake Warning at /usr/share/cmake-3.5/Modules/FindBoost.cmake:725 (message):
  Imported targets not available for Boost version 106600
Call Stack (most recent call first):
  /usr/share/cmake-3.5/Modules/FindBoost.cmake:763 (_Boost_COMPONENT_DEPENDENCIES)
  /usr/share/cmake-3.5/Modules/FindBoost.cmake:1332 (_Boost_MISSING_DEPENDENCIES)
  CMakeLists.txt:882 (find_package)


CMake Warning at /usr/share/cmake-3.5/Modules/FindBoost.cmake:725 (message):
  Imported targets not available for Boost version 106600
Call Stack (most recent call first):
  /usr/share/cmake-3.5/Modules/FindBoost.cmake:763 (_Boost_COMPONENT_DEPENDENCIES)
  /usr/share/cmake-3.5/Modules/FindBoost.cmake:1332 (_Boost_MISSING_DEPENDENCIES)
  CMakeLists.txt:882 (find_package)


CMake Warning at /usr/share/cmake-3.5/Modules/FindBoost.cmake:725 (message):
  Imported targets not available for Boost version 106600
Call Stack (most recent call first):
  /usr/share/cmake-3.5/Modules/FindBoost.cmake:763 (_Boost_COMPONENT_DEPENDENCIES)
  /usr/share/cmake-3.5/Modules/FindBoost.cmake:1332 (_Boost_MISSING_DEPENDENCIES)
  CMakeLists.txt:882 (find_package)


CMake Warning at /usr/share/cmake-3.5/Modules/FindBoost.cmake:725 (message):
  Imported targets not available for Boost version 106600
Call Stack (most recent call first):
  /usr/share/cmake-3.5/Modules/FindBoost.cmake:763 (_Boost_COMPONENT_DEPENDENCIES)
  /usr/share/cmake-3.5/Modules/FindBoost.cmake:1332 (_Boost_MISSING_DEPENDENCIES)
  CMakeLists.txt:882 (find_package)


CMake Warning at /usr/share/cmake-3.5/Modules/FindBoost.cmake:725 (message):
  Imported targets not available for Boost version 106600
Call Stack (most recent call first):
  /usr/share/cmake-3.5/Modules/FindBoost.cmake:763 (_Boost_COMPONENT_DEPENDENCIES)
  /usr/share/cmake-3.5/Modules/FindBoost.cmake:1332 (_Boost_MISSING_DEPENDENCIES)
  CMakeLists.txt:882 (find_package)


CMake Warning at /usr/share/cmake-3.5/Modules/FindBoost.cmake:725 (message):
  Imported targets not available for Boost version 106600
Call Stack (most recent call first):
  /usr/share/cmake-3.5/Modules/FindBoost.cmake:763 (_Boost_COMPONENT_DEPENDENCIES)
  /usr/share/cmake-3.5/Modules/FindBoost.cmake:1332 (_Boost_MISSING_DEPENDENCIES)
  CMakeLists.txt:882 (find_package)


CMake Warning at /usr/share/cmake-3.5/Modules/FindBoost.cmake:725 (message):
  Imported targets not available for Boost version 106600
Call Stack (most recent call first):
  /usr/share/cmake-3.5/Modules/FindBoost.cmake:763 (_Boost_COMPONENT_DEPENDENCIES)
  /usr/share/cmake-3.5/Modules/FindBoost.cmake:1332 (_Boost_MISSING_DEPENDENCIES)
  CMakeLists.txt:882 (find_package)


CMake Warning at /usr/share/cmake-3.5/Modules/FindBoost.cmake:725 (message):
  Imported targets not available for Boost version 106600
Call Stack (most recent call first):
  /usr/share/cmake-3.5/Modules/FindBoost.cmake:763 (_Boost_COMPONENT_DEPENDENCIES)
  /usr/share/cmake-3.5/Modules/FindBoost.cmake:1332 (_Boost_MISSING_DEPENDENCIES)
  CMakeLists.txt:882 (find_package)


CMake Warning at /usr/share/cmake-3.5/Modules/FindBoost.cmake:725 (message):
  Imported targets not available for Boost version 106600
Call Stack (most recent call first):
  /usr/share/cmake-3.5/Modules/FindBoost.cmake:763 (_Boost_COMPONENT_DEPENDENCIES)
  /usr/share/cmake-3.5/Modules/FindBoost.cmake:1332 (_Boost_MISSING_DEPENDENCIES)
  CMakeLists.txt:882 (find_package)


-- Found Boost Version: 106600
-- Found Readline: /usr/include  
-- Looking for rl_copy_text
-- Looking for rl_copy_text - found
-- Looking for rl_filename_completion_function
-- Looking for rl_filename_completion_function - found
-- Found readline library at: /usr
-- Found Git: /usr/bin/git
-- Trezor support disabled
-- Could NOT find GTest (missing:  GTEST_LIBRARY GTEST_MAIN_LIBRARY) 
-- GTest not found on the system: will use GTest bundled with this source
-- Found Doxygen: /usr/bin/doxygen (found version "1.8.11") 
-- Performing Test HAVE_C11
-- Performing Test HAVE_C11 - Success
-- Configuring done
-- Generating done
-- Build files have been written to: /home/buildbot/slave/monero-linux-armv7/build/build/Linux/refs_pull_4054_head/release
make[1]: Entering directory '/home/buildbot/slave/monero-linux-armv7/build/build/Linux/refs_pull_4054_head/release'
make[2]: Entering directory '/home/buildbot/slave/monero-linux-armv7/build/build/Linux/refs_pull_4054_head/release'
make[3]: Entering directory '/home/buildbot/slave/monero-linux-armv7/build/build/Linux/refs_pull_4054_head/release'
Scanning dependencies of target generate_translations_header
make[3]: Leaving directory '/home/buildbot/slave/monero-linux-armv7/build/build/Linux/refs_pull_4054_head/release'
make[3]: Entering directory '/home/buildbot/slave/monero-linux-armv7/build/build/Linux/refs_pull_4054_head/release'
[  0%] Creating directories for 'generate_translations_header'
[  0%] No download step for 'generate_translations_header'
[  0%] No patch step for 'generate_translations_header'
[  1%] No update step for 'generate_translations_header'
[  1%] Performing configure step for 'generate_translations_header'
-- The C compiler identification is GNU 5.4.0
-- The CXX compiler identification is GNU 5.4.0
-- Check for working C compiler: /usr/lib/ccache/gcc
-- Check for working C compiler: /usr/lib/ccache/gcc -- works
-- Detecting C compiler ABI info
-- Detecting C compiler ABI info - done
-- Detecting C compile features
-- Detecting C compile features - done
-- Check for working CXX compiler: /usr/lib/ccache/g++
-- Check for working CXX compiler: /usr/lib/ccache/g++ -- works
-- Detecting CXX compiler ABI info
-- Detecting CXX compiler ABI info - done
-- Detecting CXX compile features
-- Detecting CXX compile features - done
lrelease: could not find a Qt installation of ''
CMake Warning at CMakeLists.txt:59 (message):
  lrelease program not working, translation files not built


-- Configuring done
-- Generating done
-- Build files have been written to: /home/buildbot/slave/monero-linux-armv7/build/build/Linux/refs_pull_4054_head/release/translations
[  1%] Performing build step for 'generate_translations_header'
make[4]: Entering directory '/home/buildbot/slave/monero-linux-armv7/build/build/Linux/refs_pull_4054_head/release/translations'
make[5]: Entering directory '/home/buildbot/slave/monero-linux-armv7/build/build/Linux/refs_pull_4054_head/release/translations'
make[6]: Entering directory '/home/buildbot/slave/monero-linux-armv7/build/build/Linux/refs_pull_4054_head/release/translations'
Scanning dependencies of target generate_translations_header
make[6]: Leaving directory '/home/buildbot/slave/monero-linux-armv7/build/build/Linux/refs_pull_4054_head/release/translations'
make[6]: Entering directory '/home/buildbot/slave/monero-linux-armv7/build/build/Linux/refs_pull_4054_head/release/translations'
[ 50%] Building C object CMakeFiles/generate_translations_header.dir/generate_translations_header.c.o
[100%] Linking C executable generate_translations_header
Generating embedded translations header
make[6]: Leaving directory '/home/buildbot/slave/monero-linux-armv7/build/build/Linux/refs_pull_4054_head/release/translations'
[100%] Built target generate_translations_header
make[5]: Leaving directory '/home/buildbot/slave/monero-linux-armv7/build/build/Linux/refs_pull_4054_head/release/translations'
make[4]: Leaving directory '/home/buildbot/slave/monero-linux-armv7/build/build/Linux/refs_pull_4054_head/release/translations'
[  2%] Performing install step for 'generate_translations_header'

[  2%] Completed 'generate_translations_header'
make[3]: Leaving directory '/home/buildbot/slave/monero-linux-armv7/build/build/Linux/refs_pull_4054_head/release'
[  2%] Built target generate_translations_header
make[3]: Entering directory '/home/buildbot/slave/monero-linux-armv7/build/build/Linux/refs_pull_4054_head/release'
Scanning dependencies of target libminiupnpc-static
make[3]: Leaving directory '/home/buildbot/slave/monero-linux-armv7/build/build/Linux/refs_pull_4054_head/release'
make[3]: Entering directory '/home/buildbot/slave/monero-linux-armv7/build/build/Linux/refs_pull_4054_head/release'
[  2%] Building C object external/miniupnp/miniupnpc/CMakeFiles/libminiupnpc-static.dir/igd_desc_parse.c.o
[  2%] Building C object external/miniupnp/miniupnpc/CMakeFiles/libminiupnpc-static.dir/miniupnpc.c.o
[  3%] Building C object external/miniupnp/miniupnpc/CMakeFiles/libminiupnpc-static.dir/minixml.c.o
[  3%] Building C object external/miniupnp/miniupnpc/CMakeFiles/libminiupnpc-static.dir/minisoap.c.o
[  3%] Building C object external/miniupnp/miniupnpc/CMakeFiles/libminiupnpc-static.dir/minissdpc.c.o
[  4%] Building C object external/miniupnp/miniupnpc/CMakeFiles/libminiupnpc-static.dir/miniwget.c.o
[  4%] Building C object external/miniupnp/miniupnpc/CMakeFiles/libminiupnpc-static.dir/upnpcommands.c.o
[  4%] Building C object external/miniupnp/miniupnpc/CMakeFiles/libminiupnpc-static.dir/upnpdev.c.o
[  4%] Building C object external/miniupnp/miniupnpc/CMakeFiles/libminiupnpc-static.dir/upnpreplyparse.c.o
[  5%] Building C object external/miniupnp/miniupnpc/CMakeFiles/libminiupnpc-static.dir/upnperrors.c.o
[  5%] Building C object external/miniupnp/miniupnpc/CMakeFiles/libminiupnpc-static.dir/connecthostport.c.o
[  5%] Building C object external/miniupnp/miniupnpc/CMakeFiles/libminiupnpc-static.dir/portlistingparse.c.o
[  6%] Building C object external/miniupnp/miniupnpc/CMakeFiles/libminiupnpc-static.dir/receivedata.c.o
[  6%] Linking C static library libminiupnpc.a
make[3]: Leaving directory '/home/buildbot/slave/monero-linux-armv7/build/build/Linux/refs_pull_4054_head/release'
[  6%] Built target libminiupnpc-static
make[3]: Entering directory '/home/buildbot/slave/monero-linux-armv7/build/build/Linux/refs_pull_4054_head/release'
Scanning dependencies of target lmdb
make[3]: Leaving directory '/home/buildbot/slave/monero-linux-armv7/build/build/Linux/refs_pull_4054_head/release'
make[3]: Entering directory '/home/buildbot/slave/monero-linux-armv7/build/build/Linux/refs_pull_4054_head/release'
[  6%] Building C object external/db_drivers/liblmdb/CMakeFiles/lmdb.dir/mdb.c.o
[  6%] Building C object external/db_drivers/liblmdb/CMakeFiles/lmdb.dir/midl.c.o
[  7%] Linking C static library liblmdb.a
make[3]: Leaving directory '/home/buildbot/slave/monero-linux-armv7/build/build/Linux/refs_pull_4054_head/release'
[  7%] Built target lmdb
make[3]: Entering directory '/home/buildbot/slave/monero-linux-armv7/build/build/Linux/refs_pull_4054_head/release'
Scanning dependencies of target easylogging
make[3]: Leaving directory '/home/buildbot/slave/monero-linux-armv7/build/build/Linux/refs_pull_4054_head/release'
make[3]: Entering directory '/home/buildbot/slave/monero-linux-armv7/build/build/Linux/refs_pull_4054_head/release'
[  7%] Building CXX object external/easylogging++/CMakeFiles/easylogging.dir/easylogging++.cc.o
[  7%] Linking CXX static library libeasylogging.a
make[3]: Leaving directory '/home/buildbot/slave/monero-linux-armv7/build/build/Linux/refs_pull_4054_head/release'
[  7%] Built target easylogging
make[3]: Entering directory '/home/buildbot/slave/monero-linux-armv7/build/build/Linux/refs_pull_4054_head/release'
Scanning dependencies of target epee
make[3]: Leaving directory '/home/buildbot/slave/monero-linux-armv7/build/build/Linux/refs_pull_4054_head/release'
make[3]: Entering directory '/home/buildbot/slave/monero-linux-armv7/build/build/Linux/refs_pull_4054_head/release'
[  7%] Building CXX object contrib/epee/src/CMakeFiles/epee.dir/hex.cpp.o
[  8%] Building CXX object contrib/epee/src/CMakeFiles/epee.dir/http_auth.cpp.o
[  8%] Building CXX object contrib/epee/src/CMakeFiles/epee.dir/mlog.cpp.o
[  8%] Building CXX object contrib/epee/src/CMakeFiles/epee.dir/net_utils_base.cpp.o
[  9%] Building CXX object contrib/epee/src/CMakeFiles/epee.dir/string_tools.cpp.o
[  9%] Building CXX object contrib/epee/src/CMakeFiles/epee.dir/wipeable_string.cpp.o
[  9%] Building C object contrib/epee/src/CMakeFiles/epee.dir/memwipe.c.o
[  9%] Building CXX object contrib/epee/src/CMakeFiles/epee.dir/connection_basic.cpp.o
[ 10%] Building CXX object contrib/epee/src/CMakeFiles/epee.dir/network_throttle.cpp.o
[ 10%] Building CXX object contrib/epee/src/CMakeFiles/epee.dir/network_throttle-detail.cpp.o
[ 10%] Building CXX object contrib/epee/src/CMakeFiles/epee.dir/mlocker.cpp.o
[ 11%] Building CXX object contrib/epee/src/CMakeFiles/epee.dir/net_ssl.cpp.o
/home/buildbot/slave/monero-linux-armv7/build/contrib/epee/src/net_ssl.cpp: In function ‘epee::net_utils::ssl_context_t epee::net_utils::create_ssl_context(const string&, const string&, std::__cxx11::list<std::__cxx11::basic_string<char> >, bool)’:
/home/buildbot/slave/monero-linux-armv7/build/contrib/epee/src/net_ssl.cpp:143:2: error: ‘SSL_OP_NO_RENEGOTIATION’ was not declared in this scope
   SSL_CTX_set_options(ctx, SSL_OP_NO_RENEGOTIATION);
  ^
contrib/epee/src/CMakeFiles/epee.dir/build.make:326: recipe for target 'contrib/epee/src/CMakeFiles/epee.dir/net_ssl.cpp.o' failed
make[3]: Leaving directory '/home/buildbot/slave/monero-linux-armv7/build/build/Linux/refs_pull_4054_head/release'
make[3]: *** [contrib/epee/src/CMakeFiles/epee.dir/net_ssl.cpp.o] Error 1
CMakeFiles/Makefile2:399: recipe for target 'contrib/epee/src/CMakeFiles/epee.dir/all' failed
make[2]: Leaving directory '/home/buildbot/slave/monero-linux-armv7/build/build/Linux/refs_pull_4054_head/release'
make[2]: *** [contrib/epee/src/CMakeFiles/epee.dir/all] Error 2
Makefile:138: recipe for target 'all' failed
make[1]: Leaving directory '/home/buildbot/slave/monero-linux-armv7/build/build/Linux/refs_pull_4054_head/release'
make[1]: *** [all] Error 2
Makefile:94: recipe for target 'release-all' failed
make: *** [release-all] Error 2
program finished with exit code 2
elapsedTime=191.729237