(view as text)
/msys32/usr/bin/bash.exe -ex ./build.sh release-static
 in dir C:\msys32\home\buildbot\slave\monero-gui-win32\build (timeout 1200 secs)
 watching logfiles {}
 argv: ['/msys32/usr/bin/bash.exe', '-ex', './build.sh', 'release-static']
 environment:
  ALLUSERSPROFILE=C:\ProgramData
  APPDATA=C:\WINDOWS\system32\config\systemprofile\AppData\Roaming
  CHOCOLATEYINSTALL=C:\ProgramData\chocolatey
  COMMONPROGRAMFILES=C:\Program Files\Common Files
  COMPUTERNAME=DESKTOP-7NB6IPI
  COMSPEC=C:\WINDOWS\system32\cmd.exe
  DRIVERDATA=C:\Windows\System32\Drivers\DriverData
  DXSDK_DIR=C:\Program Files\Microsoft DirectX SDK (June 2010)\
  HOME=C:\msys32\home\SYSTEM
  LOCALAPPDATA=C:\WINDOWS\system32\config\systemprofile\AppData\Local
  MSYSTEM=MINGW32
  NUMBER_OF_PROCESSORS=1
  OS=Windows_NT
  PATH=c:\Qt\qt-everywhere-opensource-src-5.7.0\qtbase\bin;C:\msys32\usr\bin;C:\Python27;C:\Python27\Scripts;C:\WINDOWS\system32;C:\WINDOWS;C:\WINDOWS\System32\Wbem;C:\WINDOWS\System32\WindowsPowerShell\v1.0;C:\ProgramData\chocolatey\bin;C:\msys32\mingw32\bin;C:\WINDOWS\System32\OpenSSH;C:\WINDOWS\system32\config\systemprofile\AppData\Local\Microsoft\WindowsApps;C:\python27\lib\site-packages\pywin32_system32
  PATHEXT=.COM;.EXE;.BAT;.CMD;.VBS;.VBE;.JS;.JSE;.WSF;.WSH;.MSC
  PROCESSOR_ARCHITECTURE=x86
  PROCESSOR_IDENTIFIER=x86 Family 6 Model 60 Stepping 3, GenuineIntel
  PROCESSOR_LEVEL=6
  PROCESSOR_REVISION=3c03
  PROGRAMDATA=C:\ProgramData
  PROGRAMFILES=C:\Program Files
  PSMODULEPATH=C:\Program Files\WindowsPowerShell\Modules;C:\WINDOWS\system32\WindowsPowerShell\v1.0\Modules
  PUBLIC=C:\Users\Public
  PWD=C:\msys32\home\buildbot\slave\monero-gui-win32\build
  SYSTEMDRIVE=C:
  SYSTEMROOT=C:\WINDOWS
  TEMP=C:\WINDOWS\TEMP
  TERM=cygwin
  TMP=C:\WINDOWS\TEMP
  USERDOMAIN=WORKGROUP
  USERNAME=DESKTOP-7NB6IPI$
  USERPROFILE=C:\WINDOWS\system32\config\systemprofile
  WINDIR=C:\WINDOWS
 using PTY: False
+ BUILD_TYPE=release-static
+ BUILD_TREZOR=true
+ source ./utils.sh
++ get_platform
++ local platform=unknown
+++ uname
++ '[' MINGW32_NT-10.0 == Darwin ']'
+++ uname
++ '[' MINGW32_NT-10.0 == FreeBSD ']'
++++ uname -s
+++ expr substr MINGW32_NT-10.0 1 5
++ '[' MINGW == Linux ']'
++++ uname -s
+++ expr substr MINGW32_NT-10.0 1 10
++ '[' MINGW32_NT == MINGW64_NT ']'
++++ uname -s
+++ expr substr MINGW32_NT-10.0 1 10
Building release-static
++ '[' MINGW32_NT == MINGW32_NT ']'
++ platform=mingw32
++ echo mingw32
+ platform=mingw32
+ '[' -z release-static ']'
+ '[' release-static == release ']'
+ '[' release-static == release-static ']'
+ echo 'Building release-static'
+ '[' mingw32 '!=' darwin ']'
+ CONFIG='CONFIG+=release static'
+ BIN_PATH=release/bin
+ source ./utils.sh
/home/buildbot/slave/monero-gui-win32/build /home/buildbot/slave/monero-gui-win32/build
++ pwd
+ pushd /home/buildbot/slave/monero-gui-win32/build
+++ dirname ./build.sh
++ cd .
++ pwd
+ ROOT_DIR=/home/buildbot/slave/monero-gui-win32/build
+ MONERO_DIR=monero
+ MONEROD_EXEC=monerod
+ MAKE=make
+ [[ mingw32 == *bsd* ]]
+ export BUILD_TREZOR
+ ./get_libwallet_api.sh release-static
/home/buildbot/slave/monero-gui-win32/build /home/buildbot/slave/monero-gui-win32/build
From https://github.com/monero-project/monero
   fe3f6a3e..411f1b0e  master        -> origin/master
   2b88b7cc..6def88ad  release-v0.15 -> origin/release-v0.15
 * [new tag]           v0.15.0.1     -> v0.15.0.1
Submodule path 'monero': checked out '411f1b0ee30f1d424621eb856841dc82d2f161c2'
Previous HEAD position was 411f1b0e Merge pull request #6174
HEAD is now at 6def88ad Merge pull request #6156
M	external/miniupnp
M	external/trezor-common
/home/buildbot/slave/monero-gui-win32/build/monero /home/buildbot/slave/monero-gui-win32/build /home/buildbot/slave/monero-gui-win32/build
You are currently on commit 6def88ad
The most recent tag was at 6def88ad
You are building a tagged release
/home/buildbot/slave/monero-gui-win32/build /home/buildbot/slave/monero-gui-win32/build
M	external/miniupnp
M	external/trezor-common
Switched to a new branch 'release'
Submodule 'external/randomx' (https://github.com/tevador/RandomX) registered for path 'external/randomx'
Cloning into '/home/buildbot/slave/monero-gui-win32/build/monero/external/randomx'...
Submodule path 'external/miniupnp': checked out '4c700e09526a7d546394e85628c57e9490feefa0'
Submodule path 'external/randomx': checked out '7567cef4c6192fb5356bbdd7db802be77be0439b'
Submodule path 'external/trezor-common': checked out '31a0073c62738827b48d725facd3766879429124'
libwallet_merged.a not found - Building libwallet
Building libwallet release-static
cleaning up existing monero build dir, libs and includes
/home/buildbot/slave/monero-gui-win32/build/monero/build/release-static /home/buildbot/slave/monero-gui-win32/build /home/buildbot/slave/monero-gui-win32/build
Configuring build for MINGW32..
-- Found PythonInterp: C:/Python27/python.exe (found version "2.7.12") 
-- CMake version 3.12.4
-- The C compiler identification is GNU 7.4.0
-- The CXX compiler identification is GNU 7.4.0
-- Check for working C compiler: C:/msys32/mingw32/bin/i686-w64-mingw32-gcc.exe
-- Check for working C compiler: C:/msys32/mingw32/bin/i686-w64-mingw32-gcc.exe -- works
-- Detecting C compiler ABI info
-- Detecting C compiler ABI info - done
-- Detecting C compile features
-- Detecting C compile features - done
-- Check for working CXX compiler: C:/msys32/mingw32/bin/i686-w64-mingw32-g++.exe
-- Check for working CXX compiler: C:/msys32/mingw32/bin/i686-w64-mingw32-g++.exe -- works
-- Detecting CXX compiler ABI info
-- Detecting CXX compiler ABI info - done
-- Detecting CXX compile features
-- Detecting CXX compile features - done
-- The ASM compiler identification is GNU
-- Found assembler: C:/msys32/mingw32/bin/i686-w64-mingw32-gcc.exe
-- Building without build tag
-- Found Git: C:/msys32/usr/bin/git.exe (found version "2.20.1") 
-- Checking submodules
-- Submodule 'external/miniupnp' is up-to-date
-- Submodule 'external/unbound' is up-to-date
-- Submodule 'external/rapidjson' is up-to-date
-- Submodule 'external/trezor-common' is up-to-date
-- Submodule 'external/randomx' is up-to-date
-- Could not find DEVELOPER_LOCAL_TOOLS in env (not required)
-- BOOST_IGNORE_SYSTEM_PATHS defaults to OFF
-- Could not find DEVELOPER_LIBUNBOUND_OLD in env (not required)
-- Building for a 32-bit system
-- Building internal libraries as static
-- MSYS location: C:/msys32
-- Using LMDB as default DB type
-- looking for liblzma
-- liblzma found
-- Could not find libunwind (missing: LIBUNWIND_INCLUDE_DIR) 
-- Stack trace on exception disabled
-- Found OpenSSL: C:/msys32/mingw32/lib/libcrypto.a (found version "1.1.1a")  
-- Using OpenSSL include dir at C:/msys32/mingw32/include
-- Found HIDAPI: C:/msys32/mingw32/lib/libhidapi.a  
-- Looking for memset_s in c
-- Looking for memset_s in c - not found
-- Looking for explicit_bzero in c
-- Looking for explicit_bzero in c - not found
-- Looking for strptime
-- Looking for strptime - not found
-- Could NOT find MiniUPnPc (missing: MINIUPNP_INCLUDE_DIR MINIUPNP_LIBRARY) 
-- Using in-tree miniupnpc
-- Looking for libunbound
-- Looking for pthread.h
-- Looking for pthread.h - found
-- Looking for pthread_create
-- Looking for pthread_create - found
-- Found Threads: TRUE  
-- Looking for arpa/inet.h
-- Looking for arpa/inet.h - not found
-- Looking for endian.h
-- Looking for endian.h - not found
-- Looking for dlfcn.h
-- Looking for dlfcn.h - not found
-- Looking for event.h
-- Looking for event.h - not found
-- Looking for getopt.h
-- Looking for getopt.h - found
-- Looking for glob.h
-- Looking for glob.h - not found
-- Looking for grp.h
-- Looking for grp.h - not found
-- Looking for inttypes.h
-- Looking for inttypes.h - found
-- Looking for iphlpapi.h
-- Looking for iphlpapi.h - found
-- Looking for login_cap.h
-- Looking for login_cap.h - not found
-- Looking for memory.h
-- Looking for memory.h - found
-- Looking for netdb.h
-- Looking for netdb.h - not found
-- Looking for netinet/in.h
-- Looking for netinet/in.h - not found
-- Looking for pthread.h
-- Looking for pthread.h - found
-- Looking for pwd.h
-- Looking for pwd.h - not found
-- Looking for stdarg.h
-- Looking for stdarg.h - found
-- Looking for stdbool.h
-- Looking for stdbool.h - found
-- Looking for stdint.h
-- Looking for stdint.h - found
-- Looking for stdlib.h
-- Looking for stdlib.h - found
-- Looking for strings.h
-- Looking for strings.h - found
-- Looking for string.h
-- Looking for string.h - found
-- Looking for sys/param.h
-- Looking for sys/param.h - found
-- Looking for sys/resource.h
-- Looking for sys/resource.h - not found
-- Looking for sys/sha2.h
-- Looking for sys/sha2.h - not found
-- Looking for sys/socket.h
-- Looking for sys/socket.h - not found
-- Looking for sys/stat.h
-- Looking for sys/stat.h - found
-- Looking for sys/sysctl.h
-- Looking for sys/sysctl.h - not found
-- Looking for sys/types.h
-- Looking for sys/types.h - found
-- Looking for sys/uio.h
-- Looking for sys/uio.h - not found
-- Looking for sys/un.h
-- Looking for sys/un.h - not found
-- Looking for sys/wait.h
-- Looking for sys/wait.h - not found
-- Looking for syslog.h
-- Looking for syslog.h - not found
-- Looking for time.h
-- Looking for time.h - found
-- Looking for unistd.h
-- Looking for unistd.h - found
-- Looking for vfork.h
-- Looking for vfork.h - not found
-- Looking for windows.h
-- Looking for windows.h - found
-- Looking for winsock2.h
-- Looking for winsock2.h - found
-- Looking for ws2tcpip.h
-- Looking for ws2tcpip.h - found
-- Looking for _beginthreadex
-- Looking for _beginthreadex - found
-- Looking for arc4random
-- Looking for arc4random - not found
-- Looking for arc4random_uniform
-- Looking for arc4random_uniform - not found
-- Looking for chown
-- Looking for chown - not found
-- Looking for chroot
-- Looking for chroot - not found
-- Looking for ctime_r
-- Looking for ctime_r - not found
-- Looking for daemon
-- Looking for daemon - not found
-- Looking for endprotoent
-- Looking for endprotoent - not found
-- Looking for endservent
-- Looking for endservent - not found
-- Looking for fork
-- Looking for fork - not found
-- Looking for fseeko
-- Looking for fseeko - found
-- Looking for fsync
-- Looking for fsync - not found
-- Looking for getauxval
-- Looking for getauxval - not found
-- Looking for getentropy
-- Looking for getentropy - not found
-- Looking for getpwnam
-- Looking for getpwnam - not found
-- Looking for getrlimit
-- Looking for getrlimit - not found
-- Looking for glob
-- Looking for glob - not found
-- Looking for gmtime_r
-- Looking for gmtime_r - not found
-- Looking for fcntl
-- Looking for fcntl - not found
-- Looking for inet_aton
-- Looking for inet_aton - not found
-- Looking for inet_ntop
-- Looking for inet_ntop - not found
-- Looking for inet_pton
-- Looking for inet_pton - not found
-- Looking for initgroups
-- Looking for initgroups - not found
-- Looking for ioctlsocket
-- Looking for ioctlsocket - not found
-- Looking for isblank
-- Looking for isblank - found
-- Looking for kill
-- Looking for kill - not found
-- Looking for localtime_r
-- Looking for localtime_r - not found
-- Looking for malloc
-- Looking for malloc - found
-- Looking for memmove
-- Looking for memmove - found
-- Looking for random
-- Looking for random - not found
-- Looking for reallocarray
-- Looking for reallocarray - not found
-- Looking for recvmsg
-- Looking for recvmsg - not found
-- Looking for sbrk
-- Looking for sbrk - not found
-- Looking for sendmsg
-- Looking for sendmsg - not found
-- Looking for setregid
-- Looking for setregid - not found
-- Looking for setresgid
-- Looking for setresgid - not found
-- Looking for setresuid
-- Looking for setresuid - not found
-- Looking for setreuid
-- Looking for setreuid - not found
-- Looking for setrlimit
-- Looking for setrlimit - not found
-- Looking for setsid
-- Looking for setsid - not found
-- Looking for setusercontent
-- Looking for setusercontent - not found
-- Looking for sigprocmask
-- Looking for sigprocmask - not found
-- Looking for sleep
-- Looking for sleep - found
-- Looking for snprintf
-- Looking for snprintf - found
-- Looking for socketpair
-- Looking for socketpair - not found
-- Looking for srandom
-- Looking for srandom - not found
-- Looking for strsep
-- Looking for strsep - not found
-- Looking for strftime
-- Looking for strftime - found
-- Looking for strlcat
-- Looking for strlcat - not found
-- Looking for strlcpy
-- Looking for strlcpy - not found
-- Looking for strptime
-- Looking for strptime - not found
-- Looking for tzset
-- Looking for tzset - found
-- Looking for usleep
-- Looking for usleep - found
-- Looking for writev
-- Looking for writev - not found
-- Looking for getaddrinfo
-- Looking for getaddrinfo - found
-- Looking for stddef.h
CMake Warning (dev) at C:/msys32/mingw32/share/cmake-3.12/Modules/CheckIncludeFile.cmake:70 (message):
  Policy CMP0075 is not set: Include file check macros honor
  CMAKE_REQUIRED_LIBRARIES.  Run "cmake --help-policy CMP0075" for policy
  details.  Use the cmake_policy command to set the policy and suppress this
  warning.

  CMAKE_REQUIRED_LIBRARIES is set to:

    iphlpapi;ws2_32

  For compatibility with CMake 3.11 and below this check is ignoring it.
Call Stack (most recent call first):
  C:/msys32/mingw32/share/cmake-3.12/Modules/CheckTypeSize.cmake:227 (check_include_file)
  external/unbound/configure_checks.cmake:138 (check_type_size)
  external/unbound/CMakeLists.txt:35 (include)
This warning is for project developers.  Use -Wno-dev to suppress it.

-- Looking for stddef.h - found
-- Check size of time_t
-- Check size of time_t - done
-- Check size of gid_t
-- Check size of gid_t - failed
-- Check size of in_addr_t
-- Check size of in_addr_t - failed
-- Check size of in_port_t
-- Check size of in_port_t - failed
-- Check size of int16_t
-- Check size of int16_t - done
-- Check size of int32_t
-- Check size of int32_t - done
-- Check size of int64_t
-- Check size of int64_t - done
-- Check size of int8_t
-- Check size of int8_t - done
-- Check size of pid_t
-- Check size of pid_t - done
-- Check size of rlim_t
-- Check size of rlim_t - failed
-- Check size of ssize_t
-- Check size of ssize_t - done
-- Check size of uid_t
-- Check size of uid_t - failed
-- Check size of uint16_t
-- Check size of uint16_t - done
-- Check size of uint32_t
-- Check size of uint32_t - done
-- Check size of uint64_t
-- Check size of uint64_t - done
-- Check size of uint8_t
-- Check size of uint8_t - done
-- Looking for PTHREAD_PRIO_INHERIT
-- Looking for PTHREAD_PRIO_INHERIT - found
-- Looking for pthread_rwlock_t
-- Looking for pthread_rwlock_t - not found
-- Looking for pthread_spinlock_t
-- Looking for pthread_spinlock_t - not found
-- Looking for openssl/conf.h
-- Looking for openssl/conf.h - found
-- Looking for openssl/engine.h
-- Looking for openssl/engine.h - found
-- Looking for openssl/err.h
-- Looking for openssl/err.h - found
-- Looking for openssl/rand.h
-- Looking for openssl/rand.h - found
-- Looking for openssl/ssl.h
-- Looking for openssl/ssl.h - found
-- Looking for NID_secp384r1
-- Looking for NID_secp384r1 - found
-- Looking for NID_X9_62_prime256v1
-- Looking for NID_X9_62_prime256v1 - found
-- Looking for sk_SSL_COMP_pop_free
-- Looking for sk_SSL_COMP_pop_free - found
-- Looking for SSL_COMP_get_compression_methods
-- Looking for SSL_COMP_get_compression_methods - found
-- Looking for EVP_MD_CTX_new
-- Looking for EVP_MD_CTX_new - found
-- Looking for EVP_sha1
-- Looking for EVP_sha1 - found
-- Looking for EVP_sha256
-- Looking for EVP_sha256 - found
-- Looking for EVP_sha512
-- Looking for EVP_sha512 - found
-- Looking for FIPS_mode
-- Looking for FIPS_mode - found
-- Looking for HMAC_Update
-- Looking for HMAC_Update - found
-- Looking for OPENSSL_config
-- Looking for OPENSSL_config - found
-- Looking for SHA512_Update
-- Looking for SHA512_Update - found
-- Looking for LIBRESSL_VERSION_TEXT
-- Looking for LIBRESSL_VERSION_TEXT - not found
-- Using 32-bit LMDB from source tree
-- Looking for backtrace
-- Looking for backtrace - not found
-- Backtrace_LIBRARY: 
-- Could NOT find Backtrace (missing: Backtrace_LIBRARY Backtrace_INCLUDE_DIR) 
-- Performing Test HAVE_CXX_ATOMICS
-- Performing Test HAVE_CXX_ATOMICS - Success
-- Using HIDAPI include dir at C:/msys32/mingw32/include/hidapi
-- Could NOT find Protobuf (missing: Protobuf_LIBRARIES Protobuf_INCLUDE_DIR) 
-- Could NOT find Protobuf (missing: Protobuf_LIBRARIES Protobuf_INCLUDE_DIR) 
-- Could not find Protobuf
-- Building on x86 for i686
-- AES support enabled
-- Performing Test _Wformat_c
-- Performing Test _Wformat_c - Success
-- Performing Test _Wformat_cxx
-- Performing Test _Wformat_cxx - Success
-- Performing Test _Wformat_security_c
-- Performing Test _Wformat_security_c - Success
-- Performing Test _Wformat_security_cxx
-- Performing Test _Wformat_security_cxx - Success
-- Performing Test _mmitigate_rop_c
-- Performing Test _mmitigate_rop_c - Success
-- Performing Test _mmitigate_rop_cxx
-- Performing Test _mmitigate_rop_cxx - Success
-- Looking for -Wl,-z,relro linker flag
-- Looking for -Wl,-z,relro linker flag - not found
-- Looking for -Wl,-z,now linker flag
-- Looking for -Wl,-z,now linker flag - not found
-- Looking for -Wl,-z,noexecstack linker flag
-- Looking for -Wl,-z,noexecstack linker flag - not found
-- Looking for -Wl,-z,noexecheap linker flag
-- Looking for -Wl,-z,noexecheap linker flag - not found
-- Looking for -Wl,--dynamicbase linker flag
-- Looking for -Wl,--dynamicbase linker flag - found
-- Looking for -Wl,--nxcompat linker flag
-- Looking for -Wl,--nxcompat linker flag - found
-- Looking for -Wl,--high-entropy-va linker flag
-- Looking for -Wl,--high-entropy-va linker flag - not found
-- Using C security hardening flags:  -U_FORTIFY_SOURCE -D_FORTIFY_SOURCE=1 -Wformat -Wformat-security -mmitigate-rop
-- Using C++ security hardening flags:  -U_FORTIFY_SOURCE -D_FORTIFY_SOURCE=1 -Wformat -Wformat-security -mmitigate-rop
-- Using linker security hardening flags:  -Wl,--dynamicbase -Wl,--nxcompat
-- [ C:/msys32/mingw32/share/cmake-3.12/Modules/FindBoost.cmake:1125 ] _boost_TEST_VERSIONS = 1.68.0;1.68;1.67.0;1.67;1.66.0;1.66;1.65.1;1.65.0;1.65;1.64.0;1.64;1.63.0;1.63;1.62.0;1.62;1.61.0;1.61;1.60.0;1.60;1.59.0;1.59;1.58.0;1.58
-- [ C:/msys32/mingw32/share/cmake-3.12/Modules/FindBoost.cmake:1127 ] Boost_USE_MULTITHREADED = TRUE
-- [ C:/msys32/mingw32/share/cmake-3.12/Modules/FindBoost.cmake:1129 ] Boost_USE_STATIC_LIBS = ON
-- [ C:/msys32/mingw32/share/cmake-3.12/Modules/FindBoost.cmake:1131 ] Boost_USE_STATIC_RUNTIME = ON
-- [ C:/msys32/mingw32/share/cmake-3.12/Modules/FindBoost.cmake:1133 ] Boost_ADDITIONAL_VERSIONS = 
-- [ C:/msys32/mingw32/share/cmake-3.12/Modules/FindBoost.cmake:1135 ] Boost_NO_SYSTEM_PATHS = 
-- [ C:/msys32/mingw32/share/cmake-3.12/Modules/FindBoost.cmake:1203 ] Declared as CMake or Environmental Variables:
-- [ C:/msys32/mingw32/share/cmake-3.12/Modules/FindBoost.cmake:1205 ]   BOOST_ROOT = C:/msys32/mingw32/boost
-- [ C:/msys32/mingw32/share/cmake-3.12/Modules/FindBoost.cmake:1207 ]   BOOST_INCLUDEDIR = 
-- [ C:/msys32/mingw32/share/cmake-3.12/Modules/FindBoost.cmake:1209 ]   BOOST_LIBRARYDIR = 
-- [ C:/msys32/mingw32/share/cmake-3.12/Modules/FindBoost.cmake:1211 ] _boost_TEST_VERSIONS = 1.68.0;1.68;1.67.0;1.67;1.66.0;1.66;1.65.1;1.65.0;1.65;1.64.0;1.64;1.63.0;1.63;1.62.0;1.62;1.61.0;1.61;1.60.0;1.60;1.59.0;1.59;1.58.0;1.58
-- [ C:/msys32/mingw32/share/cmake-3.12/Modules/FindBoost.cmake:1286 ] Include debugging info:
-- [ C:/msys32/mingw32/share/cmake-3.12/Modules/FindBoost.cmake:1288 ]   _boost_INCLUDE_SEARCH_DIRS = C:/msys32/mingw32/boost/include;C:/msys32/mingw32/boost;PATHS;C:/boost/include;C:/boost;/sw/local/include
-- [ C:/msys32/mingw32/share/cmake-3.12/Modules/FindBoost.cmake:1290 ]   _boost_PATH_SUFFIXES = boost-1_68_0;boost_1_68_0;boost/boost-1_68_0;boost/boost_1_68_0;boost-1_68;boost_1_68;boost/boost-1_68;boost/boost_1_68;boost-1_67_0;boost_1_67_0;boost/boost-1_67_0;boost/boost_1_67_0;boost-1_67;boost_1_67;boost/boost-1_67;boost/boost_1_67;boost-1_66_0;boost_1_66_0;boost/boost-1_66_0;boost/boost_1_66_0;boost-1_66;boost_1_66;boost/boost-1_66;boost/boost_1_66;boost-1_65_1;boost_1_65_1;boost/boost-1_65_1;boost/boost_1_65_1;boost-1_65_0;boost_1_65_0;boost/boost-1_65_0;boost/boost_1_65_0;boost-1_65;boost_1_65;boost/boost-1_65;boost/boost_1_65;boost-1_64_0;boost_1_64_0;boost/boost-1_64_0;boost/boost_1_64_0;boost-1_64;boost_1_64;boost/boost-1_64;boost/boost_1_64;boost-1_63_0;boost_1_63_0;boost/boost-1_63_0;boost/boost_1_63_0;boost-1_63;boost_1_63;boost/boost-1_63;boost/boost_1_63;boost-1_62_0;boost_1_62_0;boost/boost-1_62_0;boost/boost_1_62_0;boost-1_62;boost_1_62;boost/boost-1_62;boost/boost_1_62;boost-1_61_0;boost_1_61_0;boost/boost-1_61_0;boost/boost_1_61_0;boost-1_61;boost_1_61;boost/boost-1_61;boost/boost_1_61;boost-1_60_0;boost_1_60_0;boost/boost-1_60_0;boost/boost_1_60_0;boost-1_60;boost_1_60;boost/boost-1_60;boost/boost_1_60;boost-1_59_0;boost_1_59_0;boost/boost-1_59_0;boost/boost_1_59_0;boost-1_59;boost_1_59;boost/boost-1_59;boost/boost_1_59;boost-1_58_0;boost_1_58_0;boost/boost-1_58_0;boost/boost_1_58_0;boost-1_58;boost_1_58;boost/boost-1_58;boost/boost_1_58
-- [ C:/msys32/mingw32/share/cmake-3.12/Modules/FindBoost.cmake:1310 ] location of version.hpp: C:/msys32/mingw32/include/boost/version.hpp
-- [ C:/msys32/mingw32/share/cmake-3.12/Modules/FindBoost.cmake:1334 ] version.hpp reveals boost 1.69.0
-- [ C:/msys32/mingw32/share/cmake-3.12/Modules/FindBoost.cmake:1420 ] guessed _boost_COMPILER = -mgw74
-- [ C:/msys32/mingw32/share/cmake-3.12/Modules/FindBoost.cmake:1430 ] _boost_MULTITHREADED = -mt
-- [ C:/msys32/mingw32/share/cmake-3.12/Modules/FindBoost.cmake:1506 ] _boost_RELEASE_ABI_TAG = -s
-- [ C:/msys32/mingw32/share/cmake-3.12/Modules/FindBoost.cmake:1508 ] _boost_DEBUG_ABI_TAG = -sd
-- [ C:/msys32/mingw32/share/cmake-3.12/Modules/FindBoost.cmake:1571 ] _boost_LIBRARY_SEARCH_DIRS_RELEASE = C:/msys32/mingw32/boost/lib;C:/msys32/mingw32/boost/stage/lib;C:/msys32/mingw32/include/lib;C:/msys32/mingw32/include/../lib;C:/msys32/mingw32/include/stage/lib;PATHS;C:/boost/lib;C:/boost;/sw/local/lib_boost_LIBRARY_SEARCH_DIRS_DEBUG   = C:/msys32/mingw32/boost/lib;C:/msys32/mingw32/boost/stage/lib;C:/msys32/mingw32/include/lib;C:/msys32/mingw32/include/../lib;C:/msys32/mingw32/include/stage/lib;PATHS;C:/boost/lib;C:/boost;/sw/local/lib
CMake Warning at C:/msys32/mingw32/share/cmake-3.12/Modules/FindBoost.cmake:847 (message):
  New Boost version may have incorrect or missing dependencies and imported
  targets
Call Stack (most recent call first):
  C:/msys32/mingw32/share/cmake-3.12/Modules/FindBoost.cmake:963 (_Boost_COMPONENT_DEPENDENCIES)
  C:/msys32/mingw32/share/cmake-3.12/Modules/FindBoost.cmake:1622 (_Boost_MISSING_DEPENDENCIES)
  CMakeLists.txt:856 (find_package)


CMake Warning at C:/msys32/mingw32/share/cmake-3.12/Modules/FindBoost.cmake:847 (message):
  New Boost version may have incorrect or missing dependencies and imported
  targets
Call Stack (most recent call first):
  C:/msys32/mingw32/share/cmake-3.12/Modules/FindBoost.cmake:963 (_Boost_COMPONENT_DEPENDENCIES)
  C:/msys32/mingw32/share/cmake-3.12/Modules/FindBoost.cmake:1622 (_Boost_MISSING_DEPENDENCIES)
  CMakeLists.txt:856 (find_package)


CMake Warning at C:/msys32/mingw32/share/cmake-3.12/Modules/FindBoost.cmake:847 (message):
  New Boost version may have incorrect or missing dependencies and imported
  targets
Call Stack (most recent call first):
  C:/msys32/mingw32/share/cmake-3.12/Modules/FindBoost.cmake:963 (_Boost_COMPONENT_DEPENDENCIES)
  C:/msys32/mingw32/share/cmake-3.12/Modules/FindBoost.cmake:1622 (_Boost_MISSING_DEPENDENCIES)
  CMakeLists.txt:856 (find_package)


CMake Warning at C:/msys32/mingw32/share/cmake-3.12/Modules/FindBoost.cmake:847 (message):
  New Boost version may have incorrect or missing dependencies and imported
  targets
Call Stack (most recent call first):
  C:/msys32/mingw32/share/cmake-3.12/Modules/FindBoost.cmake:963 (_Boost_COMPONENT_DEPENDENCIES)
  C:/msys32/mingw32/share/cmake-3.12/Modules/FindBoost.cmake:1622 (_Boost_MISSING_DEPENDENCIES)
  CMakeLists.txt:856 (find_package)


CMake Warning at C:/msys32/mingw32/share/cmake-3.12/Modules/FindBoost.cmake:847 (message):
  New Boost version may have incorrect or missing dependencies and imported
  targets
Call Stack (most recent call first):
  C:/msys32/mingw32/share/cmake-3.12/Modules/FindBoost.cmake:963 (_Boost_COMPONENT_DEPENDENCIES)
  C:/msys32/mingw32/share/cmake-3.12/Modules/FindBoost.cmake:1622 (_Boost_MISSING_DEPENDENCIES)
  CMakeLists.txt:856 (find_package)


CMake Warning at C:/msys32/mingw32/share/cmake-3.12/Modules/FindBoost.cmake:847 (message):
  New Boost version may have incorrect or missing dependencies and imported
  targets
Call Stack (most recent call first):
  C:/msys32/mingw32/share/cmake-3.12/Modules/FindBoost.cmake:963 (_Boost_COMPONENT_DEPENDENCIES)
  C:/msys32/mingw32/share/cmake-3.12/Modules/FindBoost.cmake:1622 (_Boost_MISSING_DEPENDENCIES)
  CMakeLists.txt:856 (find_package)


CMake Warning at C:/msys32/mingw32/share/cmake-3.12/Modules/FindBoost.cmake:847 (message):
  New Boost version may have incorrect or missing dependencies and imported
  targets
Call Stack (most recent call first):
  C:/msys32/mingw32/share/cmake-3.12/Modules/FindBoost.cmake:963 (_Boost_COMPONENT_DEPENDENCIES)
  C:/msys32/mingw32/share/cmake-3.12/Modules/FindBoost.cmake:1622 (_Boost_MISSING_DEPENDENCIES)
  CMakeLists.txt:856 (find_package)


CMake Warning at C:/msys32/mingw32/share/cmake-3.12/Modules/FindBoost.cmake:847 (message):
  New Boost version may have incorrect or missing dependencies and imported
  targets
Call Stack (most recent call first):
  C:/msys32/mingw32/share/cmake-3.12/Modules/FindBoost.cmake:963 (_Boost_COMPONENT_DEPENDENCIES)
  C:/msys32/mingw32/share/cmake-3.12/Modules/FindBoost.cmake:1622 (_Boost_MISSING_DEPENDENCIES)
  CMakeLists.txt:856 (find_package)


CMake Warning at C:/msys32/mingw32/share/cmake-3.12/Modules/FindBoost.cmake:847 (message):
  New Boost version may have incorrect or missing dependencies and imported
  targets
Call Stack (most recent call first):
  C:/msys32/mingw32/share/cmake-3.12/Modules/FindBoost.cmake:963 (_Boost_COMPONENT_DEPENDENCIES)
  C:/msys32/mingw32/share/cmake-3.12/Modules/FindBoost.cmake:1622 (_Boost_MISSING_DEPENDENCIES)
  CMakeLists.txt:856 (find_package)


CMake Warning at C:/msys32/mingw32/share/cmake-3.12/Modules/FindBoost.cmake:847 (message):
  New Boost version may have incorrect or missing dependencies and imported
-- [ C:/msys32/mingw32/share/cmake-3.12/Modules/FindBoost.cmake:1760 ] Searching for SYSTEM_LIBRARY_RELEASE: libboost_system-mgw74-mt-s-1_69;libboost_system-mgw74-mt-s;libboost_system-mt-s-1_69;libboost_system-mt-s;libboost_system
-- [ C:/msys32/mingw32/share/cmake-3.12/Modules/FindBoost.cmake:1813 ] Searching for SYSTEM_LIBRARY_DEBUG: libboost_system-mgw74-mt-sd-1_69;libboost_system-mgw74-mt-sd;libboost_system-mt-sd-1_69;libboost_system-mt-sd;libboost_system-mt;libboost_system
-- [ C:/msys32/mingw32/share/cmake-3.12/Modules/FindBoost.cmake:400 ]  Boost_LIBRARY_DIR_DEBUG = C:/msys32/mingw32/lib _boost_LIBRARY_SEARCH_DIRS_DEBUG = C:/msys32/mingw32/lib;NO_DEFAULT_PATH;NO_CMAKE_FIND_ROOT_PATH
-- [ C:/msys32/mingw32/share/cmake-3.12/Modules/FindBoost.cmake:1760 ] Searching for FILESYSTEM_LIBRARY_RELEASE: libboost_filesystem-mgw74-mt-s-1_69;libboost_filesystem-mgw74-mt-s;libboost_filesystem-mt-s-1_69;libboost_filesystem-mt-s;libboost_filesystem
-- [ C:/msys32/mingw32/share/cmake-3.12/Modules/FindBoost.cmake:1813 ] Searching for FILESYSTEM_LIBRARY_DEBUG: libboost_filesystem-mgw74-mt-sd-1_69;libboost_filesystem-mgw74-mt-sd;libboost_filesystem-mt-sd-1_69;libboost_filesystem-mt-sd;libboost_filesystem-mt;libboost_filesystem
-- [ C:/msys32/mingw32/share/cmake-3.12/Modules/FindBoost.cmake:400 ]  Boost_LIBRARY_DIR_DEBUG = C:/msys32/mingw32/lib _boost_LIBRARY_SEARCH_DIRS_DEBUG = C:/msys32/mingw32/lib;NO_DEFAULT_PATH;NO_CMAKE_FIND_ROOT_PATH
-- [ C:/msys32/mingw32/share/cmake-3.12/Modules/FindBoost.cmake:1760 ] Searching for THREAD_LIBRARY_RELEASE: libboost_thread_win32-mgw74-mt-s-1_69;libboost_thread_win32-mgw74-mt-s;libboost_thread_win32-mt-s-1_69;libboost_thread_win32-mt-s;libboost_thread_win32;libboost_thread-mgw74-mt-s-1_69;libboost_thread-mgw74-mt-s;libboost_thread-mt-s-1_69;libboost_thread-mt-s;libboost_thread
-- [ C:/msys32/mingw32/share/cmake-3.12/Modules/FindBoost.cmake:1813 ] Searching for THREAD_LIBRARY_DEBUG: libboost_thread_win32-mgw74-mt-sd-1_69;libboost_thread_win32-mgw74-mt-sd;libboost_thread_win32-mt-sd-1_69;libboost_thread_win32-mt-sd;libboost_thread_win32-mt;libboost_thread_win32;libboost_thread-mgw74-mt-sd-1_69;libboost_thread-mgw74-mt-sd;libboost_thread-mt-sd-1_69;libboost_thread-mt-sd;libboost_thread-mt;libboost_thread
-- [ C:/msys32/mingw32/share/cmake-3.12/Modules/FindBoost.cmake:400 ]  Boost_LIBRARY_DIR_DEBUG = C:/msys32/mingw32/lib _boost_LIBRARY_SEARCH_DIRS_DEBUG = C:/msys32/mingw32/lib;NO_DEFAULT_PATH;NO_CMAKE_FIND_ROOT_PATH
-- [ C:/msys32/mingw32/share/cmake-3.12/Modules/FindBoost.cmake:1760 ] Searching for DATE_TIME_LIBRARY_RELEASE: libboost_date_time-mgw74-mt-s-1_69;libboost_date_time-mgw74-mt-s;libboost_date_time-mt-s-1_69;libboost_date_time-mt-s;libboost_date_time
  targets
Call Stack (most recent call first):
  C:/msys32/mingw32/share/cmake-3.12/Modules/FindBoost.cmake:963 (_Boost_COMPONENT_DEPENDENCIES)
  C:/msys32/mingw32/share/cmake-3.12/Modules/FindBoost.cmake:1622 (_Boost_MISSING_DEPENDENCIES)
  CMakeLists.txt:856 (find_package)


-- [ C:/msys32/mingw32/share/cmake-3.12/Modules/FindBoost.cmake:1813 ] Searching for DATE_TIME_LIBRARY_DEBUG: libboost_date_time-mgw74-mt-sd-1_69;libboost_date_time-mgw74-mt-sd;libboost_date_time-mt-sd-1_69;libboost_date_time-mt-sd;libboost_date_time-mt;libboost_date_time
-- [ C:/msys32/mingw32/share/cmake-3.12/Modules/FindBoost.cmake:400 ]  Boost_LIBRARY_DIR_DEBUG = C:/msys32/mingw32/lib _boost_LIBRARY_SEARCH_DIRS_DEBUG = C:/msys32/mingw32/lib;NO_DEFAULT_PATH;NO_CMAKE_FIND_ROOT_PATH
-- [ C:/msys32/mingw32/share/cmake-3.12/Modules/FindBoost.cmake:1760 ] Searching for CHRONO_LIBRARY_RELEASE: libboost_chrono-mgw74-mt-s-1_69;libboost_chrono-mgw74-mt-s;libboost_chrono-mt-s-1_69;libboost_chrono-mt-s;libboost_chrono
-- [ C:/msys32/mingw32/share/cmake-3.12/Modules/FindBoost.cmake:1813 ] Searching for CHRONO_LIBRARY_DEBUG: libboost_chrono-mgw74-mt-sd-1_69;libboost_chrono-mgw74-mt-sd;libboost_chrono-mt-sd-1_69;libboost_chrono-mt-sd;libboost_chrono-mt;libboost_chrono
-- [ C:/msys32/mingw32/share/cmake-3.12/Modules/FindBoost.cmake:400 ]  Boost_LIBRARY_DIR_DEBUG = C:/msys32/mingw32/lib _boost_LIBRARY_SEARCH_DIRS_DEBUG = C:/msys32/mingw32/lib;NO_DEFAULT_PATH;NO_CMAKE_FIND_ROOT_PATH
-- [ C:/msys32/mingw32/share/cmake-3.12/Modules/FindBoost.cmake:1760 ] Searching for REGEX_LIBRARY_RELEASE: libboost_regex-mgw74-mt-s-1_69;libboost_regex-mgw74-mt-s;libboost_regex-mt-s-1_69;libboost_regex-mt-s;libboost_regex
-- [ C:/msys32/mingw32/share/cmake-3.12/Modules/FindBoost.cmake:1813 ] Searching for REGEX_LIBRARY_DEBUG: libboost_regex-mgw74-mt-sd-1_69;libboost_regex-mgw74-mt-sd;libboost_regex-mt-sd-1_69;libboost_regex-mt-sd;libboost_regex-mt;libboost_regex
-- [ C:/msys32/mingw32/share/cmake-3.12/Modules/FindBoost.cmake:400 ]  Boost_LIBRARY_DIR_DEBUG = C:/msys32/mingw32/lib _boost_LIBRARY_SEARCH_DIRS_DEBUG = C:/msys32/mingw32/lib;NO_DEFAULT_PATH;NO_CMAKE_FIND_ROOT_PATH
-- [ C:/msys32/mingw32/share/cmake-3.12/Modules/FindBoost.cmake:1760 ] Searching for SERIALIZATION_LIBRARY_RELEASE: libboost_serialization-mgw74-mt-s-1_69;libboost_serialization-mgw74-mt-s;libboost_serialization-mt-s-1_69;libboost_serialization-mt-s;libboost_serialization
-- [ C:/msys32/mingw32/share/cmake-3.12/Modules/FindBoost.cmake:1813 ] Searching for SERIALIZATION_LIBRARY_DEBUG: libboost_serialization-mgw74-mt-sd-1_69;libboost_serialization-mgw74-mt-sd;libboost_serialization-mt-sd-1_69;libboost_serialization-mt-sd;libboost_serialization-mt;libboost_serialization
-- [ C:/msys32/mingw32/share/cmake-3.12/Modules/FindBoost.cmake:400 ]  Boost_LIBRARY_DIR_DEBUG = C:/msys32/mingw32/lib _boost_LIBRARY_SEARCH_DIRS_DEBUG = C:/msys32/mingw32/lib;NO_DEFAULT_PATH;NO_CMAKE_FIND_ROOT_PATH
-- [ C:/msys32/mingw32/share/cmake-3.12/Modules/FindBoost.cmake:1760 ] Searching for PROGRAM_OPTIONS_LIBRARY_RELEASE: libboost_program_options-mgw74-mt-s-1_69;libboost_program_options-mgw74-mt-s;libboost_program_options-mt-s-1_69;libboost_program_options-mt-s;libboost_program_options
-- [ C:/msys32/mingw32/share/cmake-3.12/Modules/FindBoost.cmake:1813 ] Searching for PROGRAM_OPTIONS_LIBRARY_DEBUG: libboost_program_options-mgw74-mt-sd-1_69;libboost_program_options-mgw74-mt-sd;libboost_program_options-mt-sd-1_69;libboost_program_options-mt-sd;libboost_program_options-mt;libboost_program_options
-- [ C:/msys32/mingw32/share/cmake-3.12/Modules/FindBoost.cmake:400 ]  Boost_LIBRARY_DIR_DEBUG = C:/msys32/mingw32/lib _boost_LIBRARY_SEARCH_DIRS_DEBUG = C:/msys32/mingw32/lib;NO_DEFAULT_PATH;NO_CMAKE_FIND_ROOT_PATH
-- [ C:/msys32/mingw32/share/cmake-3.12/Modules/FindBoost.cmake:1760 ] Searching for LOCALE_LIBRARY_RELEASE: libboost_locale-mgw74-mt-s-1_69;libboost_locale-mgw74-mt-s;libboost_locale-mt-s-1_69;libboost_locale-mt-s;libboost_locale
-- [ C:/msys32/mingw32/share/cmake-3.12/Modules/FindBoost.cmake:1813 ] Searching for LOCALE_LIBRARY_DEBUG: libboost_locale-mgw74-mt-sd-1_69;libboost_locale-mgw74-mt-sd;libboost_locale-mt-sd-1_69;libboost_locale-mt-sd;libboost_locale-mt;libboost_locale
-- [ C:/msys32/mingw32/share/cmake-3.12/Modules/FindBoost.cmake:400 ]  Boost_LIBRARY_DIR_DEBUG = C:/msys32/mingw32/lib _boost_LIBRARY_SEARCH_DIRS_DEBUG = C:/msys32/mingw32/lib;NO_DEFAULT_PATH;NO_CMAKE_FIND_ROOT_PATH
-- [ C:/msys32/mingw32/share/cmake-3.12/Modules/FindBoost.cmake:1760 ] Searching for ATOMIC_LIBRARY_RELEASE: libboost_atomic-mgw74-mt-s-1_69;libboost_atomic-mgw74-mt-s;libboost_atomic-mt-s-1_69;libboost_atomic-mt-s;libboost_atomic
-- [ C:/msys32/mingw32/share/cmake-3.12/Modules/FindBoost.cmake:1813 ] Searching for ATOMIC_LIBRARY_DEBUG: libboost_atomic-mgw74-mt-sd-1_69;libboost_atomic-mgw74-mt-sd;libboost_atomic-mt-sd-1_69;libboost_atomic-mt-sd;libboost_atomic-mt;libboost_atomic
-- [ C:/msys32/mingw32/share/cmake-3.12/Modules/FindBoost.cmake:400 ]  Boost_LIBRARY_DIR_DEBUG = C:/msys32/mingw32/lib _boost_LIBRARY_SEARCH_DIRS_DEBUG = C:/msys32/mingw32/lib;NO_DEFAULT_PATH;NO_CMAKE_FIND_ROOT_PATH
-- [ C:/msys32/mingw32/share/cmake-3.12/Modules/FindBoost.cmake:1887 ] Boost_FOUND = 1
-- Found Boost Version: 106900
-- Could NOT find Readline (missing: Readline_INCLUDE_DIR) 
-- Looking for rl_copy_text
-- Looking for rl_copy_text - not found
-- Looking for rl_filename_completion_function
-- Looking for rl_filename_completion_function - not found
-- Looking for rl_copy_text
-- Looking for rl_copy_text - found
-- Looking for rl_filename_completion_function
-- Looking for rl_filename_completion_function - found
-- Could not find GNU readline library so building without readline support
-- Found Git: C:/msys32/usr/bin/git.exe
-- You are currently on commit 6def88ad4
-- The most recent tag was at 6def88ad
-- You are ahead of or behind a tagged release
-- Trezor support disabled
-- Not building tests
-- Not building debug utilities
Doxygen: graphviz not found - graphs disabled
-- Found Doxygen: C:/msys32/usr/bin/doxygen.exe (found version "1.8.15") found components:  doxygen missing components:  dot
-- Performing Test HAVE_C11
-- Performing Test HAVE_C11 - Success
-- Configuring done
-- Generating done
-- Build files have been written to: C:/msys32/home/buildbot/slave/monero-gui-win32/build/monero/build/release-static
/home/buildbot/slave/monero-gui-win32/build/monero/build/release-static/src/wallet /home/buildbot/slave/monero-gui-win32/build/monero/build/release-static /home/buildbot/slave/monero-gui-win32/build /home/buildbot/slave/monero-gui-win32/build
mingw32-make: Entering directory 'C:/msys32/home/buildbot/slave/monero-gui-win32/build/monero/build/release-static'
mingw32-make[1]: Entering directory 'C:/msys32/home/buildbot/slave/monero-gui-win32/build/monero/build/release-static'
mingw32-make[2]: Entering directory 'C:/msys32/home/buildbot/slave/monero-gui-win32/build/monero/build/release-static'
mingw32-make[3]: Entering directory 'C:/msys32/home/buildbot/slave/monero-gui-win32/build/monero/build/release-static'
Scanning dependencies of target genversion
mingw32-make[3]: Leaving directory 'C:/msys32/home/buildbot/slave/monero-gui-win32/build/monero/build/release-static'
Built target genversion
mingw32-make[3]: Entering directory 'C:/msys32/home/buildbot/slave/monero-gui-win32/build/monero/build/release-static'
Scanning dependencies of target obj_version
mingw32-make[3]: Leaving directory 'C:/msys32/home/buildbot/slave/monero-gui-win32/build/monero/build/release-static'
mingw32-make[3]: Entering directory 'C:/msys32/home/buildbot/slave/monero-gui-win32/build/monero/build/release-static'
Building CXX object src/CMakeFiles/obj_version.dir/__/version.cpp.obj
mingw32-make[3]: Leaving directory 'C:/msys32/home/buildbot/slave/monero-gui-win32/build/monero/build/release-static'
Built target obj_version
mingw32-make[3]: Entering directory 'C:/msys32/home/buildbot/slave/monero-gui-win32/build/monero/build/release-static'
Scanning dependencies of target version
mingw32-make[3]: Leaving directory 'C:/msys32/home/buildbot/slave/monero-gui-win32/build/monero/build/release-static'
mingw32-make[3]: Entering directory 'C:/msys32/home/buildbot/slave/monero-gui-win32/build/monero/build/release-static'
Linking CXX static library libversion.a
mingw32-make[3]: Leaving directory 'C:/msys32/home/buildbot/slave/monero-gui-win32/build/monero/build/release-static'
Built target version
mingw32-make[2]: Leaving directory 'C:/msys32/home/buildbot/slave/monero-gui-win32/build/monero/build/release-static'
mingw32-make[1]: Leaving directory 'C:/msys32/home/buildbot/slave/monero-gui-win32/build/monero/build/release-static'
mingw32-make: Leaving directory 'C:/msys32/home/buildbot/slave/monero-gui-win32/build/monero/build/release-static'
[  1%] Generating generated_stagenet_blocks.c
[  1%] Generating generated_checkpoints.c
[  1%] Generating generated_testnet_blocks.c
Scanning dependencies of target blocks
[  1%] Building CXX object src/blocks/CMakeFiles/blocks.dir/blocks.cpp.obj
[  1%] Building C object src/blocks/CMakeFiles/blocks.dir/generated_checkpoints.c.obj
[  2%] Building C object src/blocks/CMakeFiles/blocks.dir/generated_testnet_blocks.c.obj
[  2%] Building C object src/blocks/CMakeFiles/blocks.dir/generated_stagenet_blocks.c.obj
[  2%] Linking CXX static library libblocks.a
[  2%] Built target blocks
Scanning dependencies of target unbound
[  2%] Building C object external/unbound/CMakeFiles/unbound.dir/services/authzone.c.obj
[  4%] Building C object external/unbound/CMakeFiles/unbound.dir/services/cache/dns.c.obj
[  4%] Building C object external/unbound/CMakeFiles/unbound.dir/services/cache/infra.c.obj
[  4%] Building C object external/unbound/CMakeFiles/unbound.dir/services/cache/rrset.c.obj
[  4%] Building C object external/unbound/CMakeFiles/unbound.dir/util/data/dname.c.obj
[  5%] Building C object external/unbound/CMakeFiles/unbound.dir/util/data/msgencode.c.obj
[  5%] Building C object external/unbound/CMakeFiles/unbound.dir/util/data/msgparse.c.obj
[  5%] Building C object external/unbound/CMakeFiles/unbound.dir/util/data/msgreply.c.obj
[  5%] Building C object external/unbound/CMakeFiles/unbound.dir/util/data/packed_rrset.c.obj
[  6%] Building C object external/unbound/CMakeFiles/unbound.dir/iterator/iterator.c.obj
[  6%] Building C object external/unbound/CMakeFiles/unbound.dir/iterator/iter_delegpt.c.obj
[  6%] Building C object external/unbound/CMakeFiles/unbound.dir/iterator/iter_donotq.c.obj
[  8%] Building C object external/unbound/CMakeFiles/unbound.dir/iterator/iter_fwd.c.obj
[  8%] Building C object external/unbound/CMakeFiles/unbound.dir/iterator/iter_hints.c.obj
[  8%] Building C object external/unbound/CMakeFiles/unbound.dir/iterator/iter_priv.c.obj
[  8%] Building C object external/unbound/CMakeFiles/unbound.dir/iterator/iter_resptype.c.obj
[  9%] Building C object external/unbound/CMakeFiles/unbound.dir/iterator/iter_scrub.c.obj
[  9%] Building C object external/unbound/CMakeFiles/unbound.dir/iterator/iter_utils.c.obj
[  9%] Building C object external/unbound/CMakeFiles/unbound.dir/respip/respip.c.obj
[ 10%] Building C object external/unbound/CMakeFiles/unbound.dir/services/listen_dnsport.c.obj
[ 10%] Building C object external/unbound/CMakeFiles/unbound.dir/services/localzone.c.obj
[ 10%] Building C object external/unbound/CMakeFiles/unbound.dir/services/mesh.c.obj
[ 10%] Building C object external/unbound/CMakeFiles/unbound.dir/services/modstack.c.obj
[ 12%] Building C object external/unbound/CMakeFiles/unbound.dir/services/outbound_list.c.obj
[ 12%] Building C object external/unbound/CMakeFiles/unbound.dir/services/outside_network.c.obj
[ 12%] Building C object external/unbound/CMakeFiles/unbound.dir/services/view.c.obj
[ 13%] Building C object external/unbound/CMakeFiles/unbound.dir/util/alloc.c.obj
[ 13%] Building C object external/unbound/CMakeFiles/unbound.dir/util/as112.c.obj
[ 13%] Building C object external/unbound/CMakeFiles/unbound.dir/util/config_file.c.obj
[ 13%] Building C object external/unbound/CMakeFiles/unbound.dir/util/configlexer.c.obj
[ 14%] Building C object external/unbound/CMakeFiles/unbound.dir/util/configparser.c.obj
[ 14%] Building C object external/unbound/CMakeFiles/unbound.dir/util/fptr_wlist.c.obj
[ 14%] Building C object external/unbound/CMakeFiles/unbound.dir/util/locks.c.obj
[ 14%] Building C object external/unbound/CMakeFiles/unbound.dir/util/log.c.obj
[ 16%] Building C object external/unbound/CMakeFiles/unbound.dir/util/mini_event.c.obj
[ 16%] Building C object external/unbound/CMakeFiles/unbound.dir/util/module.c.obj
[ 16%] Building C object external/unbound/CMakeFiles/unbound.dir/util/netevent.c.obj
[ 17%] Building C object external/unbound/CMakeFiles/unbound.dir/util/net_help.c.obj
[ 17%] Building C object external/unbound/CMakeFiles/unbound.dir/util/random.c.obj
[ 17%] Building C object external/unbound/CMakeFiles/unbound.dir/util/rbtree.c.obj
[ 17%] Building C object external/unbound/CMakeFiles/unbound.dir/util/regional.c.obj
[ 18%] Building C object external/unbound/CMakeFiles/unbound.dir/util/rtt.c.obj
[ 18%] Building C object external/unbound/CMakeFiles/unbound.dir/util/storage/dnstree.c.obj
[ 18%] Building C object external/unbound/CMakeFiles/unbound.dir/util/storage/lookup3.c.obj
[ 20%] Building C object external/unbound/CMakeFiles/unbound.dir/util/storage/lruhash.c.obj
[ 20%] Building C object external/unbound/CMakeFiles/unbound.dir/util/storage/slabhash.c.obj
[ 20%] Building C object external/unbound/CMakeFiles/unbound.dir/util/timehist.c.obj
[ 20%] Building C object external/unbound/CMakeFiles/unbound.dir/util/tube.c.obj
[ 21%] Building C object external/unbound/CMakeFiles/unbound.dir/util/ub_event.c.obj
[ 21%] Building C object external/unbound/CMakeFiles/unbound.dir/util/winsock_event.c.obj
[ 21%] Building C object external/unbound/CMakeFiles/unbound.dir/validator/autotrust.c.obj
[ 21%] Building C object external/unbound/CMakeFiles/unbound.dir/validator/val_anchor.c.obj
[ 22%] Building C object external/unbound/CMakeFiles/unbound.dir/validator/validator.c.obj
[ 22%] Building C object external/unbound/CMakeFiles/unbound.dir/validator/val_kcache.c.obj
[ 22%] Building C object external/unbound/CMakeFiles/unbound.dir/validator/val_kentry.c.obj
[ 24%] Building C object external/unbound/CMakeFiles/unbound.dir/validator/val_neg.c.obj
[ 24%] Building C object external/unbound/CMakeFiles/unbound.dir/validator/val_nsec3.c.obj
[ 24%] Building C object external/unbound/CMakeFiles/unbound.dir/validator/val_nsec.c.obj
[ 24%] Building C object external/unbound/CMakeFiles/unbound.dir/validator/val_secalgo.c.obj
[ 25%] Building C object external/unbound/CMakeFiles/unbound.dir/validator/val_sigcrypt.c.obj
[ 25%] Building C object external/unbound/CMakeFiles/unbound.dir/validator/val_utils.c.obj
[ 25%] Building C object external/unbound/CMakeFiles/unbound.dir/dns64/dns64.c.obj
[ 26%] Building C object external/unbound/CMakeFiles/unbound.dir/testcode/checklocks.c.obj
[ 26%] Building C object external/unbound/CMakeFiles/unbound.dir/sldns/keyraw.c.obj
[ 26%] Building C object external/unbound/CMakeFiles/unbound.dir/sldns/sbuffer.c.obj
[ 26%] Building C object external/unbound/CMakeFiles/unbound.dir/sldns/wire2str.c.obj
[ 28%] Building C object external/unbound/CMakeFiles/unbound.dir/sldns/parse.c.obj
[ 28%] Building C object external/unbound/CMakeFiles/unbound.dir/sldns/parseutil.c.obj
[ 28%] Building C object external/unbound/CMakeFiles/unbound.dir/sldns/rrdef.c.obj
[ 29%] Building C object external/unbound/CMakeFiles/unbound.dir/sldns/str2wire.c.obj
[ 29%] Building C object external/unbound/CMakeFiles/unbound.dir/compat/ctime_r.c.obj
[ 29%] Building C object external/unbound/CMakeFiles/unbound.dir/compat/gmtime_r.c.obj
[ 29%] Building C object external/unbound/CMakeFiles/unbound.dir/compat/inet_aton.c.obj
[ 30%] Building C object external/unbound/CMakeFiles/unbound.dir/compat/inet_ntop.c.obj
[ 30%] Building C object external/unbound/CMakeFiles/unbound.dir/compat/inet_pton.c.obj
[ 30%] Building C object external/unbound/CMakeFiles/unbound.dir/compat/strsep.c.obj
[ 30%] Building C object external/unbound/CMakeFiles/unbound.dir/compat/strlcat.c.obj
[ 32%] Building C object external/unbound/CMakeFiles/unbound.dir/compat/strlcpy.c.obj
[ 32%] Building C object external/unbound/CMakeFiles/unbound.dir/compat/strptime.c.obj
[ 32%] Building C object external/unbound/CMakeFiles/unbound.dir/compat/explicit_bzero.c.obj
[ 33%] Building C object external/unbound/CMakeFiles/unbound.dir/compat/arc4random.c.obj
[ 33%] Building C object external/unbound/CMakeFiles/unbound.dir/compat/arc4random_uniform.c.obj
[ 33%] Building C object external/unbound/CMakeFiles/unbound.dir/compat/reallocarray.c.obj
[ 33%] Building C object external/unbound/CMakeFiles/unbound.dir/compat/arc4_lock.c.obj
[ 34%] Building C object external/unbound/CMakeFiles/unbound.dir/compat/getentropy_win.c.obj
[ 34%] Building C object external/unbound/CMakeFiles/unbound.dir/libunbound/context.c.obj
[ 34%] Building C object external/unbound/CMakeFiles/unbound.dir/libunbound/libunbound.c.obj
[ 36%] Building C object external/unbound/CMakeFiles/unbound.dir/libunbound/libworker.c.obj
[ 36%] Linking C static library libunbound.a
[ 36%] Built target unbound
Scanning dependencies of target randomx
[ 36%] Building CXX object external/randomx/CMakeFiles/randomx.dir/src/aes_hash.cpp.obj
[ 37%] Building C object external/randomx/CMakeFiles/randomx.dir/src/argon2_ref.c.obj
[ 37%] Building C object external/randomx/CMakeFiles/randomx.dir/src/argon2_ssse3.c.obj
[ 37%] Building C object external/randomx/CMakeFiles/randomx.dir/src/argon2_avx2.c.obj
[ 37%] Building CXX object external/randomx/CMakeFiles/randomx.dir/src/bytecode_machine.cpp.obj
[ 38%] Building CXX object external/randomx/CMakeFiles/randomx.dir/src/cpu.cpp.obj
[ 38%] Building CXX object external/randomx/CMakeFiles/randomx.dir/src/dataset.cpp.obj
[ 38%] Building CXX object external/randomx/CMakeFiles/randomx.dir/src/soft_aes.cpp.obj
[ 40%] Building CXX object external/randomx/CMakeFiles/randomx.dir/src/virtual_memory.cpp.obj
[ 40%] Building CXX object external/randomx/CMakeFiles/randomx.dir/src/vm_interpreted.cpp.obj
[ 40%] Building CXX object external/randomx/CMakeFiles/randomx.dir/src/allocator.cpp.obj
[ 40%] Building CXX object external/randomx/CMakeFiles/randomx.dir/src/assembly_generator_x86.cpp.obj
[ 41%] Building CXX object external/randomx/CMakeFiles/randomx.dir/src/instruction.cpp.obj
[ 41%] Building CXX object external/randomx/CMakeFiles/randomx.dir/src/randomx.cpp.obj
[ 41%] Building CXX object external/randomx/CMakeFiles/randomx.dir/src/superscalar.cpp.obj
[ 42%] Building CXX object external/randomx/CMakeFiles/randomx.dir/src/vm_compiled.cpp.obj
[ 42%] Building CXX object external/randomx/CMakeFiles/randomx.dir/src/vm_interpreted_light.cpp.obj
[ 42%] Building C object external/randomx/CMakeFiles/randomx.dir/src/argon2_core.c.obj
[ 42%] Building CXX object external/randomx/CMakeFiles/randomx.dir/src/blake2_generator.cpp.obj
[ 44%] Building CXX object external/randomx/CMakeFiles/randomx.dir/src/instructions_portable.cpp.obj
[ 44%] Building C object external/randomx/CMakeFiles/randomx.dir/src/reciprocal.c.obj
[ 44%] Building CXX object external/randomx/CMakeFiles/randomx.dir/src/virtual_machine.cpp.obj
[ 44%] Building CXX object external/randomx/CMakeFiles/randomx.dir/src/vm_compiled_light.cpp.obj
[ 45%] Building C object external/randomx/CMakeFiles/randomx.dir/src/blake2/blake2b.c.obj
[ 45%] Linking CXX static library librandomx.a
[ 45%] Built target randomx
Scanning dependencies of target easylogging
[ 46%] Building CXX object external/easylogging++/CMakeFiles/easylogging.dir/easylogging++.cc.obj
[ 46%] Linking CXX static library libeasylogging.a
[ 46%] Built target easylogging
Scanning dependencies of target epee
[ 46%] Building CXX object contrib/epee/src/CMakeFiles/epee.dir/byte_slice.cpp.obj
[ 48%] Building CXX object contrib/epee/src/CMakeFiles/epee.dir/hex.cpp.obj
[ 48%] Building CXX object contrib/epee/src/CMakeFiles/epee.dir/http_auth.cpp.obj
[ 48%] Building CXX object contrib/epee/src/CMakeFiles/epee.dir/mlog.cpp.obj
[ 48%] Building CXX object contrib/epee/src/CMakeFiles/epee.dir/net_helper.cpp.obj
[ 49%] Building CXX object contrib/epee/src/CMakeFiles/epee.dir/net_utils_base.cpp.obj
[ 49%] Building CXX object contrib/epee/src/CMakeFiles/epee.dir/string_tools.cpp.obj
[ 49%] Building CXX object contrib/epee/src/CMakeFiles/epee.dir/wipeable_string.cpp.obj
[ 50%] Building CXX object contrib/epee/src/CMakeFiles/epee.dir/levin_base.cpp.obj
[ 50%] Building C object contrib/epee/src/CMakeFiles/epee.dir/memwipe.c.obj
[ 50%] Building CXX object contrib/epee/src/CMakeFiles/epee.dir/connection_basic.cpp.obj
In file included from C:/msys32/mingw32/include/boost/random/detail/integer_log2.hpp:19:0,
                 from C:/msys32/mingw32/include/boost/random/detail/large_arithmetic.hpp:19,
                 from C:/msys32/mingw32/include/boost/random/detail/const_mod.hpp:23,
                 from C:/msys32/mingw32/include/boost/random/detail/seed_impl.hpp:26,
                 from C:/msys32/mingw32/include/boost/random/mersenne_twister.hpp:30,
                 from C:/msys32/mingw32/include/boost/uuid/random_generator.hpp:17,
                 from C:/msys32/home/buildbot/slave/monero-gui-win32/build/monero/contrib/epee/include/net/network_throttle.hpp:61,
                 from C:/msys32/home/buildbot/slave/monero-gui-win32/build/monero/contrib/epee/include/net/network_throttle-detail.hpp:40,
                 from C:/msys32/home/buildbot/slave/monero-gui-win32/build/monero/contrib/epee/src/connection_basic.cpp:48:
C:/msys32/mingw32/include/boost/pending/integer_log2.hpp:7:59: note: #pragma message: This header is deprecated. Use <boost/integer/integer_log2.hpp> instead.
 BOOST_HEADER_DEPRECATED("<boost/integer/integer_log2.hpp>");
                                                           ^
[ 50%] Building CXX object contrib/epee/src/CMakeFiles/epee.dir/network_throttle.cpp.obj
In file included from C:/msys32/mingw32/include/boost/random/detail/integer_log2.hpp:19:0,
                 from C:/msys32/mingw32/include/boost/random/detail/large_arithmetic.hpp:19,
                 from C:/msys32/mingw32/include/boost/random/detail/const_mod.hpp:23,
                 from C:/msys32/mingw32/include/boost/random/detail/seed_impl.hpp:26,
                 from C:/msys32/mingw32/include/boost/random/mersenne_twister.hpp:30,
                 from C:/msys32/mingw32/include/boost/uuid/random_generator.hpp:17,
                 from C:/msys32/home/buildbot/slave/monero-gui-win32/build/monero/contrib/epee/include/net/network_throttle.hpp:61,
                 from C:/msys32/home/buildbot/slave/monero-gui-win32/build/monero/contrib/epee/include/net/network_throttle-detail.hpp:40,
                 from C:/msys32/home/buildbot/slave/monero-gui-win32/build/monero/contrib/epee/src/network_throttle.cpp:57:
C:/msys32/mingw32/include/boost/pending/integer_log2.hpp:7:59: note: #pragma message: This header is deprecated. Use <boost/integer/integer_log2.hpp> instead.
 BOOST_HEADER_DEPRECATED("<boost/integer/integer_log2.hpp>");
                                                           ^
[ 52%] Building CXX object contrib/epee/src/CMakeFiles/epee.dir/network_throttle-detail.cpp.obj
In file included from C:/msys32/mingw32/include/boost/random/detail/integer_log2.hpp:19:0,
                 from C:/msys32/mingw32/include/boost/random/detail/large_arithmetic.hpp:19,
                 from C:/msys32/mingw32/include/boost/random/detail/const_mod.hpp:23,
                 from C:/msys32/mingw32/include/boost/random/detail/seed_impl.hpp:26,
                 from C:/msys32/mingw32/include/boost/random/mersenne_twister.hpp:30,
                 from C:/msys32/mingw32/include/boost/uuid/random_generator.hpp:17,
                 from C:/msys32/home/buildbot/slave/monero-gui-win32/build/monero/contrib/epee/include/net/network_throttle.hpp:61,
                 from C:/msys32/home/buildbot/slave/monero-gui-win32/build/monero/contrib/epee/include/net/network_throttle-detail.hpp:40,
                 from C:/msys32/home/buildbot/slave/monero-gui-win32/build/monero/contrib/epee/include/net/abstract_tcp_server2.h:61,
                 from C:/msys32/home/buildbot/slave/monero-gui-win32/build/monero/contrib/epee/src/network_throttle-detail.cpp:58:
C:/msys32/mingw32/include/boost/pending/integer_log2.hpp:7:59: note: #pragma message: This header is deprecated. Use <boost/integer/integer_log2.hpp> instead.
 BOOST_HEADER_DEPRECATED("<boost/integer/integer_log2.hpp>");
                                                           ^
[ 52%] Building CXX object contrib/epee/src/CMakeFiles/epee.dir/mlocker.cpp.obj
C:/msys32/home/buildbot/slave/monero-gui-win32/build/monero/contrib/epee/src/mlocker.cpp:61:2: warning: #warning Missing query_page_size implementation [-Wcpp]
 #warning Missing query_page_size implementation
  ^~~~~~~
C:/msys32/home/buildbot/slave/monero-gui-win32/build/monero/contrib/epee/src/mlocker.cpp:73:2: warning: #warning Missing do_lock implementation [-Wcpp]
 #warning Missing do_lock implementation
  ^~~~~~~
C:/msys32/home/buildbot/slave/monero-gui-win32/build/monero/contrib/epee/src/mlocker.cpp:87:2: warning: #warning Missing implementation of page size detection [-Wcpp]
 #warning Missing implementation of page size detection
  ^~~~~~~
[ 52%] Building CXX object contrib/epee/src/CMakeFiles/epee.dir/buffer.cpp.obj
[ 52%] Building CXX object contrib/epee/src/CMakeFiles/epee.dir/net_ssl.cpp.obj
[ 53%] Building CXX object contrib/epee/src/CMakeFiles/epee.dir/int-util.cpp.obj
[ 53%] Linking CXX static library libepee.a
[ 53%] Built target epee
Scanning dependencies of target obj_cncrypto
[ 53%] Building C object src/crypto/CMakeFiles/obj_cncrypto.dir/aesb.c.obj
[ 54%] Building C object src/crypto/CMakeFiles/obj_cncrypto.dir/blake256.c.obj
[ 54%] Building C object src/crypto/CMakeFiles/obj_cncrypto.dir/chacha.c.obj
[ 54%] Building C object src/crypto/CMakeFiles/obj_cncrypto.dir/crypto-ops-data.c.obj
[ 54%] Building C object src/crypto/CMakeFiles/obj_cncrypto.dir/crypto-ops.c.obj
[ 56%] Building CXX object src/crypto/CMakeFiles/obj_cncrypto.dir/crypto.cpp.obj
[ 56%] Building C object src/crypto/CMakeFiles/obj_cncrypto.dir/groestl.c.obj
[ 56%] Building C object src/crypto/CMakeFiles/obj_cncrypto.dir/hash-extra-blake.c.obj
[ 56%] Building C object src/crypto/CMakeFiles/obj_cncrypto.dir/hash-extra-groestl.c.obj
[ 57%] Building C object src/crypto/CMakeFiles/obj_cncrypto.dir/hash-extra-jh.c.obj
[ 57%] Building C object src/crypto/CMakeFiles/obj_cncrypto.dir/hash-extra-skein.c.obj
[ 57%] Building C object src/crypto/CMakeFiles/obj_cncrypto.dir/hash.c.obj
[ 58%] Building C object src/crypto/CMakeFiles/obj_cncrypto.dir/hmac-keccak.c.obj
[ 58%] Building C object src/crypto/CMakeFiles/obj_cncrypto.dir/jh.c.obj
[ 58%] Building C object src/crypto/CMakeFiles/obj_cncrypto.dir/keccak.c.obj
[ 58%] Building C object src/crypto/CMakeFiles/obj_cncrypto.dir/oaes_lib.c.obj
[ 60%] Building C object src/crypto/CMakeFiles/obj_cncrypto.dir/random.c.obj
[ 60%] Building C object src/crypto/CMakeFiles/obj_cncrypto.dir/skein.c.obj
[ 60%] Building C object src/crypto/CMakeFiles/obj_cncrypto.dir/slow-hash.c.obj
[ 61%] Building C object src/crypto/CMakeFiles/obj_cncrypto.dir/rx-slow-hash.c.obj
[ 61%] Building C object src/crypto/CMakeFiles/obj_cncrypto.dir/CryptonightR_JIT.c.obj
[ 61%] Building C object src/crypto/CMakeFiles/obj_cncrypto.dir/tree-hash.c.obj
[ 61%] Built target obj_cncrypto
Scanning dependencies of target cncrypto
[ 62%] Linking CXX static library libcncrypto.a
[ 62%] Built target cncrypto
[ 62%] Built target genversion
[ 62%] Built target obj_version
[ 62%] Built target version
Scanning dependencies of target generate_translations_header
[ 64%] Creating directories for 'generate_translations_header'
[ 64%] No download step for 'generate_translations_header'
[ 64%] No patch step for 'generate_translations_header'
[ 64%] No update step for 'generate_translations_header'
[ 65%] Performing configure step for 'generate_translations_header'
-- The C compiler identification is GNU 7.4.0
-- The CXX compiler identification is GNU 7.4.0
-- Check for working C compiler: C:/msys32/mingw32/bin/gcc.exe
-- Check for working C compiler: C:/msys32/mingw32/bin/gcc.exe -- works
-- Detecting C compiler ABI info
-- Detecting C compiler ABI info - done
-- Detecting C compile features
-- Detecting C compile features - done
-- Check for working CXX compiler: C:/msys32/mingw32/bin/g++.exe
-- Check for working CXX compiler: C:/msys32/mingw32/bin/g++.exe -- works
-- Detecting CXX compiler ABI info
-- Detecting CXX compiler ABI info - done
-- Detecting CXX compile features
-- Detecting CXX compile features - done
lrelease version 5.7.0
-- Configuring done
-- Generating done
-- Build files have been written to: C:/msys32/home/buildbot/slave/monero-gui-win32/build/monero/build/release-static/translations
[ 65%] Performing build step for 'generate_translations_header'
Scanning dependencies of target generate_translations_header
[ 50%] Building C object CMakeFiles/generate_translations_header.dir/generate_translations_header.c.obj
[100%] Linking C executable generate_translations_header.exe
Updating 'monero.qm'...
    Generated 0 translation(s) (0 finished and 0 unfinished)
    Ignored 1111 untranslated source text(s)
Updating 'monero_ar.qm'...
    Generated 0 translation(s) (0 finished and 0 unfinished)
    Ignored 1111 untranslated source text(s)
Updating 'monero_bg.qm'...
    Generated 0 translation(s) (0 finished and 0 unfinished)
    Ignored 1111 untranslated source text(s)
Updating 'monero_bn.qm'...
    Generated 0 translation(s) (0 finished and 0 unfinished)
    Ignored 1111 untranslated source text(s)
Updating 'monero_cat.qm'...
    Generated 0 translation(s) (0 finished and 0 unfinished)
    Ignored 1111 untranslated source text(s)
Updating 'monero_cs.qm'...
    Generated 0 translation(s) (0 finished and 0 unfinished)
    Ignored 1111 untranslated source text(s)
Updating 'monero_da.qm'...
    Generated 0 translation(s) (0 finished and 0 unfinished)
    Ignored 1111 untranslated source text(s)
Updating 'monero_de.qm'...
    Generated 397 translation(s) (377 finished and 20 unfinished)
    Ignored 714 untranslated source text(s)
Updating 'monero_el.qm'...
    Generated 0 translation(s) (0 finished and 0 unfinished)
    Ignored 1111 untranslated source text(s)
Updating 'monero_eo.qm'...
    Generated 0 translation(s) (0 finished and 0 unfinished)
    Ignored 1111 untranslated source text(s)
Updating 'monero_es.qm'...
    Generated 136 translation(s) (98 finished and 38 unfinished)
    Ignored 975 untranslated source text(s)
Updating 'monero_fa.qm'...
    Generated 0 translation(s) (0 finished and 0 unfinished)
    Ignored 1111 untranslated source text(s)
Updating 'monero_fi.qm'...
    Generated 0 translation(s) (0 finished and 0 unfinished)
    Ignored 1111 untranslated source text(s)
Updating 'monero_fr.qm'...
    Generated 1030 translation(s) (1030 finished and 0 unfinished)
    Ignored 81 untranslated source text(s)
Updating 'monero_ga.qm'...
    Generated 0 translation(s) (0 finished and 0 unfinished)
    Ignored 1111 untranslated source text(s)
Updating 'monero_he.qm'...
    Generated 0 translation(s) (0 finished and 0 unfinished)
    Ignored 1111 untranslated source text(s)
Updating 'monero_hi.qm'...
    Generated 161 translation(s) (122 finished and 39 unfinished)
    Ignored 950 untranslated source text(s)
Updating 'monero_hr.qm'...
    Generated 0 translation(s) (0 finished and 0 unfinished)
    Ignored 1111 untranslated source text(s)
Updating 'monero_hu.qm'...
    Generated 0 translation(s) (0 finished and 0 unfinished)
    Ignored 1111 untranslated source text(s)
Updating 'monero_id.qm'...
    Generated 0 translation(s) (0 finished and 0 unfinished)
    Ignored 1111 untranslated source text(s)
Updating 'monero_is.qm'...
    Generated 0 translation(s) (0 finished and 0 unfinished)
    Ignored 1111 untranslated source text(s)
Updating 'monero_it.qm'...
    Generated 794 translation(s) (791 finished and 3 unfinished)
    Ignored 317 untranslated source text(s)
Updating 'monero_ja.qm'...
    Generated 315 translation(s) (289 finished and 26 unfinished)
    Ignored 796 untranslated source text(s)
Updating 'monero_kmr.qm'...
    Generated 0 translation(s) (0 finished and 0 unfinished)
    Ignored 1111 untranslated source text(s)
Updating 'monero_ko.qm'...
    Generated 0 translation(s) (0 finished and 0 unfinished)
    Ignored 1111 untranslated source text(s)
Updating 'monero_lt.qm'...
    Generated 0 translation(s) (0 finished and 0 unfinished)
    Ignored 1111 untranslated source text(s)
Updating 'monero_nb_NO.qm'...
    Generated 0 translation(s) (0 finished and 0 unfinished)
    Ignored 1111 untranslated source text(s)
Updating 'monero_ne.qm'...
    Generated 0 translation(s) (0 finished and 0 unfinished)
    Ignored 1111 untranslated source text(s)
Updating 'monero_nl.qm'...
    Generated 69 translation(s) (45 finished and 24 unfinished)
    Ignored 1042 untranslated source text(s)
Updating 'monero_pl.qm'...
    Generated 16 translation(s) (9 finished and 7 unfinished)
    Ignored 1095 untranslated source text(s)
Updating 'monero_prt.qm'...
    Generated 0 translation(s) (0 finished and 0 unfinished)
    Ignored 1111 untranslated source text(s)
Updating 'monero_pt-br.qm'...
    Generated 0 translation(s) (0 finished and 0 unfinished)
    Ignored 1111 untranslated source text(s)
Updating 'monero_pt-pt.qm'...
    Generated 0 translation(s) (0 finished and 0 unfinished)
    Ignored 1111 untranslated source text(s)
Updating 'monero_ro.qm'...
    Generated 0 translation(s) (0 finished and 0 unfinished)
    Ignored 1111 untranslated source text(s)
Updating 'monero_ru.qm'...
    Generated 0 translation(s) (0 finished and 0 unfinished)
    Ignored 1111 untranslated source text(s)
Updating 'monero_sk.qm'...
    Generated 6 translation(s) (5 finished and 1 unfinished)
    Ignored 1105 untranslated source text(s)
Updating 'monero_sl.qm'...
    Generated 0 translation(s) (0 finished and 0 unfinished)
    Ignored 1111 untranslated source text(s)
Updating 'monero_sr.qm'...
    Generated 0 translation(s) (0 finished and 0 unfinished)
    Ignored 1111 untranslated source text(s)
Updating 'monero_sv.qm'...
    Generated 609 translation(s) (609 finished and 0 unfinished)
    Ignored 502 untranslated source text(s)
Updating 'monero_tr.qm'...
    Generated 2 translation(s) (1 finished and 1 unfinished)
    Ignored 1109 untranslated source text(s)
Updating 'monero_uk.qm'...
    Generated 0 translation(s) (0 finished and 0 unfinished)
    Ignored 1111 untranslated source text(s)
Updating 'monero_ur.qm'...
    Generated 0 translation(s) (0 finished and 0 unfinished)
    Ignored 1111 untranslated source text(s)
Updating 'monero_zh-cn.qm'...
    Generated 0 translation(s) (0 finished and 0 unfinished)
    Ignored 1111 untranslated source text(s)
Updating 'monero_zh-tw.qm'...
    Generated 0 translation(s) (0 finished and 0 unfinished)
    Ignored 1111 untranslated source text(s)
Updating 'monero_zu.qm'...
    Generated 0 translation(s) (0 finished and 0 unfinished)
    Ignored 1111 untranslated source text(s)
Updating 'monero_zu.qm.qm'...
    Generated 0 translation(s) (0 finished and 0 unfinished)
    Ignored 1111 untranslated source text(s)
Generating embedded translations header
[100%] Built target generate_translations_header
[ 65%] Performing install step for 'generate_translations_header'

[ 65%] Completed 'generate_translations_header'
[ 65%] Built target generate_translations_header
Scanning dependencies of target obj_common
[ 65%] Building CXX object src/common/CMakeFiles/obj_common.dir/base58.cpp.obj
[ 66%] Building CXX object src/common/CMakeFiles/obj_common.dir/command_line.cpp.obj
[ 66%] Building CXX object src/common/CMakeFiles/obj_common.dir/dns_utils.cpp.obj
[ 66%] Building CXX object src/common/CMakeFiles/obj_common.dir/download.cpp.obj
[ 66%] Building CXX object src/common/CMakeFiles/obj_common.dir/error.cpp.obj
[ 68%] Building CXX object src/common/CMakeFiles/obj_common.dir/expect.cpp.obj
[ 68%] Building CXX object src/common/CMakeFiles/obj_common.dir/util.cpp.obj
[ 68%] Building CXX object src/common/CMakeFiles/obj_common.dir/i18n.cpp.obj
[ 69%] Building CXX object src/common/CMakeFiles/obj_common.dir/notify.cpp.obj
[ 69%] Building CXX object src/common/CMakeFiles/obj_common.dir/password.cpp.obj
[ 69%] Building CXX object src/common/CMakeFiles/obj_common.dir/perf_timer.cpp.obj
[ 69%] Building CXX object src/common/CMakeFiles/obj_common.dir/pruning.cpp.obj
[ 70%] Building CXX object src/common/CMakeFiles/obj_common.dir/spawn.cpp.obj
[ 70%] Building CXX object src/common/CMakeFiles/obj_common.dir/threadpool.cpp.obj
[ 70%] Building CXX object src/common/CMakeFiles/obj_common.dir/updates.cpp.obj
[ 72%] Building C object src/common/CMakeFiles/obj_common.dir/aligned.c.obj
[ 72%] Building CXX object src/common/CMakeFiles/obj_common.dir/timings.cc.obj
[ 72%] Building CXX object src/common/CMakeFiles/obj_common.dir/combinator.cpp.obj
[ 72%] Built target obj_common
Scanning dependencies of target common
[ 72%] Linking CXX static library libcommon.a
[ 72%] Built target common
Scanning dependencies of target obj_ringct_basic
[ 72%] Building CXX object src/ringct/CMakeFiles/obj_ringct_basic.dir/rctOps.cpp.obj
[ 73%] Building CXX object src/ringct/CMakeFiles/obj_ringct_basic.dir/rctTypes.cpp.obj
[ 73%] Building C object src/ringct/CMakeFiles/obj_ringct_basic.dir/rctCryptoOps.c.obj
[ 73%] Building CXX object src/ringct/CMakeFiles/obj_ringct_basic.dir/multiexp.cc.obj
[ 74%] Building CXX object src/ringct/CMakeFiles/obj_ringct_basic.dir/bulletproofs.cc.obj
[ 74%] Built target obj_ringct_basic
Scanning dependencies of target ringct_basic
[ 76%] Linking CXX static library libringct_basic.a
[ 76%] Built target ringct_basic
Scanning dependencies of target obj_device
[ 77%] Building CXX object src/device/CMakeFiles/obj_device.dir/device.cpp.obj
[ 77%] Building CXX object src/device/CMakeFiles/obj_device.dir/device_default.cpp.obj
[ 77%] Building CXX object src/device/CMakeFiles/obj_device.dir/log.cpp.obj
[ 78%] Building CXX object src/device/CMakeFiles/obj_device.dir/device_ledger.cpp.obj
[ 78%] Building CXX object src/device/CMakeFiles/obj_device.dir/device_io_hid.cpp.obj
[ 78%] Built target obj_device
Scanning dependencies of target device
[ 78%] Linking CXX static library libdevice.a
C:/msys32/mingw32/bin/ranlib.exe: libdevice.a: No space left on device
mingw32-make[2]: *** [src/device/CMakeFiles/device.dir/build.make:80: src/device/libdevice.a] Error 1
mingw32-make[2]: *** Deleting file 'src/device/libdevice.a'
mingw32-make[1]: *** [CMakeFiles/Makefile2:4353: src/device/CMakeFiles/device.dir/all] Error 2
mingw32-make: *** [Makefile:141: all] Error 2
[  2%] Built target blocks
[ 36%] Built target unbound
[ 45%] Built target randomx
[ 46%] Built target easylogging
[ 53%] Built target epee
[ 61%] Built target obj_cncrypto
[ 62%] Built target cncrypto
[ 62%] Built target genversion
[ 62%] Built target obj_version
[ 62%] Built target version
[ 65%] Built target generate_translations_header
[ 72%] Built target obj_common
[ 72%] Built target common
[ 74%] Built target obj_ringct_basic
[ 76%] Built target ringct_basic
[ 78%] Built target obj_device
[ 78%] Linking CXX static library libdevice.a
C:/msys32/mingw32/bin/ranlib.exe: libdevice.a: No space left on device
mingw32-make[2]: *** [src/device/CMakeFiles/device.dir/build.make:80: src/device/libdevice.a] Error 1
mingw32-make[2]: *** Deleting file 'src/device/libdevice.a'
mingw32-make[1]: *** [CMakeFiles/Makefile2:4353: src/device/CMakeFiles/device.dir/all] Error 2
/home/buildbot/slave/monero-gui-win32/build/monero/build/release-static /home/buildbot/slave/monero-gui-win32/build /home/buildbot/slave/monero-gui-win32/build
mingw32-make: *** [Makefile:141: all] Error 2
make: Entering directory '/home/buildbot/slave/monero-gui-win32/build/monero/build/release-static/contrib/epee'
make[1]: Entering directory '/C/msys32/home/buildbot/slave/monero-gui-win32/build/monero/build/release-static'
make[2]: Entering directory '/C/msys32/home/buildbot/slave/monero-gui-win32/build/monero/build/release-static'
make[2]: Leaving directory '/C/msys32/home/buildbot/slave/monero-gui-win32/build/monero/build/release-static'
[ 14%] Built target easylogging
make[2]: Entering directory '/C/msys32/home/buildbot/slave/monero-gui-win32/build/monero/build/release-static'
Scanning dependencies of target epee_readline
make[2]: Leaving directory '/C/msys32/home/buildbot/slave/monero-gui-win32/build/monero/build/release-static'
make[2]: Entering directory '/C/msys32/home/buildbot/slave/monero-gui-win32/build/monero/build/release-static'
[ 14%] Building CXX object contrib/epee/src/CMakeFiles/epee_readline.dir/readline_buffer.cpp.obj
[ 28%] Linking CXX static library libepee_readline.a
make[2]: Leaving directory '/C/msys32/home/buildbot/slave/monero-gui-win32/build/monero/build/release-static'
[ 28%] Built target epee_readline
make[2]: Entering directory '/C/msys32/home/buildbot/slave/monero-gui-win32/build/monero/build/release-static'
make[2]: Leaving directory '/C/msys32/home/buildbot/slave/monero-gui-win32/build/monero/build/release-static'
[100%] Built target epee
make[1]: Leaving directory '/C/msys32/home/buildbot/slave/monero-gui-win32/build/monero/build/release-static'
Install the project...
-- Install configuration: "Release"
-- Installing: C:/msys32/home/buildbot/slave/monero-gui-win32/build/monero/lib/libepee.a
-- Installing: C:/msys32/home/buildbot/slave/monero-gui-win32/build/monero/lib/libepee_readline.a
make: Leaving directory '/home/buildbot/slave/monero-gui-win32/build/monero/build/release-static/contrib/epee'
make: Entering directory '/home/buildbot/slave/monero-gui-win32/build/monero/build/release-static/external/easylogging++'
make[1]: Entering directory '/C/msys32/home/buildbot/slave/monero-gui-win32/build/monero/build/release-static'
make[2]: Entering directory '/C/msys32/home/buildbot/slave/monero-gui-win32/build/monero/build/release-static'
make[2]: Leaving directory '/C/msys32/home/buildbot/slave/monero-gui-win32/build/monero/build/release-static'
[100%] Built target easylogging
make[1]: Leaving directory '/C/msys32/home/buildbot/slave/monero-gui-win32/build/monero/build/release-static'
Install the project...
-- Install configuration: "Release"
-- Installing: C:/msys32/home/buildbot/slave/monero-gui-win32/build/monero/lib/libeasylogging.a
make: Leaving directory '/home/buildbot/slave/monero-gui-win32/build/monero/build/release-static/external/easylogging++'
make: Entering directory '/home/buildbot/slave/monero-gui-win32/build/monero/build/release-static/external/db_drivers/liblmdb'
make[1]: Entering directory '/C/msys32/home/buildbot/slave/monero-gui-win32/build/monero/build/release-static'
make[2]: Entering directory '/C/msys32/home/buildbot/slave/monero-gui-win32/build/monero/build/release-static'
Scanning dependencies of target lmdb
make[2]: Leaving directory '/C/msys32/home/buildbot/slave/monero-gui-win32/build/monero/build/release-static'
make[2]: Entering directory '/C/msys32/home/buildbot/slave/monero-gui-win32/build/monero/build/release-static'
[  0%] Building C object external/db_drivers/liblmdb/CMakeFiles/lmdb.dir/mdb.c.obj
C:/msys32/home/buildbot/slave/monero-gui-win32/build/monero/external/db_drivers/liblmdb/mdb.c: In function 'mdb_strerror':
cc1.exe: warning: function may return address of local variable [-Wreturn-local-addr]
C:/msys32/home/buildbot/slave/monero-gui-win32/build/monero/external/db_drivers/liblmdb/mdb.c:1710:7: note: declared here
  char buf[MSGSIZE+PADSIZE], *ptr = buf;
       ^~~
make[2]: Leaving directory '/C/msys32/home/buildbot/slave/monero-gui-win32/build/monero/build/release-static'
make[1]: Leaving directory '/C/msys32/home/buildbot/slave/monero-gui-win32/build/monero/build/release-static'
make: Leaving directory '/home/buildbot/slave/monero-gui-win32/build/monero/build/release-static/external/db_drivers/liblmdb'
Installing libunbound...
/home/buildbot/slave/monero-gui-win32/build/monero/build/release-static/external/unbound /home/buildbot/slave/monero-gui-win32/build/monero/build/release-static /home/buildbot/slave/monero-gui-win32/build /home/buildbot/slave/monero-gui-win32/build
C:/msys32/home/buildbot/slave/monero-gui-win32/build/monero/external/db_drivers/liblmdb/mdb.c: At top level:
C:/msys32/home/buildbot/slave/monero-gui-win32/build/monero/external/db_drivers/liblmdb/mdb.c:11199:1: fatal error: error writing to C:\WINDOWS\TEMP\cc47RS0q.s: No space left on device
 }
 ^
compilation terminated.
make[2]: *** [external/db_drivers/liblmdb/CMakeFiles/lmdb.dir/build.make:63: external/db_drivers/liblmdb/CMakeFiles/lmdb.dir/mdb.c.obj] Error 1
make[1]: *** [CMakeFiles/Makefile2:318: external/db_drivers/liblmdb/CMakeFiles/lmdb.dir/all] Error 2
make: *** [Makefile:141: all] Error 2
[100%] Built target unbound
Install the project...
-- Install configuration: "Release"
-- Installing: C:/msys32/home/buildbot/slave/monero-gui-win32/build/monero/lib/libunbound.a
/home/buildbot/slave/monero-gui-win32/build/monero/build/release-static /home/buildbot/slave/monero-gui-win32/build /home/buildbot/slave/monero-gui-win32/build
make: Entering directory '/home/buildbot/slave/monero-gui-win32/build/monero/build/release-static/external/randomx'
make[1]: Entering directory '/C/msys32/home/buildbot/slave/monero-gui-win32/build/monero/build/release-static'
make[2]: Entering directory '/C/msys32/home/buildbot/slave/monero-gui-win32/build/monero/build/release-static'
make[2]: Leaving directory '/C/msys32/home/buildbot/slave/monero-gui-win32/build/monero/build/release-static'
[ 66%] Built target randomx
make[2]: Entering directory '/C/msys32/home/buildbot/slave/monero-gui-win32/build/monero/build/release-static'
Scanning dependencies of target randomx-tests
make[2]: Leaving directory '/C/msys32/home/buildbot/slave/monero-gui-win32/build/monero/build/release-static'
make[2]: Entering directory '/C/msys32/home/buildbot/slave/monero-gui-win32/build/monero/build/release-static'
[ 66%] Building CXX object external/randomx/CMakeFiles/randomx-tests.dir/src/tests/tests.cpp.obj
C:/msys32/home/buildbot/slave/monero-gui-win32/build/monero/external/randomx/src/tests/tests.cpp:1065:1: fatal error: error writing to C:\WINDOWS\TEMP\ccLplnlc.s: No space left on device
 }
 ^
compilation terminated.
make[2]: Leaving directory '/C/msys32/home/buildbot/slave/monero-gui-win32/build/monero/build/release-static'
make[1]: Leaving directory '/C/msys32/home/buildbot/slave/monero-gui-win32/build/monero/build/release-static'
make: Leaving directory '/home/buildbot/slave/monero-gui-win32/build/monero/build/release-static/external/randomx'
/home/buildbot/slave/monero-gui-win32/build /home/buildbot/slave/monero-gui-win32/build
make[2]: *** [external/randomx/CMakeFiles/randomx-tests.dir/build.make:63: external/randomx/CMakeFiles/randomx-tests.dir/src/tests/tests.cpp.obj] Error 1
make[1]: *** [CMakeFiles/Makefile2:434: external/randomx/CMakeFiles/randomx-tests.dir/all] Error 2
make: *** [Makefile:141: all] Error 2
+ '[' '' '!=' true ']'
+ make -C src/zxcvbn-c
make: Entering directory '/home/buildbot/slave/monero-gui-win32/build/src/zxcvbn-c'
g++ -I. -std=c++11 -O2 -Wall -Wextra \
	-o dictgen dict-generate.cpp 
dict-generate.cpp: In function 'void CreateArrays(NodeSPtr, StringIntSet_t&, StringOfInts&, Uint64Vect&, UintVect&)':
dict-generate.cpp:887:43: warning: format '%lu' expects argument of type 'long unsigned int', but argument 4 has type 'std::__cxx11::basic_string<int>::size_type {aka unsigned int}' [-Wformat=]
         snprintf(Tmp, sizeof Tmp, "%lu", x);
                                           ^
make: Leaving directory '/home/buildbot/slave/monero-gui-win32/build/src/zxcvbn-c'
dict-generate.cpp: At global scope:
dict-generate.cpp:1760:1: fatal error: error writing to C:\WINDOWS\TEMP\ccWigoHG.s: No space left on device
 }
 ^
compilation terminated.
make: *** [makefile:61: dictgen] Error 1
+ exit
program finished with exit code 2
elapsedTime=714.779000