(view as text)
bash -ex ./build.sh release-static
 in dir /home/vagrant/slave/monero-gui-ubuntu-i686/build (timeout 1200 secs)
 watching logfiles {}
 argv: ['bash', '-ex', './build.sh', 'release-static']
 environment:
  HOME=/home/vagrant
  LANG=en_US
  LANGUAGE=en_US:
  LESSCLOSE=/usr/bin/lesspipe %s %s
  LESSOPEN=| /usr/bin/lesspipe %s
  LOGNAME=vagrant
  LS_COLORS=rs=0:di=01;34:ln=01;36:mh=00:pi=40;33:so=01;35:do=01;35:bd=40;33;01:cd=40;33;01:or=40;31;01:mi=00:su=37;41:sg=30;43:ca=30;41:tw=30;42:ow=34;42:st=37;44:ex=01;32:*.tar=01;31:*.tgz=01;31:*.arc=01;31:*.arj=01;31:*.taz=01;31:*.lha=01;31:*.lz4=01;31:*.lzh=01;31:*.lzma=01;31:*.tlz=01;31:*.txz=01;31:*.tzo=01;31:*.t7z=01;31:*.zip=01;31:*.z=01;31:*.Z=01;31:*.dz=01;31:*.gz=01;31:*.lrz=01;31:*.lz=01;31:*.lzo=01;31:*.xz=01;31:*.bz2=01;31:*.bz=01;31:*.tbz=01;31:*.tbz2=01;31:*.tz=01;31:*.deb=01;31:*.rpm=01;31:*.jar=01;31:*.war=01;31:*.ear=01;31:*.sar=01;31:*.rar=01;31:*.alz=01;31:*.ace=01;31:*.zoo=01;31:*.cpio=01;31:*.7z=01;31:*.rz=01;31:*.cab=01;31:*.jpg=01;35:*.jpeg=01;35:*.gif=01;35:*.bmp=01;35:*.pbm=01;35:*.pgm=01;35:*.ppm=01;35:*.tga=01;35:*.xbm=01;35:*.xpm=01;35:*.tif=01;35:*.tiff=01;35:*.png=01;35:*.svg=01;35:*.svgz=01;35:*.mng=01;35:*.pcx=01;35:*.mov=01;35:*.mpg=01;35:*.mpeg=01;35:*.m2v=01;35:*.mkv=01;35:*.webm=01;35:*.ogm=01;35:*.mp4=01;35:*.m4v=01;35:*.mp4v=01;35:*.vob=01;35:*.qt=01;35:*.nuv=01;35:*.wmv=01;35:*.asf=01;35:*.rm=01;35:*.rmvb=01;35:*.flc=01;35:*.avi=01;35:*.fli=01;35:*.flv=01;35:*.gl=01;35:*.dl=01;35:*.xcf=01;35:*.xwd=01;35:*.yuv=01;35:*.cgm=01;35:*.emf=01;35:*.ogv=01;35:*.ogx=01;35:*.aac=00;36:*.au=00;36:*.flac=00;36:*.m4a=00;36:*.mid=00;36:*.midi=00;36:*.mka=00;36:*.mp3=00;36:*.mpc=00;36:*.ogg=00;36:*.ra=00;36:*.wav=00;36:*.oga=00;36:*.opus=00;36:*.spx=00;36:*.xspf=00;36:
  MAIL=/var/mail/vagrant
  PATH=/home/jaquee/Qt/bin:/home/vagrant/bin:/home/vagrant/.local/bin:/usr/local/sbin:/usr/local/bin:/usr/sbin:/usr/bin:/sbin:/bin:/usr/games:/usr/local/games
  PWD=/home/vagrant/slave/monero-gui-ubuntu-i686/build
  SHELL=/bin/bash
  SHLVL=1
  SSH_CLIENT=10.0.2.2 49874 22
  SSH_CONNECTION=10.0.2.2 49874 10.0.2.15 22
  SSH_TTY=/dev/pts/0
  TERM=xterm-256color
  USER=vagrant
  XDG_RUNTIME_DIR=/run/user/900
  XDG_SESSION_ID=12
  _=/usr/local/bin/buildslave
 using PTY: False
+ BUILD_TYPE=release-static
+ BUILD_TREZOR=true
+ source ./utils.sh
++ get_platform
++ local platform=unknown
+++ uname
++ '[' Linux == Darwin ']'
+++ uname
++ '[' Linux == FreeBSD ']'
++++ uname -s
+++ expr substr Linux 1 5
++ '[' Linux == Linux ']'
++++ uname -m
+++ expr substr i686 1 6
++ '[' i686 == x86_64 ']'
++++ uname -m
+++ expr substr i686 1 4
++ '[' i686 == i686 ']'
++ platform=linux32
++ echo linux32
+ platform=linux32
+ '[' -z release-static ']'
+ '[' release-static == release ']'
+ '[' release-static == release-static ']'
+ echo 'Building release-static'
+ '[' linux32 '!=' darwin ']'
+ CONFIG='CONFIG+=release static'
+ BIN_PATH=release/bin
+ source ./utils.sh
Building release-static
++ pwd
+ pushd /home/vagrant/slave/monero-gui-ubuntu-i686/build
~/slave/monero-gui-ubuntu-i686/build ~/slave/monero-gui-ubuntu-i686/build
+++ dirname ./build.sh
++ cd .
++ pwd
+ ROOT_DIR=/home/vagrant/slave/monero-gui-ubuntu-i686/build
+ MONERO_DIR=monero
+ MONEROD_EXEC=monerod
+ MAKE=make
+ [[ linux32 == *bsd* ]]
+ export BUILD_TREZOR
+ ./get_libwallet_api.sh release-static
~/slave/monero-gui-ubuntu-i686/build ~/slave/monero-gui-ubuntu-i686/build
From https://github.com/monero-project/monero
   633f14b..b864375  master     -> origin/master
   2af1ea5..adc2e3f  release-v0.14 -> origin/release-v0.14
 * [new tag]         v0.14.1.1  -> v0.14.1.1
 * [new tag]         v0.14.1.2  -> v0.14.1.2
Submodule path 'monero': checked out 'b8643752c122a32096733fb8686d8f2eafcf6ff8'
HEAD is now at b864375... Merge pull request #5549
M	external/miniupnp
M	external/trezor-common
~/slave/monero-gui-ubuntu-i686/build/monero ~/slave/monero-gui-ubuntu-i686/build ~/slave/monero-gui-ubuntu-i686/build
You are currently on commit b864375
The most recent tag was at 8f0aedf
You are ahead of or behind a tagged release
~/slave/monero-gui-ubuntu-i686/build ~/slave/monero-gui-ubuntu-i686/build
Switched to a new branch 'b864375'
M	external/miniupnp
M	external/trezor-common
Submodule 'external/randomx' (https://github.com/tevador/RandomX) registered for path 'external/randomx'
Submodule path 'external/miniupnp': checked out '4c700e09526a7d546394e85628c57e9490feefa0'
Cloning into 'external/randomx'...
Submodule path 'external/randomx': checked out '519b9cf70540bdd996e806251cde335c8eef8aca'
Submodule path 'external/trezor-common': checked out '31a0073c62738827b48d725facd3766879429124'
libwallet_merged.a not found - Building libwallet
Building libwallet release-static
cleaning up existing monero build dir, libs and includes
~/slave/monero-gui-ubuntu-i686/build/monero/build/release-static ~/slave/monero-gui-ubuntu-i686/build ~/slave/monero-gui-ubuntu-i686/build
Configuring build for Linux i686
-- Found PythonInterp: /usr/bin/python (found version "2.7.12") 
-- CMake version 3.5.1
-- The C compiler identification is GNU 5.4.0
-- The CXX compiler identification is GNU 5.4.0
-- Check for working C compiler: /usr/bin/cc
-- Check for working C compiler: /usr/bin/cc -- works
-- Detecting C compiler ABI info
-- Detecting C compiler ABI info - done
-- Detecting C compile features
-- Detecting C compile features - done
-- Check for working CXX compiler: /usr/bin/c++
-- Check for working CXX compiler: /usr/bin/c++ -- works
-- Detecting CXX compiler ABI info
-- Detecting CXX compiler ABI info - done
-- Detecting CXX compile features
-- Detecting CXX compile features - done
-- The ASM compiler identification is GNU
-- Found assembler: /usr/bin/cc
-- Building without build tag
-- Found Git: /usr/bin/git (found version "2.7.4") 
-- Checking submodules
-- Submodule 'external/miniupnp' is up-to-date
-- Submodule 'external/unbound' is up-to-date
-- Submodule 'external/rapidjson' is up-to-date
-- Submodule 'external/trezor-common' is up-to-date
-- Submodule 'external/randomx' is up-to-date
-- Could not find DEVELOPER_LOCAL_TOOLS in env (not required)
-- BOOST_IGNORE_SYSTEM_PATHS defaults to OFF
-- Could not find DEVELOPER_LIBUNBOUND_OLD in env (not required)
-- Building for a 32-bit system
-- Building internal libraries as static
-- Using LMDB as default DB type
-- Stack trace on exception enabled (using easylogging++)
-- Looking for pthread.h
-- Looking for pthread.h - found
-- Looking for pthread_create
-- Looking for pthread_create - not found
-- Check if compiler accepts -pthread
-- Check if compiler accepts -pthread - yes
-- Found Threads: TRUE  
-- Performing Test _pthread_c
-- Performing Test _pthread_c - Success
-- Performing Test _pthread_cxx
-- Performing Test _pthread_cxx - Success
-- Found OpenSSL: /usr/lib/i386-linux-gnu/libssl.a;/usr/lib/i386-linux-gnu/libcrypto.a (found version "1.0.2g") 
-- Using OpenSSL include dir at /usr/include
-- Found HIDAPI: /usr/local/lib/libhidapi-libusb.a  
-- Looking for memset_s in c
-- Looking for memset_s in c - not found
-- Looking for explicit_bzero in c
-- Looking for explicit_bzero in c - not found
-- Looking for strptime
-- Looking for strptime - found
-- Could NOT find MiniUPnPc (missing:  MINIUPNP_INCLUDE_DIR MINIUPNP_LIBRARY) 
-- Using in-tree miniupnpc
-- Looking for libunbound
-- Looking for arpa/inet.h
-- Looking for arpa/inet.h - found
-- Looking for endian.h
-- Looking for endian.h - found
-- Looking for dlfcn.h
-- Looking for dlfcn.h - found
-- Looking for event.h
-- Looking for event.h - found
-- Looking for getopt.h
-- Looking for getopt.h - found
-- Looking for glob.h
-- Looking for glob.h - found
-- Looking for grp.h
-- Looking for grp.h - found
-- Looking for inttypes.h
-- Looking for inttypes.h - found
-- Looking for iphlpapi.h
-- Looking for iphlpapi.h - not found
-- Looking for login_cap.h
-- Looking for login_cap.h - not found
-- Looking for memory.h
-- Looking for memory.h - found
-- Looking for netdb.h
-- Looking for netdb.h - found
-- Looking for netinet/in.h
-- Looking for netinet/in.h - found
-- Looking for pthread.h
-- Looking for pthread.h - found
-- Looking for pwd.h
-- Looking for pwd.h - found
-- Looking for stdarg.h
-- Looking for stdarg.h - found
-- Looking for stdbool.h
-- Looking for stdbool.h - found
-- Looking for stdint.h
-- Looking for stdint.h - found
-- Looking for stdlib.h
-- Looking for stdlib.h - found
-- Looking for strings.h
-- Looking for strings.h - found
-- Looking for string.h
-- Looking for string.h - found
-- Looking for sys/param.h
-- Looking for sys/param.h - found
-- Looking for sys/resource.h
-- Looking for sys/resource.h - found
-- Looking for sys/sha2.h
-- Looking for sys/sha2.h - not found
-- Looking for sys/socket.h
-- Looking for sys/socket.h - found
-- Looking for sys/stat.h
-- Looking for sys/stat.h - found
-- Looking for sys/sysctl.h
-- Looking for sys/sysctl.h - found
-- Looking for sys/types.h
-- Looking for sys/types.h - found
-- Looking for sys/uio.h
-- Looking for sys/uio.h - found
-- Looking for sys/un.h
-- Looking for sys/un.h - found
-- Looking for sys/wait.h
-- Looking for sys/wait.h - found
-- Looking for syslog.h
-- Looking for syslog.h - found
-- Looking for time.h
-- Looking for time.h - found
-- Looking for unistd.h
-- Looking for unistd.h - found
-- Looking for vfork.h
-- Looking for vfork.h - not found
-- Looking for windows.h
-- Looking for windows.h - not found
-- Looking for winsock2.h
-- Looking for winsock2.h - not found
-- Looking for ws2tcpip.h
-- Looking for ws2tcpip.h - not found
-- Looking for _beginthreadex
-- Looking for _beginthreadex - not found
-- Looking for arc4random
-- Looking for arc4random - not found
-- Looking for arc4random_uniform
-- Looking for arc4random_uniform - not found
-- Looking for chown
-- Looking for chown - found
-- Looking for chroot
-- Looking for chroot - found
-- Looking for ctime_r
-- Looking for ctime_r - found
-- Looking for daemon
-- Looking for daemon - found
-- Looking for endprotoent
-- Looking for endprotoent - found
-- Looking for endservent
-- Looking for endservent - found
-- Looking for fork
-- Looking for fork - found
-- Looking for fseeko
-- Looking for fseeko - found
-- Looking for fsync
-- Looking for fsync - found
-- Looking for getauxval
-- Looking for getauxval - found
-- Looking for getentropy
-- Looking for getentropy - not found
-- Looking for getpwnam
-- Looking for getpwnam - found
-- Looking for getrlimit
-- Looking for getrlimit - found
-- Looking for glob
-- Looking for glob - found
-- Looking for gmtime_r
-- Looking for gmtime_r - found
-- Looking for fcntl
-- Looking for fcntl - found
-- Looking for inet_aton
-- Looking for inet_aton - found
-- Looking for inet_ntop
-- Looking for inet_ntop - found
-- Looking for inet_pton
-- Looking for inet_pton - found
-- Looking for initgroups
-- Looking for initgroups - found
-- Looking for ioctlsocket
-- Looking for ioctlsocket - not found
-- Looking for isblank
-- Looking for isblank - found
-- Looking for kill
-- Looking for kill - found
-- Looking for localtime_r
-- Looking for localtime_r - found
-- Looking for malloc
-- Looking for malloc - found
-- Looking for memmove
-- Looking for memmove - found
-- Looking for random
-- Looking for random - found
-- Looking for reallocarray
-- Looking for reallocarray - not found
-- Looking for recvmsg
-- Looking for recvmsg - found
-- Looking for sbrk
-- Looking for sbrk - found
-- Looking for sendmsg
-- Looking for sendmsg - found
-- Looking for setregid
-- Looking for setregid - found
-- Looking for setresgid
-- Looking for setresgid - found
-- Looking for setresuid
-- Looking for setresuid - found
-- Looking for setreuid
-- Looking for setreuid - found
-- Looking for setrlimit
-- Looking for setrlimit - found
-- Looking for setsid
-- Looking for setsid - found
-- Looking for setusercontent
-- Looking for setusercontent - not found
-- Looking for sigprocmask
-- Looking for sigprocmask - found
-- Looking for sleep
-- Looking for sleep - found
-- Looking for snprintf
-- Looking for snprintf - found
-- Looking for socketpair
-- Looking for socketpair - found
-- Looking for srandom
-- Looking for srandom - found
-- Looking for strsep
-- Looking for strsep - found
-- Looking for strftime
-- Looking for strftime - found
-- Looking for strlcat
-- Looking for strlcat - not found
-- Looking for strlcpy
-- Looking for strlcpy - not found
-- Looking for strptime
-- Looking for strptime - found
-- Looking for tzset
-- Looking for tzset - found
-- Looking for usleep
-- Looking for usleep - found
-- Looking for writev
-- Looking for writev - found
-- Looking for getaddrinfo
-- Looking for getaddrinfo - found
-- Looking for stddef.h
-- Looking for stddef.h - found
-- Check size of time_t
-- Check size of time_t - done
-- Check size of gid_t
-- Check size of gid_t - done
-- Check size of in_addr_t
-- Check size of in_addr_t - done
-- Check size of in_port_t
-- Check size of in_port_t - done
-- Check size of int16_t
-- Check size of int16_t - done
-- Check size of int32_t
-- Check size of int32_t - done
-- Check size of int64_t
-- Check size of int64_t - done
-- Check size of int8_t
-- Check size of int8_t - done
-- Check size of pid_t
-- Check size of pid_t - done
-- Check size of rlim_t
-- Check size of rlim_t - done
-- Check size of ssize_t
-- Check size of ssize_t - done
-- Check size of uid_t
-- Check size of uid_t - done
-- Check size of uint16_t
-- Check size of uint16_t - done
-- Check size of uint32_t
-- Check size of uint32_t - done
-- Check size of uint64_t
-- Check size of uint64_t - done
-- Check size of uint8_t
-- Check size of uint8_t - done
-- Looking for PTHREAD_PRIO_INHERIT
-- Looking for PTHREAD_PRIO_INHERIT - not found
-- Looking for pthread_rwlock_t
-- Looking for pthread_rwlock_t - not found
-- Looking for pthread_spinlock_t
-- Looking for pthread_spinlock_t - not found
-- Looking for openssl/conf.h
-- Looking for openssl/conf.h - found
-- Looking for openssl/engine.h
-- Looking for openssl/engine.h - found
-- Looking for openssl/err.h
-- Looking for openssl/err.h - found
-- Looking for openssl/rand.h
-- Looking for openssl/rand.h - found
-- Looking for openssl/ssl.h
-- Looking for openssl/ssl.h - found
-- Looking for NID_secp384r1
-- Looking for NID_secp384r1 - found
-- Looking for NID_X9_62_prime256v1
-- Looking for NID_X9_62_prime256v1 - found
-- Looking for sk_SSL_COMP_pop_free
-- Looking for sk_SSL_COMP_pop_free - found
-- Looking for SSL_COMP_get_compression_methods
-- Looking for SSL_COMP_get_compression_methods - found
-- Looking for EVP_MD_CTX_new
-- Looking for EVP_MD_CTX_new - not found
-- Looking for EVP_sha1
-- Looking for EVP_sha1 - found
-- Looking for EVP_sha256
-- Looking for EVP_sha256 - found
-- Looking for EVP_sha512
-- Looking for EVP_sha512 - found
-- Looking for FIPS_mode
-- Looking for FIPS_mode - found
-- Looking for HMAC_Update
-- Looking for HMAC_Update - found
-- Looking for OPENSSL_config
-- Looking for OPENSSL_config - found
-- Looking for SHA512_Update
-- Looking for SHA512_Update - found
-- Found PkgConfig: /usr/bin/pkg-config (found version "0.29.1") 
-- Looking for LIBRESSL_VERSION_TEXT
-- Looking for LIBRESSL_VERSION_TEXT - not found
-- Using 32-bit LMDB from source tree
-- Looking for backtrace
-- Looking for backtrace - found
-- backtrace facility detected in default set of libraries
-- Backtrace_LIBRARY: 
-- Found Backtrace: /usr/include  
-- Performing Test HAVE_CXX_ATOMICS
-- Performing Test HAVE_CXX_ATOMICS - Failed
-- Using HIDAPI include dir at /usr/include/hidapi
-- Found Protobuf: /usr/lib/i386-linux-gnu/libprotobuf.a  
-- Protobuf lib: /usr/lib/i386-linux-gnu/libprotobuf.a, inc: /usr/include, protoc: /usr/bin/protoc
-- Trezor protobuf messages regenerated out: "."
-- Checking for module 'libusb-1.0'
--   Found libusb-1.0, version 1.0.20
-- Looking for libusb_get_device_list in /usr/lib/i386-linux-gnu/libusb-1.0.a
-- Looking for libusb_get_device_list in /usr/lib/i386-linux-gnu/libusb-1.0.a - not found
-- Looking for libusb_get_port_numbers in /usr/lib/i386-linux-gnu/libusb-1.0.a
-- Looking for libusb_get_port_numbers in /usr/lib/i386-linux-gnu/libusb-1.0.a - not found
-- LibUSB Compilation test: TRUE
-- Trezor compatible LibUSB found at: /usr/include/libusb-1.0
-- Building on i686 for i686
-- AES support enabled
-- Performing Test _Wformat_c
-- Performing Test _Wformat_c - Success
-- Performing Test _Wformat_cxx
-- Performing Test _Wformat_cxx - Success
-- Performing Test _Wformat_security_c
-- Performing Test _Wformat_security_c - Success
-- Performing Test _Wformat_security_cxx
-- Performing Test _Wformat_security_cxx - Success
-- Performing Test _fstack_protector_c
-- Performing Test _fstack_protector_c - Success
-- Performing Test _fstack_protector_cxx
-- Performing Test _fstack_protector_cxx - Success
-- Performing Test _fstack_protector_strong_c
-- Performing Test _fstack_protector_strong_c - Success
-- Performing Test _fstack_protector_strong_cxx
-- Performing Test _fstack_protector_strong_cxx - Success
-- Performing Test _fcf_protection=full_c
-- Performing Test _fcf_protection=full_c - Failed
-- Performing Test _fcf_protection=full_cxx
-- Performing Test _fcf_protection=full_cxx - Failed
-- Performing Test _fstack_clash_protection_c
-- Performing Test _fstack_clash_protection_c - Failed
-- Performing Test _fstack_clash_protection_cxx
-- Performing Test _fstack_clash_protection_cxx - Failed
-- Performing Test _mmitigate_rop_c
-- Performing Test _mmitigate_rop_c - Failed
-- Performing Test _mmitigate_rop_cxx
-- Performing Test _mmitigate_rop_cxx - Failed
-- Looking for -pie linker flag
-- Looking for -pie linker flag - found
-- Looking for -Wl,-z,relro linker flag
-- Looking for -Wl,-z,relro linker flag - found
-- Looking for -Wl,-z,now linker flag
-- Looking for -Wl,-z,now linker flag - found
-- Looking for -Wl,-z,noexecstack linker flag
-- Looking for -Wl,-z,noexecstack linker flag - found
-- Looking for -Wl,-z,noexecheap linker flag
-- Looking for -Wl,-z,noexecheap linker flag - not found
-- Using C security hardening flags:  -U_FORTIFY_SOURCE -D_FORTIFY_SOURCE=1 -Wformat -Wformat-security -fstack-protector -fstack-protector-strong
-- Using C++ security hardening flags:  -U_FORTIFY_SOURCE -D_FORTIFY_SOURCE=1 -Wformat -Wformat-security -fstack-protector -fstack-protector-strong
-- Using linker security hardening flags:  -pie -Wl,-z,relro -Wl,-z,now -Wl,-z,noexecstack
-- Found Boost Version: 105800
-- Found Readline: /usr/include  
-- Looking for rl_copy_text
-- Looking for rl_copy_text - not found
-- Looking for rl_filename_completion_function
-- Looking for rl_filename_completion_function - not found
-- Looking for rl_copy_text
-- Looking for rl_copy_text - found
-- Looking for rl_filename_completion_function
-- Looking for rl_filename_completion_function - found
-- Found readline library at: /usr
-- Found Git: /usr/bin/git
-- Trezor support enabled
-- Not building tests
-- Not building debug utilities
-- Found Doxygen: /usr/bin/doxygen (found version "1.8.11") 
-- Performing Test HAVE_C11
-- Performing Test HAVE_C11 - Success
-- Configuring done
-- Generating done
-- Build files have been written to: /home/vagrant/slave/monero-gui-ubuntu-i686/build/monero/build/release-static
~/slave/monero-gui-ubuntu-i686/build/monero/build/release-static/src/wallet ~/slave/monero-gui-ubuntu-i686/build/monero/build/release-static ~/slave/monero-gui-ubuntu-i686/build ~/slave/monero-gui-ubuntu-i686/build
make: Entering directory '/home/vagrant/slave/monero-gui-ubuntu-i686/build/monero/build/release-static'
make[1]: Entering directory '/home/vagrant/slave/monero-gui-ubuntu-i686/build/monero/build/release-static'
make[2]: Entering directory '/home/vagrant/slave/monero-gui-ubuntu-i686/build/monero/build/release-static'
make[3]: Entering directory '/home/vagrant/slave/monero-gui-ubuntu-i686/build/monero/build/release-static'
Scanning dependencies of target genversion
make[3]: Leaving directory '/home/vagrant/slave/monero-gui-ubuntu-i686/build/monero/build/release-static'
make[3]: Entering directory '/home/vagrant/slave/monero-gui-ubuntu-i686/build/monero/build/release-static'
[ 50%] Generating ../version.cpp
-- You are currently on commit b8643752c
-- The most recent tag was at 8f0aedf
-- You are ahead of or behind a tagged release
make[3]: Leaving directory '/home/vagrant/slave/monero-gui-ubuntu-i686/build/monero/build/release-static'
[ 50%] Built target genversion
make[3]: Entering directory '/home/vagrant/slave/monero-gui-ubuntu-i686/build/monero/build/release-static'
Scanning dependencies of target obj_version
make[3]: Leaving directory '/home/vagrant/slave/monero-gui-ubuntu-i686/build/monero/build/release-static'
make[3]: Entering directory '/home/vagrant/slave/monero-gui-ubuntu-i686/build/monero/build/release-static'
[100%] Building CXX object src/CMakeFiles/obj_version.dir/__/version.cpp.o
make[3]: Leaving directory '/home/vagrant/slave/monero-gui-ubuntu-i686/build/monero/build/release-static'
[100%] Built target obj_version
make[3]: Entering directory '/home/vagrant/slave/monero-gui-ubuntu-i686/build/monero/build/release-static'
Scanning dependencies of target version
make[3]: Leaving directory '/home/vagrant/slave/monero-gui-ubuntu-i686/build/monero/build/release-static'
make[3]: Entering directory '/home/vagrant/slave/monero-gui-ubuntu-i686/build/monero/build/release-static'
[100%] Linking CXX static library libversion.a
make[3]: Leaving directory '/home/vagrant/slave/monero-gui-ubuntu-i686/build/monero/build/release-static'
[100%] Built target version
make[2]: Leaving directory '/home/vagrant/slave/monero-gui-ubuntu-i686/build/monero/build/release-static'
make[1]: Leaving directory '/home/vagrant/slave/monero-gui-ubuntu-i686/build/monero/build/release-static'
make: Leaving directory '/home/vagrant/slave/monero-gui-ubuntu-i686/build/monero/build/release-static'
Scanning dependencies of target obj_device_trezor
[  1%] Building CXX object src/device_trezor/CMakeFiles/obj_device_trezor.dir/trezor/messages_map.cpp.o
[  1%] Building CXX object src/device_trezor/CMakeFiles/obj_device_trezor.dir/trezor/protocol.cpp.o
/home/vagrant/slave/monero-gui-ubuntu-i686/build/monero/src/device_trezor/trezor/protocol.cpp: In member function 'std::shared_ptr<hw::trezor::messages::monero::MoneroTransactionInitRequest> hw::trezor::protocol::tx::Signer::step_init()':
/home/vagrant/slave/monero-gui-ubuntu-i686/build/monero/src/device_trezor/trezor/protocol.cpp:506:14: error: 'class hw::trezor::messages::monero::MoneroTransactionInitRequest_MoneroTransactionData' has no member named 'set_monero_version'
     tsx_data.set_monero_version(std::string(MONERO_VERSION) + "|" + MONERO_VERSION_TAG);
              ^
/home/vagrant/slave/monero-gui-ubuntu-i686/build/monero/src/device_trezor/trezor/protocol.cpp:507:14: error: 'class hw::trezor::messages::monero::MoneroTransactionInitRequest_MoneroTransactionData' has no member named 'set_hard_fork'
     tsx_data.set_hard_fork(m_aux_data->hard_fork ? m_aux_data->hard_fork.get() : 0);
              ^
src/device_trezor/CMakeFiles/obj_device_trezor.dir/build.make:86: recipe for target 'src/device_trezor/CMakeFiles/obj_device_trezor.dir/trezor/protocol.cpp.o' failed
make[2]: *** [src/device_trezor/CMakeFiles/obj_device_trezor.dir/trezor/protocol.cpp.o] Error 1
CMakeFiles/Makefile2:4337: recipe for target 'src/device_trezor/CMakeFiles/obj_device_trezor.dir/all' failed
Makefile:138: recipe for target 'all' failed
make[1]: *** [src/device_trezor/CMakeFiles/obj_device_trezor.dir/all] Error 2
make: *** [all] Error 2
[  0%] Building CXX object src/device_trezor/CMakeFiles/obj_device_trezor.dir/trezor/protocol.cpp.o
/home/vagrant/slave/monero-gui-ubuntu-i686/build/monero/src/device_trezor/trezor/protocol.cpp: In member function 'std::shared_ptr<hw::trezor::messages::monero::MoneroTransactionInitRequest> hw::trezor::protocol::tx::Signer::step_init()':
/home/vagrant/slave/monero-gui-ubuntu-i686/build/monero/src/device_trezor/trezor/protocol.cpp:506:14: error: 'class hw::trezor::messages::monero::MoneroTransactionInitRequest_MoneroTransactionData' has no member named 'set_monero_version'
     tsx_data.set_monero_version(std::string(MONERO_VERSION) + "|" + MONERO_VERSION_TAG);
              ^
/home/vagrant/slave/monero-gui-ubuntu-i686/build/monero/src/device_trezor/trezor/protocol.cpp:507:14: error: 'class hw::trezor::messages::monero::MoneroTransactionInitRequest_MoneroTransactionData' has no member named 'set_hard_fork'
     tsx_data.set_hard_fork(m_aux_data->hard_fork ? m_aux_data->hard_fork.get() : 0);
              ^
src/device_trezor/CMakeFiles/obj_device_trezor.dir/build.make:86: recipe for target 'src/device_trezor/CMakeFiles/obj_device_trezor.dir/trezor/protocol.cpp.o' failed
make[2]: *** [src/device_trezor/CMakeFiles/obj_device_trezor.dir/trezor/protocol.cpp.o] Error 1
CMakeFiles/Makefile2:4337: recipe for target 'src/device_trezor/CMakeFiles/obj_device_trezor.dir/all' failed
Makefile:138: recipe for target 'all' failed
make[1]: *** [src/device_trezor/CMakeFiles/obj_device_trezor.dir/all] Error 2
make: *** [all] Error 2
~/slave/monero-gui-ubuntu-i686/build/monero/build/release-static ~/slave/monero-gui-ubuntu-i686/build ~/slave/monero-gui-ubuntu-i686/build
~/slave/monero-gui-ubuntu-i686/build/monero/build/release-static/src/daemon ~/slave/monero-gui-ubuntu-i686/build/monero/build/release-static ~/slave/monero-gui-ubuntu-i686/build ~/slave/monero-gui-ubuntu-i686/build
Scanning dependencies of target obj_device
[  0%] Building CXX object src/device/CMakeFiles/obj_device.dir/device.cpp.o
[  0%] Building CXX object src/device/CMakeFiles/obj_device.dir/device_default.cpp.o
[  1%] Building CXX object src/device/CMakeFiles/obj_device.dir/log.cpp.o
[  1%] Building CXX object src/device/CMakeFiles/obj_device.dir/device_ledger.cpp.o
[  1%] Building CXX object src/device/CMakeFiles/obj_device.dir/device_io_hid.cpp.o
[  1%] Built target obj_device
Scanning dependencies of target unbound
[  1%] Building C object external/unbound/CMakeFiles/unbound.dir/services/authzone.c.o
[  1%] Building C object external/unbound/CMakeFiles/unbound.dir/services/cache/dns.c.o
[  1%] Building C object external/unbound/CMakeFiles/unbound.dir/services/cache/infra.c.o
[  2%] Building C object external/unbound/CMakeFiles/unbound.dir/services/cache/rrset.c.o
[  2%] Building C object external/unbound/CMakeFiles/unbound.dir/util/data/dname.c.o
[  2%] Building C object external/unbound/CMakeFiles/unbound.dir/util/data/msgencode.c.o
[  3%] Building C object external/unbound/CMakeFiles/unbound.dir/util/data/msgparse.c.o
[  3%] Building C object external/unbound/CMakeFiles/unbound.dir/util/data/msgreply.c.o
[  3%] Building C object external/unbound/CMakeFiles/unbound.dir/util/data/packed_rrset.c.o
[  3%] Building C object external/unbound/CMakeFiles/unbound.dir/iterator/iterator.c.o
[  5%] Building C object external/unbound/CMakeFiles/unbound.dir/iterator/iter_delegpt.c.o
[  5%] Building C object external/unbound/CMakeFiles/unbound.dir/iterator/iter_donotq.c.o
[  5%] Building C object external/unbound/CMakeFiles/unbound.dir/iterator/iter_fwd.c.o
[  6%] Building C object external/unbound/CMakeFiles/unbound.dir/iterator/iter_hints.c.o
[  6%] Building C object external/unbound/CMakeFiles/unbound.dir/iterator/iter_priv.c.o
[  6%] Building C object external/unbound/CMakeFiles/unbound.dir/iterator/iter_resptype.c.o
[  6%] Building C object external/unbound/CMakeFiles/unbound.dir/iterator/iter_scrub.c.o
[  7%] Building C object external/unbound/CMakeFiles/unbound.dir/iterator/iter_utils.c.o
[  7%] Building C object external/unbound/CMakeFiles/unbound.dir/respip/respip.c.o
[  7%] Building C object external/unbound/CMakeFiles/unbound.dir/services/listen_dnsport.c.o
[  8%] Building C object external/unbound/CMakeFiles/unbound.dir/services/localzone.c.o
[  8%] Building C object external/unbound/CMakeFiles/unbound.dir/services/mesh.c.o
[  8%] Building C object external/unbound/CMakeFiles/unbound.dir/services/modstack.c.o
[  8%] Building C object external/unbound/CMakeFiles/unbound.dir/services/outbound_list.c.o
[ 10%] Building C object external/unbound/CMakeFiles/unbound.dir/services/outside_network.c.o
[ 10%] Building C object external/unbound/CMakeFiles/unbound.dir/services/view.c.o
[ 10%] Building C object external/unbound/CMakeFiles/unbound.dir/util/alloc.c.o
[ 11%] Building C object external/unbound/CMakeFiles/unbound.dir/util/as112.c.o
[ 11%] Building C object external/unbound/CMakeFiles/unbound.dir/util/config_file.c.o
[ 11%] Building C object external/unbound/CMakeFiles/unbound.dir/util/configlexer.c.o
[ 11%] Building C object external/unbound/CMakeFiles/unbound.dir/util/configparser.c.o
[ 12%] Building C object external/unbound/CMakeFiles/unbound.dir/util/fptr_wlist.c.o
[ 12%] Building C object external/unbound/CMakeFiles/unbound.dir/util/locks.c.o
[ 12%] Building C object external/unbound/CMakeFiles/unbound.dir/util/log.c.o
[ 12%] Building C object external/unbound/CMakeFiles/unbound.dir/util/mini_event.c.o
[ 13%] Building C object external/unbound/CMakeFiles/unbound.dir/util/module.c.o
[ 13%] Building C object external/unbound/CMakeFiles/unbound.dir/util/netevent.c.o
[ 13%] Building C object external/unbound/CMakeFiles/unbound.dir/util/net_help.c.o
[ 15%] Building C object external/unbound/CMakeFiles/unbound.dir/util/random.c.o
[ 15%] Building C object external/unbound/CMakeFiles/unbound.dir/util/rbtree.c.o
[ 15%] Building C object external/unbound/CMakeFiles/unbound.dir/util/regional.c.o
[ 15%] Building C object external/unbound/CMakeFiles/unbound.dir/util/rtt.c.o
[ 16%] Building C object external/unbound/CMakeFiles/unbound.dir/util/storage/dnstree.c.o
[ 16%] Building C object external/unbound/CMakeFiles/unbound.dir/util/storage/lookup3.c.o
[ 16%] Building C object external/unbound/CMakeFiles/unbound.dir/util/storage/lruhash.c.o
[ 17%] Building C object external/unbound/CMakeFiles/unbound.dir/util/storage/slabhash.c.o
[ 17%] Building C object external/unbound/CMakeFiles/unbound.dir/util/timehist.c.o
[ 17%] Building C object external/unbound/CMakeFiles/unbound.dir/util/tube.c.o
[ 17%] Building C object external/unbound/CMakeFiles/unbound.dir/util/ub_event.c.o
[ 18%] Building C object external/unbound/CMakeFiles/unbound.dir/util/winsock_event.c.o
[ 18%] Building C object external/unbound/CMakeFiles/unbound.dir/validator/autotrust.c.o
[ 18%] Building C object external/unbound/CMakeFiles/unbound.dir/validator/val_anchor.c.o
[ 20%] Building C object external/unbound/CMakeFiles/unbound.dir/validator/validator.c.o
[ 20%] Building C object external/unbound/CMakeFiles/unbound.dir/validator/val_kcache.c.o
[ 20%] Building C object external/unbound/CMakeFiles/unbound.dir/validator/val_kentry.c.o
[ 20%] Building C object external/unbound/CMakeFiles/unbound.dir/validator/val_neg.c.o
[ 21%] Building C object external/unbound/CMakeFiles/unbound.dir/validator/val_nsec3.c.o
[ 21%] Building C object external/unbound/CMakeFiles/unbound.dir/validator/val_nsec.c.o
[ 21%] Building C object external/unbound/CMakeFiles/unbound.dir/validator/val_secalgo.c.o
[ 22%] Building C object external/unbound/CMakeFiles/unbound.dir/validator/val_sigcrypt.c.o
[ 22%] Building C object external/unbound/CMakeFiles/unbound.dir/validator/val_utils.c.o
[ 22%] Building C object external/unbound/CMakeFiles/unbound.dir/dns64/dns64.c.o
[ 22%] Building C object external/unbound/CMakeFiles/unbound.dir/testcode/checklocks.c.o
[ 23%] Building C object external/unbound/CMakeFiles/unbound.dir/sldns/keyraw.c.o
[ 23%] Building C object external/unbound/CMakeFiles/unbound.dir/sldns/sbuffer.c.o
[ 23%] Building C object external/unbound/CMakeFiles/unbound.dir/sldns/wire2str.c.o
[ 25%] Building C object external/unbound/CMakeFiles/unbound.dir/sldns/parse.c.o
[ 25%] Building C object external/unbound/CMakeFiles/unbound.dir/sldns/parseutil.c.o
[ 25%] Building C object external/unbound/CMakeFiles/unbound.dir/sldns/rrdef.c.o
[ 25%] Building C object external/unbound/CMakeFiles/unbound.dir/sldns/str2wire.c.o
[ 26%] Building C object external/unbound/CMakeFiles/unbound.dir/compat/strlcat.c.o
[ 26%] Building C object external/unbound/CMakeFiles/unbound.dir/compat/strlcpy.c.o
[ 26%] Building C object external/unbound/CMakeFiles/unbound.dir/compat/explicit_bzero.c.o
[ 27%] Building C object external/unbound/CMakeFiles/unbound.dir/compat/arc4random.c.o
[ 27%] Building C object external/unbound/CMakeFiles/unbound.dir/compat/arc4random_uniform.c.o
[ 27%] Building C object external/unbound/CMakeFiles/unbound.dir/compat/reallocarray.c.o
[ 27%] Building C object external/unbound/CMakeFiles/unbound.dir/compat/arc4_lock.c.o
[ 28%] Building C object external/unbound/CMakeFiles/unbound.dir/compat/getentropy_linux.c.o
[ 28%] Building C object external/unbound/CMakeFiles/unbound.dir/libunbound/context.c.o
[ 28%] Building C object external/unbound/CMakeFiles/unbound.dir/libunbound/libunbound.c.o
[ 30%] Building C object external/unbound/CMakeFiles/unbound.dir/libunbound/libworker.c.o
[ 30%] Linking C static library libunbound.a
[ 30%] Built target unbound
Scanning dependencies of target easylogging
[ 30%] Building CXX object external/easylogging++/CMakeFiles/easylogging.dir/easylogging++.cc.o
[ 30%] Linking CXX static library libeasylogging.a
[ 30%] Built target easylogging
Scanning dependencies of target randomx
[ 31%] Building CXX object external/randomx/CMakeFiles/randomx.dir/src/aes_hash.cpp.o
[ 31%] Building C object external/randomx/CMakeFiles/randomx.dir/src/argon2_ref.c.o
[ 31%] Building CXX object external/randomx/CMakeFiles/randomx.dir/src/bytecode_machine.cpp.o
[ 32%] Building CXX object external/randomx/CMakeFiles/randomx.dir/src/dataset.cpp.o
[ 32%] Building CXX object external/randomx/CMakeFiles/randomx.dir/src/soft_aes.cpp.o
[ 32%] Building CXX object external/randomx/CMakeFiles/randomx.dir/src/virtual_memory.cpp.o
[ 32%] Building CXX object external/randomx/CMakeFiles/randomx.dir/src/vm_interpreted.cpp.o
[ 33%] Building CXX object external/randomx/CMakeFiles/randomx.dir/src/allocator.cpp.o
[ 33%] Building CXX object external/randomx/CMakeFiles/randomx.dir/src/assembly_generator_x86.cpp.o
[ 33%] Building CXX object external/randomx/CMakeFiles/randomx.dir/src/instruction.cpp.o
[ 33%] Building CXX object external/randomx/CMakeFiles/randomx.dir/src/randomx.cpp.o
[ 35%] Building CXX object external/randomx/CMakeFiles/randomx.dir/src/superscalar.cpp.o
[ 35%] Building CXX object external/randomx/CMakeFiles/randomx.dir/src/vm_compiled.cpp.o
[ 35%] Building CXX object external/randomx/CMakeFiles/randomx.dir/src/vm_interpreted_light.cpp.o
[ 36%] Building C object external/randomx/CMakeFiles/randomx.dir/src/argon2_core.c.o
[ 36%] Building CXX object external/randomx/CMakeFiles/randomx.dir/src/blake2_generator.cpp.o
[ 36%] Building CXX object external/randomx/CMakeFiles/randomx.dir/src/instructions_portable.cpp.o
[ 36%] Building C object external/randomx/CMakeFiles/randomx.dir/src/reciprocal.c.o
[ 37%] Building CXX object external/randomx/CMakeFiles/randomx.dir/src/virtual_machine.cpp.o
[ 37%] Building CXX object external/randomx/CMakeFiles/randomx.dir/src/vm_compiled_light.cpp.o
[ 37%] Building C object external/randomx/CMakeFiles/randomx.dir/src/blake2/blake2b.c.o
[ 38%] Linking CXX static library librandomx.a
[ 38%] Built target randomx
Scanning dependencies of target epee
[ 40%] Building CXX object contrib/epee/src/CMakeFiles/epee.dir/byte_slice.cpp.o
[ 40%] Building CXX object contrib/epee/src/CMakeFiles/epee.dir/hex.cpp.o
[ 40%] Building CXX object contrib/epee/src/CMakeFiles/epee.dir/http_auth.cpp.o
[ 40%] Building CXX object contrib/epee/src/CMakeFiles/epee.dir/mlog.cpp.o
[ 41%] Building CXX object contrib/epee/src/CMakeFiles/epee.dir/net_helper.cpp.o
[ 41%] Building CXX object contrib/epee/src/CMakeFiles/epee.dir/net_utils_base.cpp.o
[ 41%] Building CXX object contrib/epee/src/CMakeFiles/epee.dir/string_tools.cpp.o
[ 41%] Building CXX object contrib/epee/src/CMakeFiles/epee.dir/wipeable_string.cpp.o
[ 42%] Building CXX object contrib/epee/src/CMakeFiles/epee.dir/levin_base.cpp.o
[ 42%] Building C object contrib/epee/src/CMakeFiles/epee.dir/memwipe.c.o
[ 42%] Building CXX object contrib/epee/src/CMakeFiles/epee.dir/connection_basic.cpp.o
[ 43%] Building CXX object contrib/epee/src/CMakeFiles/epee.dir/network_throttle.cpp.o
[ 43%] Building CXX object contrib/epee/src/CMakeFiles/epee.dir/network_throttle-detail.cpp.o
[ 43%] Building CXX object contrib/epee/src/CMakeFiles/epee.dir/mlocker.cpp.o
[ 43%] Building CXX object contrib/epee/src/CMakeFiles/epee.dir/buffer.cpp.o
[ 45%] Building CXX object contrib/epee/src/CMakeFiles/epee.dir/net_ssl.cpp.o
[ 45%] Linking CXX static library libepee.a
[ 45%] Built target epee
[ 46%] Built target genversion
[ 47%] Built target obj_version
[ 47%] Built target version
Scanning dependencies of target obj_cncrypto
[ 47%] Building C object src/crypto/CMakeFiles/obj_cncrypto.dir/aesb.c.o
[ 47%] Building C object src/crypto/CMakeFiles/obj_cncrypto.dir/blake256.c.o
[ 48%] Building C object src/crypto/CMakeFiles/obj_cncrypto.dir/chacha.c.o
[ 48%] Building C object src/crypto/CMakeFiles/obj_cncrypto.dir/crypto-ops-data.c.o
[ 48%] Building C object src/crypto/CMakeFiles/obj_cncrypto.dir/crypto-ops.c.o
[ 50%] Building CXX object src/crypto/CMakeFiles/obj_cncrypto.dir/crypto.cpp.o
[ 50%] Building C object src/crypto/CMakeFiles/obj_cncrypto.dir/groestl.c.o
[ 50%] Building C object src/crypto/CMakeFiles/obj_cncrypto.dir/hash-extra-blake.c.o
[ 50%] Building C object src/crypto/CMakeFiles/obj_cncrypto.dir/hash-extra-groestl.c.o
[ 51%] Building C object src/crypto/CMakeFiles/obj_cncrypto.dir/hash-extra-jh.c.o
[ 51%] Building C object src/crypto/CMakeFiles/obj_cncrypto.dir/hash-extra-skein.c.o
[ 51%] Building C object src/crypto/CMakeFiles/obj_cncrypto.dir/hash.c.o
[ 51%] Building C object src/crypto/CMakeFiles/obj_cncrypto.dir/hmac-keccak.c.o
[ 52%] Building C object src/crypto/CMakeFiles/obj_cncrypto.dir/jh.c.o
[ 52%] Building C object src/crypto/CMakeFiles/obj_cncrypto.dir/keccak.c.o
[ 52%] Building C object src/crypto/CMakeFiles/obj_cncrypto.dir/oaes_lib.c.o
[ 53%] Building C object src/crypto/CMakeFiles/obj_cncrypto.dir/random.c.o
[ 53%] Building C object src/crypto/CMakeFiles/obj_cncrypto.dir/skein.c.o
[ 53%] Building C object src/crypto/CMakeFiles/obj_cncrypto.dir/slow-hash.c.o
[ 53%] Building C object src/crypto/CMakeFiles/obj_cncrypto.dir/rx-slow-hash.c.o
/home/vagrant/slave/monero-gui-ubuntu-i686/build/monero/src/crypto/rx-slow-hash.c:103:13: warning: 'cpuid' defined but not used [-Wunused-function]
 static void cpuid(int CPUInfo[4], int InfoType)
             ^
[ 55%] Building C object src/crypto/CMakeFiles/obj_cncrypto.dir/CryptonightR_JIT.c.o
[ 55%] Building C object src/crypto/CMakeFiles/obj_cncrypto.dir/tree-hash.c.o
[ 55%] Built target obj_cncrypto
Scanning dependencies of target cncrypto
[ 55%] Linking CXX static library libcncrypto.a
[ 55%] Built target cncrypto
Scanning dependencies of target generate_translations_header
[ 55%] Creating directories for 'generate_translations_header'
[ 55%] No download step for 'generate_translations_header'
[ 55%] No patch step for 'generate_translations_header'
[ 56%] No update step for 'generate_translations_header'
[ 56%] Performing configure step for 'generate_translations_header'
-- The C compiler identification is GNU 5.4.0
-- The CXX compiler identification is GNU 5.4.0
-- Check for working C compiler: /usr/bin/cc
-- Check for working C compiler: /usr/bin/cc -- works
-- Detecting C compiler ABI info
-- Detecting C compiler ABI info - done
-- Detecting C compile features
-- Detecting C compile features - done
-- Check for working CXX compiler: /usr/bin/c++
-- Check for working CXX compiler: /usr/bin/c++ -- works
-- Detecting CXX compiler ABI info
-- Detecting CXX compiler ABI info - done
-- Detecting CXX compile features
-- Detecting CXX compile features - done
lrelease version 5.7.0
-- Configuring done
-- Generating done
-- Build files have been written to: /home/vagrant/slave/monero-gui-ubuntu-i686/build/monero/build/release-static/translations
[ 56%] Performing build step for 'generate_translations_header'
Scanning dependencies of target generate_translations_header
[ 50%] Building C object CMakeFiles/generate_translations_header.dir/generate_translations_header.c.o
[100%] Linking C executable generate_translations_header
Updating 'monero_fi.qm'...
    Generated 0 translation(s) (0 finished and 0 unfinished)
    Ignored 1078 untranslated source text(s)
Updating 'monero_de.qm'...
    Generated 67 translation(s) (56 finished and 11 unfinished)
    Ignored 1011 untranslated source text(s)
Updating 'monero_ar.qm'...
    Generated 0 translation(s) (0 finished and 0 unfinished)
    Ignored 1078 untranslated source text(s)
Updating 'monero_bn.qm'...
    Generated 0 translation(s) (0 finished and 0 unfinished)
    Ignored 1078 untranslated source text(s)
Updating 'monero_ur.qm'...
    Generated 0 translation(s) (0 finished and 0 unfinished)
    Ignored 1078 untranslated source text(s)
Updating 'monero_hi.qm'...
    Generated 163 translation(s) (124 finished and 39 unfinished)
    Ignored 915 untranslated source text(s)
Updating 'monero_kmr.qm'...
    Generated 0 translation(s) (0 finished and 0 unfinished)
    Ignored 1078 untranslated source text(s)
Updating 'monero_ja.qm'...
    Generated 317 translation(s) (291 finished and 26 unfinished)
    Ignored 761 untranslated source text(s)
Updating 'monero_da.qm'...
    Generated 0 translation(s) (0 finished and 0 unfinished)
    Ignored 1078 untranslated source text(s)
Updating 'monero_ru.qm'...
    Generated 0 translation(s) (0 finished and 0 unfinished)
    Ignored 1078 untranslated source text(s)
Updating 'monero_ro.qm'...
    Generated 0 translation(s) (0 finished and 0 unfinished)
    Ignored 1078 untranslated source text(s)
Updating 'monero_he.qm'...
    Generated 0 translation(s) (0 finished and 0 unfinished)
    Ignored 1078 untranslated source text(s)
Updating 'monero_zu.qm.qm'...
    Generated 0 translation(s) (0 finished and 0 unfinished)
    Ignored 1078 untranslated source text(s)
Updating 'monero_ko.qm'...
    Generated 0 translation(s) (0 finished and 0 unfinished)
    Ignored 1078 untranslated source text(s)
Updating 'monero_fr.qm'...
    Generated 791 translation(s) (788 finished and 3 unfinished)
    Ignored 287 untranslated source text(s)
Updating 'monero_tr.qm'...
    Generated 2 translation(s) (1 finished and 1 unfinished)
    Ignored 1076 untranslated source text(s)
Updating 'monero_pt-br.qm'...
    Generated 0 translation(s) (0 finished and 0 unfinished)
    Ignored 1078 untranslated source text(s)
Updating 'monero_hu.qm'...
    Generated 0 translation(s) (0 finished and 0 unfinished)
    Ignored 1078 untranslated source text(s)
Updating 'monero_es.qm'...
    Generated 138 translation(s) (100 finished and 38 unfinished)
    Ignored 940 untranslated source text(s)
Updating 'monero_sl.qm'...
    Generated 0 translation(s) (0 finished and 0 unfinished)
    Ignored 1078 untranslated source text(s)
Updating 'monero_pl.qm'...
    Generated 16 translation(s) (9 finished and 7 unfinished)
    Ignored 1062 untranslated source text(s)
Updating 'monero_sv.qm'...
    Generated 611 translation(s) (589 finished and 22 unfinished)
    Ignored 467 untranslated source text(s)
Updating 'monero_it.qm'...
    Generated 778 translation(s) (754 finished and 24 unfinished)
    Ignored 300 untranslated source text(s)
Updating 'monero_hr.qm'...
    Generated 0 translation(s) (0 finished and 0 unfinished)
    Ignored 1078 untranslated source text(s)
Updating 'monero_uk.qm'...
    Generated 0 translation(s) (0 finished and 0 unfinished)
    Ignored 1078 untranslated source text(s)
Updating 'monero_cat.qm'...
    Generated 0 translation(s) (0 finished and 0 unfinished)
    Ignored 1078 untranslated source text(s)
Updating 'monero_cs.qm'...
    Generated 0 translation(s) (0 finished and 0 unfinished)
    Ignored 1078 untranslated source text(s)
Updating 'monero.qm'...
    Generated 0 translation(s) (0 finished and 0 unfinished)
    Ignored 1078 untranslated source text(s)
Updating 'monero_eo.qm'...
    Generated 0 translation(s) (0 finished and 0 unfinished)
    Ignored 1078 untranslated source text(s)
Updating 'monero_zh-tw.qm'...
    Generated 0 translation(s) (0 finished and 0 unfinished)
    Ignored 1078 untranslated source text(s)
Updating 'monero_sr.qm'...
    Generated 0 translation(s) (0 finished and 0 unfinished)
    Ignored 1078 untranslated source text(s)
Updating 'monero_fa.qm'...
    Generated 0 translation(s) (0 finished and 0 unfinished)
    Ignored 1078 untranslated source text(s)
Updating 'monero_id.qm'...
    Generated 0 translation(s) (0 finished and 0 unfinished)
    Ignored 1078 untranslated source text(s)
Updating 'monero_nl.qm'...
    Generated 71 translation(s) (47 finished and 24 unfinished)
    Ignored 1007 untranslated source text(s)
Updating 'monero_bg.qm'...
    Generated 0 translation(s) (0 finished and 0 unfinished)
    Ignored 1078 untranslated source text(s)
Updating 'monero_lt.qm'...
    Generated 0 translation(s) (0 finished and 0 unfinished)
    Ignored 1078 untranslated source text(s)
Updating 'monero_zh-cn.qm'...
    Generated 0 translation(s) (0 finished and 0 unfinished)
    Ignored 1078 untranslated source text(s)
Updating 'monero_ga.qm'...
    Generated 0 translation(s) (0 finished and 0 unfinished)
    Ignored 1078 untranslated source text(s)
Updating 'monero_pt-pt.qm'...
    Generated 0 translation(s) (0 finished and 0 unfinished)
    Ignored 1078 untranslated source text(s)
Updating 'monero_sk.qm'...
    Generated 6 translation(s) (5 finished and 1 unfinished)
    Ignored 1072 untranslated source text(s)
Generating embedded translations header
[100%] Built target generate_translations_header
[ 57%] Performing install step for 'generate_translations_header'

[ 57%] Completed 'generate_translations_header'
[ 57%] Built target generate_translations_header
Scanning dependencies of target obj_common
[ 57%] Building CXX object src/common/CMakeFiles/obj_common.dir/base58.cpp.o
[ 58%] Building CXX object src/common/CMakeFiles/obj_common.dir/command_line.cpp.o
[ 58%] Building CXX object src/common/CMakeFiles/obj_common.dir/dns_utils.cpp.o
[ 58%] Building CXX object src/common/CMakeFiles/obj_common.dir/download.cpp.o
[ 58%] Building CXX object src/common/CMakeFiles/obj_common.dir/error.cpp.o
[ 60%] Building CXX object src/common/CMakeFiles/obj_common.dir/expect.cpp.o
[ 60%] Building CXX object src/common/CMakeFiles/obj_common.dir/util.cpp.o
[ 60%] Building CXX object src/common/CMakeFiles/obj_common.dir/i18n.cpp.o
[ 61%] Building CXX object src/common/CMakeFiles/obj_common.dir/notify.cpp.o
[ 61%] Building CXX object src/common/CMakeFiles/obj_common.dir/password.cpp.o
[ 61%] Building CXX object src/common/CMakeFiles/obj_common.dir/perf_timer.cpp.o
[ 61%] Building CXX object src/common/CMakeFiles/obj_common.dir/pruning.cpp.o
[ 62%] Building CXX object src/common/CMakeFiles/obj_common.dir/spawn.cpp.o
[ 62%] Building CXX object src/common/CMakeFiles/obj_common.dir/threadpool.cpp.o
[ 62%] Building CXX object src/common/CMakeFiles/obj_common.dir/updates.cpp.o
[ 63%] Building C object src/common/CMakeFiles/obj_common.dir/aligned.c.o
[ 63%] Building CXX object src/common/CMakeFiles/obj_common.dir/timings.cc.o
[ 63%] Building CXX object src/common/CMakeFiles/obj_common.dir/combinator.cpp.o
[ 63%] Building CXX object src/common/CMakeFiles/obj_common.dir/stack_trace.cpp.o
[ 63%] Built target obj_common
Scanning dependencies of target common
[ 63%] Linking CXX static library libcommon.a
[ 63%] Built target common
Scanning dependencies of target obj_ringct_basic
[ 63%] Building CXX object src/ringct/CMakeFiles/obj_ringct_basic.dir/rctOps.cpp.o
[ 63%] Building CXX object src/ringct/CMakeFiles/obj_ringct_basic.dir/rctTypes.cpp.o
[ 65%] Building C object src/ringct/CMakeFiles/obj_ringct_basic.dir/rctCryptoOps.c.o
[ 65%] Building CXX object src/ringct/CMakeFiles/obj_ringct_basic.dir/multiexp.cc.o
[ 65%] Building CXX object src/ringct/CMakeFiles/obj_ringct_basic.dir/bulletproofs.cc.o
[ 65%] Built target obj_ringct_basic
Scanning dependencies of target ringct_basic
[ 65%] Linking CXX static library libringct_basic.a
[ 65%] Built target ringct_basic
[ 65%] Generating generated_stagenet_blocks.c
[ 65%] Generating generated_checkpoints.c
[ 66%] Generating generated_testnet_blocks.c
Scanning dependencies of target blocks
[ 66%] Building CXX object src/blocks/CMakeFiles/blocks.dir/blocks.cpp.o
[ 66%] Building C object src/blocks/CMakeFiles/blocks.dir/generated_checkpoints.c.o
[ 67%] Building C object src/blocks/CMakeFiles/blocks.dir/generated_testnet_blocks.c.o
[ 67%] Building C object src/blocks/CMakeFiles/blocks.dir/generated_stagenet_blocks.c.o
[ 67%] Linking CXX static library libblocks.a
[ 67%] Built target blocks
Scanning dependencies of target device
[ 67%] Linking CXX static library libdevice.a
[ 67%] Built target device
Scanning dependencies of target libminiupnpc-static
[ 67%] Building C object external/miniupnp/miniupnpc/CMakeFiles/libminiupnpc-static.dir/igd_desc_parse.c.o
[ 68%] Building C object external/miniupnp/miniupnpc/CMakeFiles/libminiupnpc-static.dir/miniupnpc.c.o
[ 68%] Building C object external/miniupnp/miniupnpc/CMakeFiles/libminiupnpc-static.dir/minixml.c.o
[ 68%] Building C object external/miniupnp/miniupnpc/CMakeFiles/libminiupnpc-static.dir/minisoap.c.o
[ 68%] Building C object external/miniupnp/miniupnpc/CMakeFiles/libminiupnpc-static.dir/minissdpc.c.o
[ 70%] Building C object external/miniupnp/miniupnpc/CMakeFiles/libminiupnpc-static.dir/miniwget.c.o
[ 70%] Building C object external/miniupnp/miniupnpc/CMakeFiles/libminiupnpc-static.dir/upnpcommands.c.o
[ 70%] Building C object external/miniupnp/miniupnpc/CMakeFiles/libminiupnpc-static.dir/upnpdev.c.o
[ 71%] Building C object external/miniupnp/miniupnpc/CMakeFiles/libminiupnpc-static.dir/upnpreplyparse.c.o
[ 71%] Building C object external/miniupnp/miniupnpc/CMakeFiles/libminiupnpc-static.dir/upnperrors.c.o
[ 71%] Building C object external/miniupnp/miniupnpc/CMakeFiles/libminiupnpc-static.dir/connecthostport.c.o
[ 71%] Building C object external/miniupnp/miniupnpc/CMakeFiles/libminiupnpc-static.dir/portlistingparse.c.o
[ 72%] Building C object external/miniupnp/miniupnpc/CMakeFiles/libminiupnpc-static.dir/receivedata.c.o
[ 72%] Linking C static library libminiupnpc.a
[ 72%] Built target libminiupnpc-static
Scanning dependencies of target lmdb
[ 72%] Building C object external/db_drivers/liblmdb/CMakeFiles/lmdb.dir/mdb.c.o
[ 73%] Building C object external/db_drivers/liblmdb/CMakeFiles/lmdb.dir/midl.c.o
[ 73%] Linking C static library liblmdb.a
[ 73%] Built target lmdb
Scanning dependencies of target epee_readline
[ 73%] Building CXX object contrib/epee/src/CMakeFiles/epee_readline.dir/readline_buffer.cpp.o
[ 75%] Linking CXX static library libepee_readline.a
[ 75%] Built target epee_readline
Scanning dependencies of target obj_ringct
[ 75%] Building CXX object src/ringct/CMakeFiles/obj_ringct.dir/rctSigs.cpp.o
[ 75%] Built target obj_ringct
Scanning dependencies of target obj_checkpoints
[ 75%] Building CXX object src/checkpoints/CMakeFiles/obj_checkpoints.dir/checkpoints.cpp.o
[ 75%] Built target obj_checkpoints
Scanning dependencies of target checkpoints
[ 76%] Linking CXX static library libcheckpoints.a
[ 76%] Built target checkpoints
Scanning dependencies of target obj_cryptonote_basic
[ 77%] Building CXX object src/cryptonote_basic/CMakeFiles/obj_cryptonote_basic.dir/account.cpp.o
[ 77%] Building CXX object src/cryptonote_basic/CMakeFiles/obj_cryptonote_basic.dir/cryptonote_basic_impl.cpp.o
[ 77%] Building CXX object src/cryptonote_basic/CMakeFiles/obj_cryptonote_basic.dir/cryptonote_format_utils.cpp.o
[ 78%] Building CXX object src/cryptonote_basic/CMakeFiles/obj_cryptonote_basic.dir/difficulty.cpp.o
[ 78%] Building CXX object src/cryptonote_basic/CMakeFiles/obj_cryptonote_basic.dir/hardfork.cpp.o
[ 78%] Building CXX object src/cryptonote_basic/CMakeFiles/obj_cryptonote_basic.dir/miner.cpp.o
[ 78%] Built target obj_cryptonote_basic
Scanning dependencies of target cryptonote_basic
[ 78%] Linking CXX static library libcryptonote_basic.a
[ 78%] Built target cryptonote_basic
Scanning dependencies of target ringct
[ 78%] Linking CXX static library libringct.a
[ 78%] Built target ringct
Scanning dependencies of target obj_cryptonote_core
[ 78%] Building CXX object src/cryptonote_core/CMakeFiles/obj_cryptonote_core.dir/blockchain.cpp.o
[ 80%] Building CXX object src/cryptonote_core/CMakeFiles/obj_cryptonote_core.dir/cryptonote_core.cpp.o
[ 80%] Building CXX object src/cryptonote_core/CMakeFiles/obj_cryptonote_core.dir/tx_pool.cpp.o
[ 80%] Building CXX object src/cryptonote_core/CMakeFiles/obj_cryptonote_core.dir/tx_sanity_check.cpp.o
[ 81%] Building CXX object src/cryptonote_core/CMakeFiles/obj_cryptonote_core.dir/cryptonote_tx_utils.cpp.o
[ 81%] Built target obj_cryptonote_core
Scanning dependencies of target obj_multisig
[ 82%] Building CXX object src/multisig/CMakeFiles/obj_multisig.dir/multisig.cpp.o
[ 82%] Built target obj_multisig
Scanning dependencies of target multisig
[ 83%] Linking CXX static library libmultisig.a
[ 83%] Built target multisig
Scanning dependencies of target obj_hardforks
[ 83%] Building CXX object src/hardforks/CMakeFiles/obj_hardforks.dir/hardforks.cpp.o
[ 83%] Built target obj_hardforks
Scanning dependencies of target hardforks
[ 83%] Linking CXX static library libhardforks.a
[ 83%] Built target hardforks
Scanning dependencies of target obj_blockchain_db
[ 83%] Building CXX object src/blockchain_db/CMakeFiles/obj_blockchain_db.dir/blockchain_db.cpp.o
[ 85%] Building CXX object src/blockchain_db/CMakeFiles/obj_blockchain_db.dir/lmdb/db_lmdb.cpp.o
[ 85%] Built target obj_blockchain_db
Scanning dependencies of target blockchain_db
[ 85%] Linking CXX static library libblockchain_db.a
[ 85%] Built target blockchain_db
Scanning dependencies of target cryptonote_core
[ 86%] Linking CXX static library libcryptonote_core.a
[ 86%] Built target cryptonote_core
Scanning dependencies of target obj_net
[ 86%] Building CXX object src/net/CMakeFiles/obj_net.dir/dandelionpp.cpp.o
[ 86%] Building CXX object src/net/CMakeFiles/obj_net.dir/error.cpp.o
[ 87%] Building CXX object src/net/CMakeFiles/obj_net.dir/i2p_address.cpp.o
[ 87%] Building CXX object src/net/CMakeFiles/obj_net.dir/parse.cpp.o
[ 87%] Building CXX object src/net/CMakeFiles/obj_net.dir/socks.cpp.o
[ 87%] Building CXX object src/net/CMakeFiles/obj_net.dir/socks_connect.cpp.o
[ 88%] Building CXX object src/net/CMakeFiles/obj_net.dir/tor_address.cpp.o
[ 88%] Building CXX object src/net/CMakeFiles/obj_net.dir/zmq.cpp.o
[ 88%] Built target obj_net
Scanning dependencies of target net
[ 88%] Linking CXX static library libnet.a
[ 88%] Built target net
Scanning dependencies of target obj_rpc_base
[ 90%] Building CXX object src/rpc/CMakeFiles/obj_rpc_base.dir/rpc_args.cpp.o
[ 90%] Built target obj_rpc_base
Scanning dependencies of target rpc_base
[ 91%] Linking CXX static library librpc_base.a
[ 91%] Built target rpc_base
Scanning dependencies of target obj_rpc
[ 92%] Building CXX object src/rpc/CMakeFiles/obj_rpc.dir/bootstrap_daemon.cpp.o
[ 92%] Building CXX object src/rpc/CMakeFiles/obj_rpc.dir/core_rpc_server.cpp.o
[ 92%] Building CXX object src/rpc/CMakeFiles/obj_rpc.dir/rpc_handler.cpp.o
[ 92%] Building CXX object src/rpc/CMakeFiles/obj_rpc.dir/instanciations.cpp.o
[ 92%] Built target obj_rpc
Scanning dependencies of target obj_p2p
[ 92%] Building CXX object src/p2p/CMakeFiles/obj_p2p.dir/net_peerlist.cpp.o
[ 93%] Building CXX object src/p2p/CMakeFiles/obj_p2p.dir/net_node.cpp.o
[ 93%] Built target obj_p2p
Scanning dependencies of target p2p
[ 93%] Linking CXX static library libp2p.a
[ 93%] Built target p2p
Scanning dependencies of target obj_cryptonote_protocol
[ 93%] Building CXX object src/cryptonote_protocol/CMakeFiles/obj_cryptonote_protocol.dir/cryptonote_protocol_handler-base.cpp.o
[ 93%] Building CXX object src/cryptonote_protocol/CMakeFiles/obj_cryptonote_protocol.dir/block_queue.cpp.o
[ 93%] Building CXX object src/cryptonote_protocol/CMakeFiles/obj_cryptonote_protocol.dir/levin_notify.cpp.o
[ 93%] Built target obj_cryptonote_protocol
Scanning dependencies of target cryptonote_protocol
[ 93%] Linking CXX static library libcryptonote_protocol.a
[ 93%] Built target cryptonote_protocol
Scanning dependencies of target rpc
[ 93%] Linking CXX static library librpc.a
[ 93%] Built target rpc
Scanning dependencies of target obj_daemon_messages
[ 95%] Building CXX object src/rpc/CMakeFiles/obj_daemon_messages.dir/message.cpp.o
[ 95%] Building CXX object src/rpc/CMakeFiles/obj_daemon_messages.dir/daemon_messages.cpp.o
[ 95%] Built target obj_daemon_messages
Scanning dependencies of target obj_serialization
[ 95%] Building CXX object src/serialization/CMakeFiles/obj_serialization.dir/json_object.cpp.o
[ 95%] Built target obj_serialization
Scanning dependencies of target serialization
[ 95%] Linking CXX static library libserialization.a
[ 95%] Built target serialization
Scanning dependencies of target daemon_messages
[ 95%] Linking CXX static library libdaemon_messages.a
[ 95%] Built target daemon_messages
Scanning dependencies of target obj_daemon_rpc_server
[ 95%] Building CXX object src/rpc/CMakeFiles/obj_daemon_rpc_server.dir/daemon_handler.cpp.o
[ 96%] Building CXX object src/rpc/CMakeFiles/obj_daemon_rpc_server.dir/zmq_server.cpp.o
[ 96%] Built target obj_daemon_rpc_server
Scanning dependencies of target daemon_rpc_server
[ 97%] Linking CXX static library libdaemon_rpc_server.a
[ 97%] Built target daemon_rpc_server
Scanning dependencies of target obj_daemonizer
[ 97%] Building CXX object src/daemonizer/CMakeFiles/obj_daemonizer.dir/posix_fork.cpp.o
[ 97%] Built target obj_daemonizer
Scanning dependencies of target daemonizer
[ 97%] Linking CXX static library libdaemonizer.a
[ 97%] Built target daemonizer
Scanning dependencies of target daemon
[ 97%] Building CXX object src/daemon/CMakeFiles/daemon.dir/command_parser_executor.cpp.o
[ 98%] Building CXX object src/daemon/CMakeFiles/daemon.dir/command_server.cpp.o
[ 98%] Building CXX object src/daemon/CMakeFiles/daemon.dir/daemon.cpp.o
[ 98%] Building CXX object src/daemon/CMakeFiles/daemon.dir/executor.cpp.o
[ 98%] Building CXX object src/daemon/CMakeFiles/daemon.dir/main.cpp.o
[100%] Building CXX object src/daemon/CMakeFiles/daemon.dir/rpc_command_executor.cpp.o
[100%] Linking CXX executable ../../bin/monerod
[100%] Built target daemon
[  1%] Built target obj_device
[ 30%] Built target unbound
[ 30%] Built target easylogging
[ 38%] Built target randomx
[ 45%] Built target epee
[ 46%] Built target genversion
[ 47%] Built target obj_version
[ 47%] Built target version
[ 55%] Built target obj_cncrypto
[ 55%] Built target cncrypto
[ 57%] Built target generate_translations_header
[ 63%] Built target obj_common
[ 63%] Built target common
[ 65%] Built target obj_ringct_basic
[ 65%] Built target ringct_basic
[ 67%] Built target blocks
[ 67%] Built target device
[ 72%] Built target libminiupnpc-static
[ 73%] Built target lmdb
[ 75%] Built target epee_readline
[ 75%] Built target obj_ringct
[ 75%] Built target obj_checkpoints
[ 76%] Built target checkpoints
[ 78%] Built target obj_cryptonote_basic
[ 78%] Built target cryptonote_basic
[ 78%] Built target ringct
[ 81%] Built target obj_cryptonote_core
[ 82%] Built target obj_multisig
[ 83%] Built target multisig
[ 83%] Built target obj_hardforks
[ 83%] Built target hardforks
[ 85%] Built target obj_blockchain_db
[ 85%] Built target blockchain_db
[ 86%] Built target cryptonote_core
[ 88%] Built target obj_net
[ 88%] Built target net
[ 90%] Built target obj_rpc_base
[ 91%] Built target rpc_base
[ 92%] Built target obj_rpc
[ 93%] Built target obj_p2p
[ 93%] Built target p2p
[ 93%] Built target obj_cryptonote_protocol
[ 93%] Built target cryptonote_protocol
[ 93%] Built target rpc
[ 95%] Built target obj_daemon_messages
[ 95%] Built target obj_serialization
[ 95%] Built target serialization
[ 95%] Built target daemon_messages
[ 96%] Built target obj_daemon_rpc_server
[ 97%] Built target daemon_rpc_server
[ 97%] Built target obj_daemonizer
[ 97%] Built target daemonizer
[100%] Built target daemon
Install the project...
-- Install configuration: "Release"
-- Installing: /home/vagrant/slave/monero-gui-ubuntu-i686/build/monero/bin/monerod
~/slave/monero-gui-ubuntu-i686/build/monero/build/release-static ~/slave/monero-gui-ubuntu-i686/build ~/slave/monero-gui-ubuntu-i686/build
make: Entering directory '/home/vagrant/slave/monero-gui-ubuntu-i686/build/monero/build/release-static/contrib/epee'
make[1]: Entering directory '/home/vagrant/slave/monero-gui-ubuntu-i686/build/monero/build/release-static'
make[2]: Entering directory '/home/vagrant/slave/monero-gui-ubuntu-i686/build/monero/build/release-static'
make[2]: Leaving directory '/home/vagrant/slave/monero-gui-ubuntu-i686/build/monero/build/release-static'
[  0%] Built target easylogging
make[2]: Entering directory '/home/vagrant/slave/monero-gui-ubuntu-i686/build/monero/build/release-static'
make[2]: Leaving directory '/home/vagrant/slave/monero-gui-ubuntu-i686/build/monero/build/release-static'
[ 83%] Built target epee
make[2]: Entering directory '/home/vagrant/slave/monero-gui-ubuntu-i686/build/monero/build/release-static'
make[2]: Leaving directory '/home/vagrant/slave/monero-gui-ubuntu-i686/build/monero/build/release-static'
[100%] Built target epee_readline
make[1]: Leaving directory '/home/vagrant/slave/monero-gui-ubuntu-i686/build/monero/build/release-static'
Install the project...
-- Install configuration: "Release"
-- Installing: /home/vagrant/slave/monero-gui-ubuntu-i686/build/monero/lib/libepee.a
-- Installing: /home/vagrant/slave/monero-gui-ubuntu-i686/build/monero/lib/libepee_readline.a
make: Leaving directory '/home/vagrant/slave/monero-gui-ubuntu-i686/build/monero/build/release-static/contrib/epee'
make: Entering directory '/home/vagrant/slave/monero-gui-ubuntu-i686/build/monero/build/release-static/external/easylogging++'
make[1]: Entering directory '/home/vagrant/slave/monero-gui-ubuntu-i686/build/monero/build/release-static'
make[2]: Entering directory '/home/vagrant/slave/monero-gui-ubuntu-i686/build/monero/build/release-static'
make[2]: Leaving directory '/home/vagrant/slave/monero-gui-ubuntu-i686/build/monero/build/release-static'
Built target easylogging
make[1]: Leaving directory '/home/vagrant/slave/monero-gui-ubuntu-i686/build/monero/build/release-static'
Install the project...
-- Install configuration: "Release"
-- Installing: /home/vagrant/slave/monero-gui-ubuntu-i686/build/monero/lib/libeasylogging.a
make: Leaving directory '/home/vagrant/slave/monero-gui-ubuntu-i686/build/monero/build/release-static/external/easylogging++'
make: Entering directory '/home/vagrant/slave/monero-gui-ubuntu-i686/build/monero/build/release-static/external/db_drivers/liblmdb'
make[1]: Entering directory '/home/vagrant/slave/monero-gui-ubuntu-i686/build/monero/build/release-static'
make[2]: Entering directory '/home/vagrant/slave/monero-gui-ubuntu-i686/build/monero/build/release-static'
make[2]: Leaving directory '/home/vagrant/slave/monero-gui-ubuntu-i686/build/monero/build/release-static'
[100%] Built target lmdb
make[1]: Leaving directory '/home/vagrant/slave/monero-gui-ubuntu-i686/build/monero/build/release-static'
Install the project...
-- Install configuration: "Release"
-- Installing: /home/vagrant/slave/monero-gui-ubuntu-i686/build/monero/lib/liblmdb.a
make: Leaving directory '/home/vagrant/slave/monero-gui-ubuntu-i686/build/monero/build/release-static/external/db_drivers/liblmdb'
Installing libunbound...
~/slave/monero-gui-ubuntu-i686/build/monero/build/release-static/external/unbound ~/slave/monero-gui-ubuntu-i686/build/monero/build/release-static ~/slave/monero-gui-ubuntu-i686/build ~/slave/monero-gui-ubuntu-i686/build
[100%] Built target unbound
Install the project...
-- Install configuration: "Release"
-- Installing: /home/vagrant/slave/monero-gui-ubuntu-i686/build/monero/lib/libunbound.a
~/slave/monero-gui-ubuntu-i686/build/monero/build/release-static ~/slave/monero-gui-ubuntu-i686/build ~/slave/monero-gui-ubuntu-i686/build
~/slave/monero-gui-ubuntu-i686/build ~/slave/monero-gui-ubuntu-i686/build
+ '[' '' '!=' true ']'
+ make -C src/zxcvbn-c
make: Entering directory '/home/vagrant/slave/monero-gui-ubuntu-i686/build/src/zxcvbn-c'
g++ -I. -std=c++11 -O2 -Wall -Wextra \
	-o dictgen dict-generate.cpp 
dict-generate.cpp: In function 'void CreateArrays(NodeSPtr, StringIntSet_t&, StringOfInts&, Uint64Vect&, UintVect&)':
dict-generate.cpp:887:43: warning: format '%lu' expects argument of type 'long unsigned int', but argument 4 has type 'std::__cxx11::basic_string<int>::size_type {aka unsigned int}' [-Wformat=]
         snprintf(Tmp, sizeof Tmp, "%lu", x);
                                           ^
dict-generate.cpp:887:43: warning: format '%lu' expects argument of type 'long unsigned int', but argument 4 has type 'std::__cxx11::basic_string<int>::size_type {aka unsigned int}' [-Wformat=]
./dictgen -o dict-src.h words-eng_wiki.txt words-female.txt words-male.txt words-passwd.txt words-surname.txt words-tv_film.txt
cc -I. -O2 -Wall -Wextra -Wdeclaration-after-statement -c -o zxcvbn-inline.o zxcvbn.c
ar cvq libzxcvbn.a zxcvbn-inline.o
a - zxcvbn-inline.o
cc -I. -O2 -Wall -Wextra -Wdeclaration-after-statement -o test-statlib test.c libzxcvbn.a  -lm
make: Leaving directory '/home/vagrant/slave/monero-gui-ubuntu-i686/build/src/zxcvbn-c'
+ '[' '!' -d build ']'
+ mkdir build
+ '[' '' '!=' true ']'
+ '[' linux32 == linux32 ']'
+ exists lsb_release
+ command -v lsb_release
++ lsb_release -is
+ distro=Ubuntu
+ '[' Ubuntu = Ubuntu ']'
+ CONFIG='CONFIG+=release static libunwind_off'
+ '[' linux32 == darwin ']'
+ '[' linux32 == mingw64 ']'
+ '[' linux32 == mingw32 ']'
+ get_tag
++ sed -e 's/[\t ]*//'
++ git rev-parse --short HEAD
+ COMMIT=8b5a906
+ test 0 -ne 0
+ echo 'You are currently on commit 8b5a906'
You are currently on commit 8b5a906
++ sed -e 's/[\t ]*//'
++ git rev-list --tags --max-count=1 --abbrev-commit
+ TAGGEDCOMMIT=0461a28
+ test -z 0461a28
+ echo 'The most recent tag was at 0461a28'
+ test 0461a28 = 8b5a906
+ echo 'You are ahead of or behind a tagged release'
+ VERSIONTAG=8b5a906
The most recent tag was at 0461a28
You are ahead of or behind a tagged release
++ sed -e 's/[\t ]*//'
++ git describe --tags
+ TAGNAME=v0.14.1.2-81-g8b5a906
+ test -z v0.14.1.2-81-g8b5a906
+ echo 'var GUI_VERSION = "v0.14.1.2-81-g8b5a906"'
+ pushd monero
+ get_tag
~/slave/monero-gui-ubuntu-i686/build/monero ~/slave/monero-gui-ubuntu-i686/build ~/slave/monero-gui-ubuntu-i686/build
++ sed -e 's/[\t ]*//'
++ git rev-parse --short HEAD
+ COMMIT=b864375
+ test 0 -ne 0
+ echo 'You are currently on commit b864375'
You are currently on commit b864375
++ sed -e 's/[\t ]*//'
++ git rev-list --tags --max-count=1 --abbrev-commit
+ TAGGEDCOMMIT=8f0aedf
+ test -z 8f0aedf
+ echo 'The most recent tag was at 8f0aedf'
+ test 8f0aedf = b864375
+ echo 'You are ahead of or behind a tagged release'
+ VERSIONTAG=b864375
The most recent tag was at 8f0aedf
You are ahead of or behind a tagged release
++ sed -e 's/[\t ]*//'
++ git describe --tags
+ TAGNAME=v0.13.0.1-RC1-2009-gb864375
+ test -z v0.13.0.1-RC1-2009-gb864375
+ popd
+ echo 'var GUI_MONERO_VERSION = "v0.13.0.1-RC1-2009-gb864375"'
+ cd build
~/slave/monero-gui-ubuntu-i686/build ~/slave/monero-gui-ubuntu-i686/build
++ find_command qmake qmake-qt5
++ for arg in '"[email protected]"'
++ exists qmake
++ command -v qmake
++ echo qmake
++ return 0
+ QMAKE=qmake
+ qmake ../monero-wallet-gui.pro 'CONFIG+=release static libunwind_off'
Info: creating stash file /home/vagrant/slave/monero-gui-ubuntu-i686/build/build/.qmake.stash
Project ERROR: Can't build with Qt 5.7.0. Use at least Qt 5.9.7
+ exit
program finished with exit code 3
elapsedTime=700.044667