(view as text)
make debug-static-all
 in dir /home/vagrant/slave/monero-debug-static-ubuntu-amd64/build (timeout 1200 secs)
 watching logfiles {}
 argv: ['make', 'debug-static-all']
 environment:
  HOME=/home/vagrant
  LANG=en_US
  LANGUAGE=en_US:
  LESSCLOSE=/usr/bin/lesspipe %s %s
  LESSOPEN=| /usr/bin/lesspipe %s
  LOGNAME=vagrant
  LS_COLORS=rs=0:di=01;34:ln=01;36:mh=00:pi=40;33:so=01;35:do=01;35:bd=40;33;01:cd=40;33;01:or=40;31;01:mi=00:su=37;41:sg=30;43:ca=30;41:tw=30;42:ow=34;42:st=37;44:ex=01;32:*.tar=01;31:*.tgz=01;31:*.arc=01;31:*.arj=01;31:*.taz=01;31:*.lha=01;31:*.lz4=01;31:*.lzh=01;31:*.lzma=01;31:*.tlz=01;31:*.txz=01;31:*.tzo=01;31:*.t7z=01;31:*.zip=01;31:*.z=01;31:*.Z=01;31:*.dz=01;31:*.gz=01;31:*.lrz=01;31:*.lz=01;31:*.lzo=01;31:*.xz=01;31:*.bz2=01;31:*.bz=01;31:*.tbz=01;31:*.tbz2=01;31:*.tz=01;31:*.deb=01;31:*.rpm=01;31:*.jar=01;31:*.war=01;31:*.ear=01;31:*.sar=01;31:*.rar=01;31:*.alz=01;31:*.ace=01;31:*.zoo=01;31:*.cpio=01;31:*.7z=01;31:*.rz=01;31:*.cab=01;31:*.jpg=01;35:*.jpeg=01;35:*.gif=01;35:*.bmp=01;35:*.pbm=01;35:*.pgm=01;35:*.ppm=01;35:*.tga=01;35:*.xbm=01;35:*.xpm=01;35:*.tif=01;35:*.tiff=01;35:*.png=01;35:*.svg=01;35:*.svgz=01;35:*.mng=01;35:*.pcx=01;35:*.mov=01;35:*.mpg=01;35:*.mpeg=01;35:*.m2v=01;35:*.mkv=01;35:*.webm=01;35:*.ogm=01;35:*.mp4=01;35:*.m4v=01;35:*.mp4v=01;35:*.vob=01;35:*.qt=01;35:*.nuv=01;35:*.wmv=01;35:*.asf=01;35:*.rm=01;35:*.rmvb=01;35:*.flc=01;35:*.avi=01;35:*.fli=01;35:*.flv=01;35:*.gl=01;35:*.dl=01;35:*.xcf=01;35:*.xwd=01;35:*.yuv=01;35:*.cgm=01;35:*.emf=01;35:*.ogv=01;35:*.ogx=01;35:*.aac=00;36:*.au=00;36:*.flac=00;36:*.m4a=00;36:*.mid=00;36:*.midi=00;36:*.mka=00;36:*.mp3=00;36:*.mpc=00;36:*.ogg=00;36:*.ra=00;36:*.wav=00;36:*.oga=00;36:*.opus=00;36:*.spx=00;36:*.xspf=00;36:
  MAIL=/var/mail/vagrant
  PATH=/home/vagrant/bin:/home/vagrant/.local/bin:/usr/local/sbin:/usr/local/bin:/usr/sbin:/usr/bin:/sbin:/bin:/usr/games:/usr/local/games
  PWD=/home/vagrant/slave/monero-debug-static-ubuntu-amd64/build
  SHELL=/bin/bash
  SHLVL=1
  SSH_CLIENT=10.0.2.2 34046 22
  SSH_CONNECTION=10.0.2.2 34046 10.0.2.15 22
  SSH_TTY=/dev/pts/0
  TERM=xterm
  USER=vagrant
  USE_SINGLE_BUILDDIR=1
  XDG_RUNTIME_DIR=/run/user/900
  XDG_SESSION_ID=2
  _=/usr/local/bin/buildslave
 using PTY: False
mkdir -p build/debug
cd build/debug && cmake -D BUILD_TESTS=ON -D STATIC=ON -D CMAKE_BUILD_TYPE=Debug ../.. && make
-- CMake version 3.5.1
-- The C compiler identification is GNU 5.4.0
-- The CXX compiler identification is GNU 5.4.0
-- Check for working C compiler: /usr/bin/cc
-- Check for working C compiler: /usr/bin/cc -- works
-- Detecting C compiler ABI info
-- Detecting C compiler ABI info - done
-- Detecting C compile features
-- Detecting C compile features - done
-- Check for working CXX compiler: /usr/bin/c++
-- Check for working CXX compiler: /usr/bin/c++ -- works
-- Detecting CXX compiler ABI info
-- Detecting CXX compiler ABI info - done
-- Detecting CXX compile features
-- Detecting CXX compile features - done
-- The ASM compiler identification is GNU
-- Found assembler: /usr/bin/cc
-- Building without build tag
-- Found Git: /usr/bin/git (found version "2.7.4") 
-- Checking submodules
-- Submodule 'external/miniupnp' is up-to-date
-- Submodule 'external/unbound' is up-to-date
-- Submodule 'external/rapidjson' is up-to-date
-- Submodule 'external/trezor-common' is up-to-date
-- Could not find DEVELOPER_LOCAL_TOOLS in env (not required)
-- BOOST_IGNORE_SYSTEM_PATHS defaults to OFF
-- Could not find DEVELOPER_LIBUNBOUND_OLD in env (not required)
-- Building for a 64-bit system
-- Building internal libraries as static
-- Could not find DATABASE in env (not required unless you want to change database type from default: lmdb)
-- Using LMDB as default DB type
-- Stack trace on exception enabled (using easylogging++)
-- Looking for pthread.h
-- Looking for pthread.h - found
-- Looking for pthread_create
-- Looking for pthread_create - not found
-- Check if compiler accepts -pthread
-- Check if compiler accepts -pthread - yes
-- Found Threads: TRUE  
-- Performing Test _pthread_c
-- Performing Test _pthread_c - Success
-- Performing Test _pthread_cxx
-- Performing Test _pthread_cxx - Success
-- Found OpenSSL: /usr/lib/x86_64-linux-gnu/libssl.a;/usr/lib/x86_64-linux-gnu/libcrypto.a (found version "1.0.2g") 
-- Using OpenSSL include dir at /usr/include
-- Found HIDAPI: /usr/local/lib/libhidapi-libusb.a  
-- Looking for memset_s in c
-- Looking for memset_s in c - not found
-- Looking for explicit_bzero in c
-- Looking for explicit_bzero in c - not found
-- Looking for strptime
-- Looking for strptime - found
-- Could NOT find MiniUPnPc (missing:  MINIUPNP_INCLUDE_DIR MINIUPNP_LIBRARY) 
-- Using in-tree miniupnpc
-- Looking for libunbound
-- Looking for arpa/inet.h
-- Looking for arpa/inet.h - found
-- Looking for endian.h
-- Looking for endian.h - found
-- Looking for dlfcn.h
-- Looking for dlfcn.h - found
-- Looking for event.h
-- Looking for event.h - found
-- Looking for getopt.h
-- Looking for getopt.h - found
-- Looking for glob.h
-- Looking for glob.h - found
-- Looking for grp.h
-- Looking for grp.h - found
-- Looking for inttypes.h
-- Looking for inttypes.h - found
-- Looking for iphlpapi.h
-- Looking for iphlpapi.h - not found
-- Looking for login_cap.h
-- Looking for login_cap.h - not found
-- Looking for memory.h
-- Looking for memory.h - found
-- Looking for netdb.h
-- Looking for netdb.h - found
-- Looking for netinet/in.h
-- Looking for netinet/in.h - found
-- Looking for pthread.h
-- Looking for pthread.h - found
-- Looking for pwd.h
-- Looking for pwd.h - found
-- Looking for stdarg.h
-- Looking for stdarg.h - found
-- Looking for stdbool.h
-- Looking for stdbool.h - found
-- Looking for stdint.h
-- Looking for stdint.h - found
-- Looking for stdlib.h
-- Looking for stdlib.h - found
-- Looking for strings.h
-- Looking for strings.h - found
-- Looking for string.h
-- Looking for string.h - found
-- Looking for sys/param.h
-- Looking for sys/param.h - found
-- Looking for sys/resource.h
-- Looking for sys/resource.h - found
-- Looking for sys/sha2.h
-- Looking for sys/sha2.h - not found
-- Looking for sys/socket.h
-- Looking for sys/socket.h - found
-- Looking for sys/stat.h
-- Looking for sys/stat.h - found
-- Looking for sys/sysctl.h
-- Looking for sys/sysctl.h - found
-- Looking for sys/types.h
-- Looking for sys/types.h - found
-- Looking for sys/uio.h
-- Looking for sys/uio.h - found
-- Looking for sys/un.h
-- Looking for sys/un.h - found
-- Looking for sys/wait.h
-- Looking for sys/wait.h - found
-- Looking for syslog.h
-- Looking for syslog.h - found
-- Looking for time.h
-- Looking for time.h - found
-- Looking for unistd.h
-- Looking for unistd.h - found
-- Looking for vfork.h
-- Looking for vfork.h - not found
-- Looking for windows.h
-- Looking for windows.h - not found
-- Looking for winsock2.h
-- Looking for winsock2.h - not found
-- Looking for ws2tcpip.h
-- Looking for ws2tcpip.h - not found
-- Looking for _beginthreadex
-- Looking for _beginthreadex - not found
-- Looking for arc4random
-- Looking for arc4random - not found
-- Looking for arc4random_uniform
-- Looking for arc4random_uniform - not found
-- Looking for chown
-- Looking for chown - found
-- Looking for chroot
-- Looking for chroot - found
-- Looking for ctime_r
-- Looking for ctime_r - found
-- Looking for daemon
-- Looking for daemon - found
-- Looking for endprotoent
-- Looking for endprotoent - found
-- Looking for endservent
-- Looking for endservent - found
-- Looking for fork
-- Looking for fork - found
-- Looking for fseeko
-- Looking for fseeko - found
-- Looking for fsync
-- Looking for fsync - found
-- Looking for getauxval
-- Looking for getauxval - found
-- Looking for getentropy
-- Looking for getentropy - not found
-- Looking for getpwnam
-- Looking for getpwnam - found
-- Looking for getrlimit
-- Looking for getrlimit - found
-- Looking for glob
-- Looking for glob - found
-- Looking for gmtime_r
-- Looking for gmtime_r - found
-- Looking for fcntl
-- Looking for fcntl - found
-- Looking for inet_aton
-- Looking for inet_aton - found
-- Looking for inet_ntop
-- Looking for inet_ntop - found
-- Looking for inet_pton
-- Looking for inet_pton - found
-- Looking for initgroups
-- Looking for initgroups - found
-- Looking for ioctlsocket
-- Looking for ioctlsocket - not found
-- Looking for isblank
-- Looking for isblank - found
-- Looking for kill
-- Looking for kill - found
-- Looking for localtime_r
-- Looking for localtime_r - found
-- Looking for malloc
-- Looking for malloc - found
-- Looking for memmove
-- Looking for memmove - found
-- Looking for random
-- Looking for random - found
-- Looking for reallocarray
-- Looking for reallocarray - not found
-- Looking for recvmsg
-- Looking for recvmsg - found
-- Looking for sbrk
-- Looking for sbrk - found
-- Looking for sendmsg
-- Looking for sendmsg - found
-- Looking for setregid
-- Looking for setregid - found
-- Looking for setresgid
-- Looking for setresgid - found
-- Looking for setresuid
-- Looking for setresuid - found
-- Looking for setreuid
-- Looking for setreuid - found
-- Looking for setrlimit
-- Looking for setrlimit - found
-- Looking for setsid
-- Looking for setsid - found
-- Looking for setusercontent
-- Looking for setusercontent - not found
-- Looking for sigprocmask
-- Looking for sigprocmask - found
-- Looking for sleep
-- Looking for sleep - found
-- Looking for snprintf
-- Looking for snprintf - found
-- Looking for socketpair
-- Looking for socketpair - found
-- Looking for srandom
-- Looking for srandom - found
-- Looking for strsep
-- Looking for strsep - found
-- Looking for strftime
-- Looking for strftime - found
-- Looking for strlcat
-- Looking for strlcat - not found
-- Looking for strlcpy
-- Looking for strlcpy - not found
-- Looking for strptime
-- Looking for strptime - found
-- Looking for tzset
-- Looking for tzset - found
-- Looking for usleep
-- Looking for usleep - found
-- Looking for writev
-- Looking for writev - found
-- Looking for getaddrinfo
-- Looking for getaddrinfo - found
-- Looking for stddef.h
-- Looking for stddef.h - found
-- Check size of time_t
-- Check size of time_t - done
-- Check size of gid_t
-- Check size of gid_t - done
-- Check size of in_addr_t
-- Check size of in_addr_t - done
-- Check size of in_port_t
-- Check size of in_port_t - done
-- Check size of int16_t
-- Check size of int16_t - done
-- Check size of int32_t
-- Check size of int32_t - done
-- Check size of int64_t
-- Check size of int64_t - done
-- Check size of int8_t
-- Check size of int8_t - done
-- Check size of pid_t
-- Check size of pid_t - done
-- Check size of rlim_t
-- Check size of rlim_t - done
-- Check size of ssize_t
-- Check size of ssize_t - done
-- Check size of uid_t
-- Check size of uid_t - done
-- Check size of uint16_t
-- Check size of uint16_t - done
-- Check size of uint32_t
-- Check size of uint32_t - done
-- Check size of uint64_t
-- Check size of uint64_t - done
-- Check size of uint8_t
-- Check size of uint8_t - done
-- Looking for PTHREAD_PRIO_INHERIT
-- Looking for PTHREAD_PRIO_INHERIT - not found
-- Looking for pthread_rwlock_t
-- Looking for pthread_rwlock_t - not found
-- Looking for pthread_spinlock_t
-- Looking for pthread_spinlock_t - not found
-- Looking for openssl/conf.h
-- Looking for openssl/conf.h - found
-- Looking for openssl/engine.h
-- Looking for openssl/engine.h - found
-- Looking for openssl/err.h
-- Looking for openssl/err.h - found
-- Looking for openssl/rand.h
-- Looking for openssl/rand.h - found
-- Looking for openssl/ssl.h
-- Looking for openssl/ssl.h - found
-- Looking for NID_secp384r1
-- Looking for NID_secp384r1 - found
-- Looking for NID_X9_62_prime256v1
-- Looking for NID_X9_62_prime256v1 - found
-- Looking for sk_SSL_COMP_pop_free
-- Looking for sk_SSL_COMP_pop_free - found
-- Looking for SSL_COMP_get_compression_methods
-- Looking for SSL_COMP_get_compression_methods - found
-- Looking for EVP_MD_CTX_new
-- Looking for EVP_MD_CTX_new - not found
-- Looking for EVP_sha1
-- Looking for EVP_sha1 - found
-- Looking for EVP_sha256
-- Looking for EVP_sha256 - found
-- Looking for EVP_sha512
-- Looking for EVP_sha512 - found
-- Looking for FIPS_mode
-- Looking for FIPS_mode - found
-- Looking for HMAC_Update
-- Looking for HMAC_Update - found
-- Looking for OPENSSL_config
-- Looking for OPENSSL_config - found
-- Looking for SHA512_Update
-- Looking for SHA512_Update - found
-- Found PkgConfig: /usr/bin/pkg-config (found version "0.29.1") 
-- Looking for LIBRESSL_VERSION_TEXT
-- Looking for LIBRESSL_VERSION_TEXT - not found
-- Using 64-bit LMDB from source tree
-- Looking for backtrace
-- Looking for backtrace - found
-- backtrace facility detected in default set of libraries
-- Backtrace_LIBRARY: 
-- Found Backtrace: /usr/include  
-- Using HIDAPI include dir at /usr/local/include/hidapi
-- Found Protobuf: /usr/lib/x86_64-linux-gnu/libprotobuf.a  
-- Protobuf lib: /usr/lib/x86_64-linux-gnu/libprotobuf.a, inc: /usr/include, protoc: /home/vagrant/bin/protoc
-- Found PythonInterp: /usr/bin/python (found version "2.7.12") 
-- Protobuf Compilation test failed: Change Dir: /home/vagrant/slave/monero-debug-static-ubuntu-amd64/build/build/debug/CMakeFiles/CMakeTmp

Run Build Command:"/usr/bin/make" "cmTC_5bd59/fast"
make[1]: Entering directory '/home/vagrant/slave/monero-debug-static-ubuntu-amd64/build/build/debug/CMakeFiles/CMakeTmp'
/usr/bin/make -f CMakeFiles/cmTC_5bd59.dir/build.make CMakeFiles/cmTC_5bd59.dir/build
make[2]: Entering directory '/home/vagrant/slave/monero-debug-static-ubuntu-amd64/build/build/debug/CMakeFiles/CMakeTmp'
Building CXX object CMakeFiles/cmTC_5bd59.dir/test-protobuf.pb.cc.o
/usr/bin/c++    -I/home/vagrant/slave/monero-debug-static-ubuntu-amd64/build/build/debug  -DZMQ_STATIC -pthread    -std=gnu++11 -o CMakeFiles/cmTC_5bd59.dir/test-protobuf.pb.cc.o -c /home/vagrant/slave/monero-debug-static-ubuntu-amd64/build/build/debug/test-protobuf.pb.cc
In file included from /home/vagrant/slave/monero-debug-static-ubuntu-amd64/build/build/debug/test-protobuf.pb.cc:4:0:
/home/vagrant/slave/monero-debug-static-ubuntu-amd64/build/build/debug/test-protobuf.pb.h:12:2: error: #error This file was generated by a newer version of protoc which is
 #error This file was generated by a newer version of protoc which is
  ^
/home/vagrant/slave/monero-debug-static-ubuntu-amd64/build/build/debug/test-protobuf.pb.h:13:2: error: #error incompatible with your Protocol Buffer headers. Please update
 #error incompatible with your Protocol Buffer headers.  Please update
  ^
/home/vagrant/slave/monero-debug-static-ubuntu-amd64/build/build/debug/test-protobuf.pb.h:14:2: error: #error your headers.
 #error your headers.
  ^
In file included from /home/vagrant/slave/monero-debug-static-ubuntu-amd64/build/build/debug/test-protobuf.pb.cc:4:0:
/home/vagrant/slave/monero-debug-static-ubuntu-amd64/build/build/debug/test-protobuf.pb.h:23:35: fatal error: google/protobuf/arena.h: No such file or directory
compilation terminated.
CMakeFiles/cmTC_5bd59.dir/build.make:65: recipe for target 'CMakeFiles/cmTC_5bd59.dir/test-protobuf.pb.cc.o' failed
make[2]: *** [CMakeFiles/cmTC_5bd59.dir/test-protobuf.pb.cc.o] Error 1
make[2]: Leaving directory '/home/vagrant/slave/monero-debug-static-ubuntu-amd64/build/build/debug/CMakeFiles/CMakeTmp'
Makefile:126: recipe for target 'cmTC_5bd59/fast' failed
make[1]: *** [cmTC_5bd59/fast] Error 2
make[1]: Leaving directory '/home/vagrant/slave/monero-debug-static-ubuntu-amd64/build/build/debug/CMakeFiles/CMakeTmp'
.
-- Building on x86_64 for native
-- Performing Test CC_SUPPORTS_MARCH_NATIVE
-- Performing Test CC_SUPPORTS_MARCH_NATIVE - Success
-- AES support enabled
-- Performing Test _Wformat_c
-- Performing Test _Wformat_c - Success
-- Performing Test _Wformat_cxx
-- Performing Test _Wformat_cxx - Success
-- Performing Test _Wformat_security_c
-- Performing Test _Wformat_security_c - Success
-- Performing Test _Wformat_security_cxx
-- Performing Test _Wformat_security_cxx - Success
-- Performing Test _fstack_protector_c
-- Performing Test _fstack_protector_c - Success
-- Performing Test _fstack_protector_cxx
-- Performing Test _fstack_protector_cxx - Success
-- Performing Test _fstack_protector_strong_c
-- Performing Test _fstack_protector_strong_c - Success
-- Performing Test _fstack_protector_strong_cxx
-- Performing Test _fstack_protector_strong_cxx - Success
-- Performing Test _fcf_protection=full_c
-- Performing Test _fcf_protection=full_c - Failed
-- Performing Test _fcf_protection=full_cxx
-- Performing Test _fcf_protection=full_cxx - Failed
-- Performing Test _fstack_clash_protection_c
-- Performing Test _fstack_clash_protection_c - Failed
-- Performing Test _fstack_clash_protection_cxx
-- Performing Test _fstack_clash_protection_cxx - Failed
-- Performing Test _mmitigate_rop_c
-- Performing Test _mmitigate_rop_c - Failed
-- Performing Test _mmitigate_rop_cxx
-- Performing Test _mmitigate_rop_cxx - Failed
-- Looking for -pie linker flag
-- Looking for -pie linker flag - found
-- Looking for -Wl,-z,relro linker flag
-- Looking for -Wl,-z,relro linker flag - found
-- Looking for -Wl,-z,now linker flag
-- Looking for -Wl,-z,now linker flag - found
-- Looking for -Wl,-z,noexecstack linker flag
-- Looking for -Wl,-z,noexecstack linker flag - found
-- Looking for -Wl,-z,noexecheap linker flag
-- Looking for -Wl,-z,noexecheap linker flag - not found
-- Using C security hardening flags:  -Wformat -Wformat-security -fstack-protector -fstack-protector-strong
-- Using C++ security hardening flags:  -Wformat -Wformat-security -fstack-protector -fstack-protector-strong
-- Using linker security hardening flags:  -pie -Wl,-z,relro -Wl,-z,now -Wl,-z,noexecstack
-- Found Boost Version: 106000
-- Found Readline: /usr/include  
-- Looking for rl_copy_text
-- Looking for rl_copy_text - not found
-- Looking for rl_filename_completion_function
-- Looking for rl_filename_completion_function - not found
-- Looking for rl_copy_text
-- Looking for rl_copy_text - found
-- Looking for rl_filename_completion_function
-- Looking for rl_filename_completion_function - found
-- Found readline library at: /usr
-- Found Git: /usr/bin/git
-- Trezor support disabled
-- Could NOT find GTest (missing:  GTEST_LIBRARY GTEST_INCLUDE_DIR GTEST_MAIN_LIBRARY) 
-- GTest not found on the system: will use GTest bundled with this source
-- Found Doxygen: /usr/bin/doxygen (found version "1.8.11") 
-- Performing Test HAVE_C11
-- Performing Test HAVE_C11 - Success
-- Configuring done
-- Generating done
-- Build files have been written to: /home/vagrant/slave/monero-debug-static-ubuntu-amd64/build/build/debug
make[1]: Entering directory '/home/vagrant/slave/monero-debug-static-ubuntu-amd64/build/build/debug'
make[2]: Entering directory '/home/vagrant/slave/monero-debug-static-ubuntu-amd64/build/build/debug'
make[3]: Entering directory '/home/vagrant/slave/monero-debug-static-ubuntu-amd64/build/build/debug'
Scanning dependencies of target generate_translations_header
make[3]: Leaving directory '/home/vagrant/slave/monero-debug-static-ubuntu-amd64/build/build/debug'
make[3]: Entering directory '/home/vagrant/slave/monero-debug-static-ubuntu-amd64/build/build/debug'
[  0%] Creating directories for 'generate_translations_header'
[  0%] No download step for 'generate_translations_header'
[  0%] No patch step for 'generate_translations_header'
[  0%] No update step for 'generate_translations_header'
[  1%] Performing configure step for 'generate_translations_header'
-- The C compiler identification is GNU 5.4.0
-- The CXX compiler identification is GNU 5.4.0
-- Check for working C compiler: /usr/bin/cc
-- Check for working C compiler: /usr/bin/cc -- works
-- Detecting C compiler ABI info
-- Detecting C compiler ABI info - done
-- Detecting C compile features
-- Detecting C compile features - done
-- Check for working CXX compiler: /usr/bin/c++
-- Check for working CXX compiler: /usr/bin/c++ -- works
-- Detecting CXX compiler ABI info
-- Detecting CXX compiler ABI info - done
-- Detecting CXX compile features
-- Detecting CXX compile features - done
lrelease: could not find a Qt installation of ''
CMake Warning at CMakeLists.txt:59 (message):
  lrelease program not working, translation files not built


-- Configuring done
-- Generating done
-- Build files have been written to: /home/vagrant/slave/monero-debug-static-ubuntu-amd64/build/build/debug/translations
[  1%] Performing build step for 'generate_translations_header'
make[4]: Entering directory '/home/vagrant/slave/monero-debug-static-ubuntu-amd64/build/build/debug/translations'
make[5]: Entering directory '/home/vagrant/slave/monero-debug-static-ubuntu-amd64/build/build/debug/translations'
make[6]: Entering directory '/home/vagrant/slave/monero-debug-static-ubuntu-amd64/build/build/debug/translations'
Scanning dependencies of target generate_translations_header
make[6]: Leaving directory '/home/vagrant/slave/monero-debug-static-ubuntu-amd64/build/build/debug/translations'
make[6]: Entering directory '/home/vagrant/slave/monero-debug-static-ubuntu-amd64/build/build/debug/translations'
[ 50%] Building C object CMakeFiles/generate_translations_header.dir/generate_translations_header.c.o
[100%] Linking C executable generate_translations_header
Generating embedded translations header
make[6]: Leaving directory '/home/vagrant/slave/monero-debug-static-ubuntu-amd64/build/build/debug/translations'
[100%] Built target generate_translations_header
make[5]: Leaving directory '/home/vagrant/slave/monero-debug-static-ubuntu-amd64/build/build/debug/translations'
make[4]: Leaving directory '/home/vagrant/slave/monero-debug-static-ubuntu-amd64/build/build/debug/translations'
[  2%] Performing install step for 'generate_translations_header'

[  2%] Completed 'generate_translations_header'
make[3]: Leaving directory '/home/vagrant/slave/monero-debug-static-ubuntu-amd64/build/build/debug'
[  2%] Built target generate_translations_header
make[3]: Entering directory '/home/vagrant/slave/monero-debug-static-ubuntu-amd64/build/build/debug'
Scanning dependencies of target libminiupnpc-static
make[3]: Leaving directory '/home/vagrant/slave/monero-debug-static-ubuntu-amd64/build/build/debug'
make[3]: Entering directory '/home/vagrant/slave/monero-debug-static-ubuntu-amd64/build/build/debug'
[  2%] Building C object external/miniupnp/miniupnpc/CMakeFiles/libminiupnpc-static.dir/igd_desc_parse.c.o
[  2%] Building C object external/miniupnp/miniupnpc/CMakeFiles/libminiupnpc-static.dir/miniupnpc.c.o
[  2%] Building C object external/miniupnp/miniupnpc/CMakeFiles/libminiupnpc-static.dir/minixml.c.o
[  3%] Building C object external/miniupnp/miniupnpc/CMakeFiles/libminiupnpc-static.dir/minisoap.c.o
[  3%] Building C object external/miniupnp/miniupnpc/CMakeFiles/libminiupnpc-static.dir/minissdpc.c.o
[  3%] Building C object external/miniupnp/miniupnpc/CMakeFiles/libminiupnpc-static.dir/miniwget.c.o
[  3%] Building C object external/miniupnp/miniupnpc/CMakeFiles/libminiupnpc-static.dir/upnpcommands.c.o
[  4%] Building C object external/miniupnp/miniupnpc/CMakeFiles/libminiupnpc-static.dir/upnpdev.c.o
[  4%] Building C object external/miniupnp/miniupnpc/CMakeFiles/libminiupnpc-static.dir/upnpreplyparse.c.o
[  4%] Building C object external/miniupnp/miniupnpc/CMakeFiles/libminiupnpc-static.dir/upnperrors.c.o
[  4%] Building C object external/miniupnp/miniupnpc/CMakeFiles/libminiupnpc-static.dir/connecthostport.c.o
[  4%] Building C object external/miniupnp/miniupnpc/CMakeFiles/libminiupnpc-static.dir/portlistingparse.c.o
[  5%] Building C object external/miniupnp/miniupnpc/CMakeFiles/libminiupnpc-static.dir/receivedata.c.o
[  5%] Linking C static library libminiupnpc.a
make[3]: Leaving directory '/home/vagrant/slave/monero-debug-static-ubuntu-amd64/build/build/debug'
[  5%] Built target libminiupnpc-static
make[3]: Entering directory '/home/vagrant/slave/monero-debug-static-ubuntu-amd64/build/build/debug'
Scanning dependencies of target unbound
make[3]: Leaving directory '/home/vagrant/slave/monero-debug-static-ubuntu-amd64/build/build/debug'
make[3]: Entering directory '/home/vagrant/slave/monero-debug-static-ubuntu-amd64/build/build/debug'
[  5%] Building C object external/unbound/CMakeFiles/unbound.dir/services/authzone.c.o
[  5%] Building C object external/unbound/CMakeFiles/unbound.dir/services/cache/dns.c.o
[  6%] Building C object external/unbound/CMakeFiles/unbound.dir/services/cache/infra.c.o
[  6%] Building C object external/unbound/CMakeFiles/unbound.dir/services/cache/rrset.c.o
[  6%] Building C object external/unbound/CMakeFiles/unbound.dir/util/data/dname.c.o
[  6%] Building C object external/unbound/CMakeFiles/unbound.dir/util/data/msgencode.c.o
[  6%] Building C object external/unbound/CMakeFiles/unbound.dir/util/data/msgparse.c.o
[  7%] Building C object external/unbound/CMakeFiles/unbound.dir/util/data/msgreply.c.o
[  7%] Building C object external/unbound/CMakeFiles/unbound.dir/util/data/packed_rrset.c.o
[  7%] Building C object external/unbound/CMakeFiles/unbound.dir/iterator/iterator.c.o
[  7%] Building C object external/unbound/CMakeFiles/unbound.dir/iterator/iter_delegpt.c.o
[  8%] Building C object external/unbound/CMakeFiles/unbound.dir/iterator/iter_donotq.c.o
[  8%] Building C object external/unbound/CMakeFiles/unbound.dir/iterator/iter_fwd.c.o
[  8%] Building C object external/unbound/CMakeFiles/unbound.dir/iterator/iter_hints.c.o
[  8%] Building C object external/unbound/CMakeFiles/unbound.dir/iterator/iter_priv.c.o
[  8%] Building C object external/unbound/CMakeFiles/unbound.dir/iterator/iter_resptype.c.o
[  9%] Building C object external/unbound/CMakeFiles/unbound.dir/iterator/iter_scrub.c.o
[  9%] Building C object external/unbound/CMakeFiles/unbound.dir/iterator/iter_utils.c.o
[  9%] Building C object external/unbound/CMakeFiles/unbound.dir/respip/respip.c.o
[  9%] Building C object external/unbound/CMakeFiles/unbound.dir/services/listen_dnsport.c.o
[  9%] Building C object external/unbound/CMakeFiles/unbound.dir/services/localzone.c.o
[ 10%] Building C object external/unbound/CMakeFiles/unbound.dir/services/mesh.c.o
[ 10%] Building C object external/unbound/CMakeFiles/unbound.dir/services/modstack.c.o
[ 10%] Building C object external/unbound/CMakeFiles/unbound.dir/services/outbound_list.c.o
[ 10%] Building C object external/unbound/CMakeFiles/unbound.dir/services/outside_network.c.o
[ 10%] Building C object external/unbound/CMakeFiles/unbound.dir/services/view.c.o
[ 11%] Building C object external/unbound/CMakeFiles/unbound.dir/util/alloc.c.o
[ 11%] Building C object external/unbound/CMakeFiles/unbound.dir/util/as112.c.o
[ 11%] Building C object external/unbound/CMakeFiles/unbound.dir/util/config_file.c.o
[ 11%] Building C object external/unbound/CMakeFiles/unbound.dir/util/configlexer.c.o
[ 12%] Building C object external/unbound/CMakeFiles/unbound.dir/util/configparser.c.o
[ 12%] Building C object external/unbound/CMakeFiles/unbound.dir/util/fptr_wlist.c.o
[ 12%] Building C object external/unbound/CMakeFiles/unbound.dir/util/locks.c.o
[ 12%] Building C object external/unbound/CMakeFiles/unbound.dir/util/log.c.o
[ 12%] Building C object external/unbound/CMakeFiles/unbound.dir/util/mini_event.c.o
[ 13%] Building C object external/unbound/CMakeFiles/unbound.dir/util/module.c.o
[ 13%] Building C object external/unbound/CMakeFiles/unbound.dir/util/netevent.c.o
[ 13%] Building C object external/unbound/CMakeFiles/unbound.dir/util/net_help.c.o
[ 13%] Building C object external/unbound/CMakeFiles/unbound.dir/util/random.c.o
[ 13%] Building C object external/unbound/CMakeFiles/unbound.dir/util/rbtree.c.o
[ 14%] Building C object external/unbound/CMakeFiles/unbound.dir/util/regional.c.o
[ 14%] Building C object external/unbound/CMakeFiles/unbound.dir/util/rtt.c.o
[ 14%] Building C object external/unbound/CMakeFiles/unbound.dir/util/storage/dnstree.c.o
[ 14%] Building C object external/unbound/CMakeFiles/unbound.dir/util/storage/lookup3.c.o
[ 15%] Building C object external/unbound/CMakeFiles/unbound.dir/util/storage/lruhash.c.o
[ 15%] Building C object external/unbound/CMakeFiles/unbound.dir/util/storage/slabhash.c.o
[ 15%] Building C object external/unbound/CMakeFiles/unbound.dir/util/timehist.c.o
[ 15%] Building C object external/unbound/CMakeFiles/unbound.dir/util/tube.c.o
[ 15%] Building C object external/unbound/CMakeFiles/unbound.dir/util/ub_event.c.o
[ 16%] Building C object external/unbound/CMakeFiles/unbound.dir/util/winsock_event.c.o
[ 16%] Building C object external/unbound/CMakeFiles/unbound.dir/validator/autotrust.c.o
[ 16%] Building C object external/unbound/CMakeFiles/unbound.dir/validator/val_anchor.c.o
[ 16%] Building C object external/unbound/CMakeFiles/unbound.dir/validator/validator.c.o
[ 16%] Building C object external/unbound/CMakeFiles/unbound.dir/validator/val_kcache.c.o
[ 17%] Building C object external/unbound/CMakeFiles/unbound.dir/validator/val_kentry.c.o
[ 17%] Building C object external/unbound/CMakeFiles/unbound.dir/validator/val_neg.c.o
[ 17%] Building C object external/unbound/CMakeFiles/unbound.dir/validator/val_nsec3.c.o
[ 17%] Building C object external/unbound/CMakeFiles/unbound.dir/validator/val_nsec.c.o
[ 18%] Building C object external/unbound/CMakeFiles/unbound.dir/validator/val_secalgo.c.o
[ 18%] Building C object external/unbound/CMakeFiles/unbound.dir/validator/val_sigcrypt.c.o
[ 18%] Building C object external/unbound/CMakeFiles/unbound.dir/validator/val_utils.c.o
[ 18%] Building C object external/unbound/CMakeFiles/unbound.dir/dns64/dns64.c.o
[ 18%] Building C object external/unbound/CMakeFiles/unbound.dir/testcode/checklocks.c.o
[ 19%] Building C object external/unbound/CMakeFiles/unbound.dir/sldns/keyraw.c.o
[ 19%] Building C object external/unbound/CMakeFiles/unbound.dir/sldns/sbuffer.c.o
[ 19%] Building C object external/unbound/CMakeFiles/unbound.dir/sldns/wire2str.c.o
[ 19%] Building C object external/unbound/CMakeFiles/unbound.dir/sldns/parse.c.o
[ 19%] Building C object external/unbound/CMakeFiles/unbound.dir/sldns/parseutil.c.o
[ 20%] Building C object external/unbound/CMakeFiles/unbound.dir/sldns/rrdef.c.o
[ 20%] Building C object external/unbound/CMakeFiles/unbound.dir/sldns/str2wire.c.o
[ 20%] Building C object external/unbound/CMakeFiles/unbound.dir/compat/strlcat.c.o
[ 20%] Building C object external/unbound/CMakeFiles/unbound.dir/compat/strlcpy.c.o
[ 20%] Building C object external/unbound/CMakeFiles/unbound.dir/compat/explicit_bzero.c.o
[ 21%] Building C object external/unbound/CMakeFiles/unbound.dir/compat/arc4random.c.o
[ 21%] Building C object external/unbound/CMakeFiles/unbound.dir/compat/arc4random_uniform.c.o
[ 21%] Building C object external/unbound/CMakeFiles/unbound.dir/compat/reallocarray.c.o
[ 21%] Building C object external/unbound/CMakeFiles/unbound.dir/compat/arc4_lock.c.o
[ 22%] Building C object external/unbound/CMakeFiles/unbound.dir/compat/getentropy_linux.c.o
[ 22%] Building C object external/unbound/CMakeFiles/unbound.dir/libunbound/context.c.o
[ 22%] Building C object external/unbound/CMakeFiles/unbound.dir/libunbound/libunbound.c.o
[ 22%] Building C object external/unbound/CMakeFiles/unbound.dir/libunbound/libworker.c.o
[ 22%] Linking C static library libunbound.a
make[3]: Leaving directory '/home/vagrant/slave/monero-debug-static-ubuntu-amd64/build/build/debug'
[ 22%] Built target unbound
make[3]: Entering directory '/home/vagrant/slave/monero-debug-static-ubuntu-amd64/build/build/debug'
Scanning dependencies of target lmdb
make[3]: Leaving directory '/home/vagrant/slave/monero-debug-static-ubuntu-amd64/build/build/debug'
make[3]: Entering directory '/home/vagrant/slave/monero-debug-static-ubuntu-amd64/build/build/debug'
[ 22%] Building C object external/db_drivers/liblmdb/CMakeFiles/lmdb.dir/mdb.c.o
[ 22%] Building C object external/db_drivers/liblmdb/CMakeFiles/lmdb.dir/midl.c.o
[ 22%] Linking C static library liblmdb.a
make[3]: Leaving directory '/home/vagrant/slave/monero-debug-static-ubuntu-amd64/build/build/debug'
[ 22%] Built target lmdb
make[3]: Entering directory '/home/vagrant/slave/monero-debug-static-ubuntu-amd64/build/build/debug'
Scanning dependencies of target easylogging
make[3]: Leaving directory '/home/vagrant/slave/monero-debug-static-ubuntu-amd64/build/build/debug'
make[3]: Entering directory '/home/vagrant/slave/monero-debug-static-ubuntu-amd64/build/build/debug'
[ 22%] Building CXX object external/easylogging++/CMakeFiles/easylogging.dir/easylogging++.cc.o
[ 22%] Linking CXX static library libeasylogging.a
make[3]: Leaving directory '/home/vagrant/slave/monero-debug-static-ubuntu-amd64/build/build/debug'
[ 22%] Built target easylogging
make[3]: Entering directory '/home/vagrant/slave/monero-debug-static-ubuntu-amd64/build/build/debug'
Scanning dependencies of target epee_readline
make[3]: Leaving directory '/home/vagrant/slave/monero-debug-static-ubuntu-amd64/build/build/debug'
make[3]: Entering directory '/home/vagrant/slave/monero-debug-static-ubuntu-amd64/build/build/debug'
[ 23%] Building CXX object contrib/epee/src/CMakeFiles/epee_readline.dir/readline_buffer.cpp.o
[ 23%] Linking CXX static library libepee_readline.a
make[3]: Leaving directory '/home/vagrant/slave/monero-debug-static-ubuntu-amd64/build/build/debug'
[ 23%] Built target epee_readline
make[3]: Entering directory '/home/vagrant/slave/monero-debug-static-ubuntu-amd64/build/build/debug'
Scanning dependencies of target epee
make[3]: Leaving directory '/home/vagrant/slave/monero-debug-static-ubuntu-amd64/build/build/debug'
make[3]: Entering directory '/home/vagrant/slave/monero-debug-static-ubuntu-amd64/build/build/debug'
[ 23%] Building CXX object contrib/epee/src/CMakeFiles/epee.dir/hex.cpp.o
[ 24%] Building CXX object contrib/epee/src/CMakeFiles/epee.dir/http_auth.cpp.o
[ 24%] Building CXX object contrib/epee/src/CMakeFiles/epee.dir/mlog.cpp.o
[ 24%] Building CXX object contrib/epee/src/CMakeFiles/epee.dir/net_helper.cpp.o
[ 24%] Building CXX object contrib/epee/src/CMakeFiles/epee.dir/net_utils_base.cpp.o
[ 24%] Building CXX object contrib/epee/src/CMakeFiles/epee.dir/string_tools.cpp.o
[ 25%] Building CXX object contrib/epee/src/CMakeFiles/epee.dir/wipeable_string.cpp.o
[ 25%] Building C object contrib/epee/src/CMakeFiles/epee.dir/memwipe.c.o
[ 25%] Building CXX object contrib/epee/src/CMakeFiles/epee.dir/connection_basic.cpp.o
[ 25%] Building CXX object contrib/epee/src/CMakeFiles/epee.dir/network_throttle.cpp.o
[ 26%] Building CXX object contrib/epee/src/CMakeFiles/epee.dir/network_throttle-detail.cpp.o
[ 26%] Building CXX object contrib/epee/src/CMakeFiles/epee.dir/mlocker.cpp.o
[ 26%] Building CXX object contrib/epee/src/CMakeFiles/epee.dir/buffer.cpp.o
[ 26%] Building CXX object contrib/epee/src/CMakeFiles/epee.dir/net_ssl.cpp.o
[ 26%] Linking CXX static library libepee.a
make[3]: Leaving directory '/home/vagrant/slave/monero-debug-static-ubuntu-amd64/build/build/debug'
[ 26%] Built target epee
make[3]: Entering directory '/home/vagrant/slave/monero-debug-static-ubuntu-amd64/build/build/debug'
Scanning dependencies of target genversion
make[3]: Leaving directory '/home/vagrant/slave/monero-debug-static-ubuntu-amd64/build/build/debug'
make[3]: Entering directory '/home/vagrant/slave/monero-debug-static-ubuntu-amd64/build/build/debug'
[ 26%] Generating ../version.cpp
-- You are currently on commit e8487fa
-- The most recent tag was at 6cadbdc
-- You are ahead of or behind a tagged release
make[3]: Leaving directory '/home/vagrant/slave/monero-debug-static-ubuntu-amd64/build/build/debug'
[ 26%] Built target genversion
make[3]: Entering directory '/home/vagrant/slave/monero-debug-static-ubuntu-amd64/build/build/debug'
Scanning dependencies of target obj_version
make[3]: Leaving directory '/home/vagrant/slave/monero-debug-static-ubuntu-amd64/build/build/debug'
make[3]: Entering directory '/home/vagrant/slave/monero-debug-static-ubuntu-amd64/build/build/debug'
[ 27%] Building CXX object src/CMakeFiles/obj_version.dir/__/version.cpp.o
make[3]: Leaving directory '/home/vagrant/slave/monero-debug-static-ubuntu-amd64/build/build/debug'
[ 27%] Built target obj_version
make[3]: Entering directory '/home/vagrant/slave/monero-debug-static-ubuntu-amd64/build/build/debug'
Scanning dependencies of target version
make[3]: Leaving directory '/home/vagrant/slave/monero-debug-static-ubuntu-amd64/build/build/debug'
make[3]: Entering directory '/home/vagrant/slave/monero-debug-static-ubuntu-amd64/build/build/debug'
[ 28%] Linking CXX static library libversion.a
make[3]: Leaving directory '/home/vagrant/slave/monero-debug-static-ubuntu-amd64/build/build/debug'
[ 28%] Built target version
make[3]: Entering directory '/home/vagrant/slave/monero-debug-static-ubuntu-amd64/build/build/debug'
Scanning dependencies of target obj_common
make[3]: Leaving directory '/home/vagrant/slave/monero-debug-static-ubuntu-amd64/build/build/debug'
make[3]: Entering directory '/home/vagrant/slave/monero-debug-static-ubuntu-amd64/build/build/debug'
[ 28%] Building CXX object src/common/CMakeFiles/obj_common.dir/base58.cpp.o
[ 28%] Building CXX object src/common/CMakeFiles/obj_common.dir/command_line.cpp.o
[ 28%] Building CXX object src/common/CMakeFiles/obj_common.dir/dns_utils.cpp.o
[ 29%] Building CXX object src/common/CMakeFiles/obj_common.dir/download.cpp.o
/home/vagrant/slave/monero-debug-static-ubuntu-amd64/build/src/common/download.cpp: In member function 'virtual bool tools::download_thread(tools::download_async_handle)::download_client::on_header(const epee::net_utils::http::http_response_info&)':
/home/vagrant/slave/monero-debug-static-ubuntu-amd64/build/src/common/download.cpp:108:36: warning: 'length' may be used uninitialized in this function [-Wmaybe-uninitialized]
             content_length = length;
                                    ^
[ 29%] Building CXX object src/common/CMakeFiles/obj_common.dir/error.cpp.o
[ 29%] Building CXX object src/common/CMakeFiles/obj_common.dir/expect.cpp.o
[ 29%] Building CXX object src/common/CMakeFiles/obj_common.dir/util.cpp.o
[ 29%] Building CXX object src/common/CMakeFiles/obj_common.dir/i18n.cpp.o
[ 30%] Building CXX object src/common/CMakeFiles/obj_common.dir/notify.cpp.o
[ 30%] Building CXX object src/common/CMakeFiles/obj_common.dir/password.cpp.o
[ 30%] Building CXX object src/common/CMakeFiles/obj_common.dir/perf_timer.cpp.o
[ 30%] Building CXX object src/common/CMakeFiles/obj_common.dir/pruning.cpp.o
[ 31%] Building CXX object src/common/CMakeFiles/obj_common.dir/spawn.cpp.o
[ 31%] Building CXX object src/common/CMakeFiles/obj_common.dir/threadpool.cpp.o
[ 31%] Building CXX object src/common/CMakeFiles/obj_common.dir/updates.cpp.o
[ 31%] Building C object src/common/CMakeFiles/obj_common.dir/aligned.c.o
[ 31%] Building CXX object src/common/CMakeFiles/obj_common.dir/timings.cc.o
[ 32%] Building CXX object src/common/CMakeFiles/obj_common.dir/combinator.cpp.o
[ 32%] Building CXX object src/common/CMakeFiles/obj_common.dir/stack_trace.cpp.o
make[3]: Leaving directory '/home/vagrant/slave/monero-debug-static-ubuntu-amd64/build/build/debug'
[ 32%] Built target obj_common
make[3]: Entering directory '/home/vagrant/slave/monero-debug-static-ubuntu-amd64/build/build/debug'
Scanning dependencies of target obj_cncrypto
make[3]: Leaving directory '/home/vagrant/slave/monero-debug-static-ubuntu-amd64/build/build/debug'
make[3]: Entering directory '/home/vagrant/slave/monero-debug-static-ubuntu-amd64/build/build/debug'
[ 32%] Building C object src/crypto/CMakeFiles/obj_cncrypto.dir/aesb.c.o
[ 33%] Building C object src/crypto/CMakeFiles/obj_cncrypto.dir/blake256.c.o
[ 33%] Building C object src/crypto/CMakeFiles/obj_cncrypto.dir/chacha.c.o
[ 33%] Building C object src/crypto/CMakeFiles/obj_cncrypto.dir/crypto-ops-data.c.o
[ 33%] Building C object src/crypto/CMakeFiles/obj_cncrypto.dir/crypto-ops.c.o
[ 33%] Building CXX object src/crypto/CMakeFiles/obj_cncrypto.dir/crypto.cpp.o
[ 34%] Building C object src/crypto/CMakeFiles/obj_cncrypto.dir/groestl.c.o
[ 34%] Building C object src/crypto/CMakeFiles/obj_cncrypto.dir/hash-extra-blake.c.o
[ 34%] Building C object src/crypto/CMakeFiles/obj_cncrypto.dir/hash-extra-groestl.c.o
[ 34%] Building C object src/crypto/CMakeFiles/obj_cncrypto.dir/hash-extra-jh.c.o
[ 34%] Building C object src/crypto/CMakeFiles/obj_cncrypto.dir/hash-extra-skein.c.o
[ 35%] Building C object src/crypto/CMakeFiles/obj_cncrypto.dir/hash.c.o
[ 35%] Building C object src/crypto/CMakeFiles/obj_cncrypto.dir/hmac-keccak.c.o
[ 35%] Building C object src/crypto/CMakeFiles/obj_cncrypto.dir/jh.c.o
[ 35%] Building C object src/crypto/CMakeFiles/obj_cncrypto.dir/keccak.c.o
[ 35%] Building C object src/crypto/CMakeFiles/obj_cncrypto.dir/oaes_lib.c.o
[ 36%] Building C object src/crypto/CMakeFiles/obj_cncrypto.dir/random.c.o
[ 36%] Building C object src/crypto/CMakeFiles/obj_cncrypto.dir/skein.c.o
[ 36%] Building C object src/crypto/CMakeFiles/obj_cncrypto.dir/slow-hash.c.o
[ 36%] Building C object src/crypto/CMakeFiles/obj_cncrypto.dir/CryptonightR_JIT.c.o
[ 37%] Building C object src/crypto/CMakeFiles/obj_cncrypto.dir/tree-hash.c.o
/home/vagrant/slave/monero-debug-static-ubuntu-amd64/build/src/crypto/tree-hash.c: In function 'tree_hash':
/home/vagrant/slave/monero-debug-static-ubuntu-amd64/build/src/crypto/tree-hash.c:85:5: warning: ISO C90 forbids variable length array 'ints' [-Wvla]
     char ints[cnt][HASH_SIZE];
     ^
[ 37%] Building C object src/crypto/CMakeFiles/obj_cncrypto.dir/CryptonightR_template.S.o
make[3]: Leaving directory '/home/vagrant/slave/monero-debug-static-ubuntu-amd64/build/build/debug'
[ 37%] Built target obj_cncrypto
make[3]: Entering directory '/home/vagrant/slave/monero-debug-static-ubuntu-amd64/build/build/debug'
Scanning dependencies of target cncrypto
make[3]: Leaving directory '/home/vagrant/slave/monero-debug-static-ubuntu-amd64/build/build/debug'
make[3]: Entering directory '/home/vagrant/slave/monero-debug-static-ubuntu-amd64/build/build/debug'
[ 37%] Linking CXX static library libcncrypto.a
make[3]: Leaving directory '/home/vagrant/slave/monero-debug-static-ubuntu-amd64/build/build/debug'
[ 37%] Built target cncrypto
make[3]: Entering directory '/home/vagrant/slave/monero-debug-static-ubuntu-amd64/build/build/debug'
Scanning dependencies of target common
make[3]: Leaving directory '/home/vagrant/slave/monero-debug-static-ubuntu-amd64/build/build/debug'
make[3]: Entering directory '/home/vagrant/slave/monero-debug-static-ubuntu-amd64/build/build/debug'
[ 38%] Linking CXX static library libcommon.a
make[3]: Leaving directory '/home/vagrant/slave/monero-debug-static-ubuntu-amd64/build/build/debug'
[ 38%] Built target common
make[3]: Entering directory '/home/vagrant/slave/monero-debug-static-ubuntu-amd64/build/build/debug'
Scanning dependencies of target obj_device
make[3]: Leaving directory '/home/vagrant/slave/monero-debug-static-ubuntu-amd64/build/build/debug'
make[3]: Entering directory '/home/vagrant/slave/monero-debug-static-ubuntu-amd64/build/build/debug'
[ 38%] Building CXX object src/device/CMakeFiles/obj_device.dir/device.cpp.o
[ 38%] Building CXX object src/device/CMakeFiles/obj_device.dir/device_default.cpp.o
[ 38%] Building CXX object src/device/CMakeFiles/obj_device.dir/log.cpp.o
[ 38%] Building CXX object src/device/CMakeFiles/obj_device.dir/device_ledger.cpp.o
[ 39%] Building CXX object src/device/CMakeFiles/obj_device.dir/device_io_hid.cpp.o
make[3]: Leaving directory '/home/vagrant/slave/monero-debug-static-ubuntu-amd64/build/build/debug'
[ 39%] Built target obj_device
make[3]: Entering directory '/home/vagrant/slave/monero-debug-static-ubuntu-amd64/build/build/debug'
Scanning dependencies of target obj_ringct_basic
make[3]: Leaving directory '/home/vagrant/slave/monero-debug-static-ubuntu-amd64/build/build/debug'
make[3]: Entering directory '/home/vagrant/slave/monero-debug-static-ubuntu-amd64/build/build/debug'
[ 39%] Building CXX object src/ringct/CMakeFiles/obj_ringct_basic.dir/rctOps.cpp.o
[ 40%] Building CXX object src/ringct/CMakeFiles/obj_ringct_basic.dir/rctTypes.cpp.o
[ 40%] Building C object src/ringct/CMakeFiles/obj_ringct_basic.dir/rctCryptoOps.c.o
[ 40%] Building CXX object src/ringct/CMakeFiles/obj_ringct_basic.dir/multiexp.cc.o
[ 40%] Building CXX object src/ringct/CMakeFiles/obj_ringct_basic.dir/bulletproofs.cc.o
make[3]: Leaving directory '/home/vagrant/slave/monero-debug-static-ubuntu-amd64/build/build/debug'
[ 40%] Built target obj_ringct_basic
make[3]: Entering directory '/home/vagrant/slave/monero-debug-static-ubuntu-amd64/build/build/debug'
Scanning dependencies of target ringct_basic
make[3]: Leaving directory '/home/vagrant/slave/monero-debug-static-ubuntu-amd64/build/build/debug'
make[3]: Entering directory '/home/vagrant/slave/monero-debug-static-ubuntu-amd64/build/build/debug'
[ 40%] Linking CXX static library libringct_basic.a
make[3]: Leaving directory '/home/vagrant/slave/monero-debug-static-ubuntu-amd64/build/build/debug'
[ 40%] Built target ringct_basic
make[3]: Entering directory '/home/vagrant/slave/monero-debug-static-ubuntu-amd64/build/build/debug'
[ 40%] Generating generated_stagenet_blocks.c
[ 40%] Generating generated_checkpoints.c
[ 41%] Generating generated_testnet_blocks.c
Scanning dependencies of target blocks
make[3]: Leaving directory '/home/vagrant/slave/monero-debug-static-ubuntu-amd64/build/build/debug'
make[3]: Entering directory '/home/vagrant/slave/monero-debug-static-ubuntu-amd64/build/build/debug'
[ 41%] Building CXX object src/blocks/CMakeFiles/blocks.dir/blocks.cpp.o
[ 41%] Building C object src/blocks/CMakeFiles/blocks.dir/generated_checkpoints.c.o
[ 41%] Building C object src/blocks/CMakeFiles/blocks.dir/generated_testnet_blocks.c.o
[ 42%] Building C object src/blocks/CMakeFiles/blocks.dir/generated_stagenet_blocks.c.o
[ 42%] Linking CXX static library libblocks.a
make[3]: Leaving directory '/home/vagrant/slave/monero-debug-static-ubuntu-amd64/build/build/debug'
[ 42%] Built target blocks
make[3]: Entering directory '/home/vagrant/slave/monero-debug-static-ubuntu-amd64/build/build/debug'
Scanning dependencies of target device
make[3]: Leaving directory '/home/vagrant/slave/monero-debug-static-ubuntu-amd64/build/build/debug'
make[3]: Entering directory '/home/vagrant/slave/monero-debug-static-ubuntu-amd64/build/build/debug'
[ 42%] Linking CXX static library libdevice.a
make[3]: Leaving directory '/home/vagrant/slave/monero-debug-static-ubuntu-amd64/build/build/debug'
[ 42%] Built target device
make[3]: Entering directory '/home/vagrant/slave/monero-debug-static-ubuntu-amd64/build/build/debug'
Scanning dependencies of target obj_ringct
make[3]: Leaving directory '/home/vagrant/slave/monero-debug-static-ubuntu-amd64/build/build/debug'
make[3]: Entering directory '/home/vagrant/slave/monero-debug-static-ubuntu-amd64/build/build/debug'
[ 42%] Building CXX object src/ringct/CMakeFiles/obj_ringct.dir/rctSigs.cpp.o
make[3]: Leaving directory '/home/vagrant/slave/monero-debug-static-ubuntu-amd64/build/build/debug'
[ 42%] Built target obj_ringct
make[3]: Entering directory '/home/vagrant/slave/monero-debug-static-ubuntu-amd64/build/build/debug'
Scanning dependencies of target obj_checkpoints
make[3]: Leaving directory '/home/vagrant/slave/monero-debug-static-ubuntu-amd64/build/build/debug'
make[3]: Entering directory '/home/vagrant/slave/monero-debug-static-ubuntu-amd64/build/build/debug'
[ 42%] Building CXX object src/checkpoints/CMakeFiles/obj_checkpoints.dir/checkpoints.cpp.o
make[3]: Leaving directory '/home/vagrant/slave/monero-debug-static-ubuntu-amd64/build/build/debug'
[ 42%] Built target obj_checkpoints
make[3]: Entering directory '/home/vagrant/slave/monero-debug-static-ubuntu-amd64/build/build/debug'
Scanning dependencies of target checkpoints
make[3]: Leaving directory '/home/vagrant/slave/monero-debug-static-ubuntu-amd64/build/build/debug'
make[3]: Entering directory '/home/vagrant/slave/monero-debug-static-ubuntu-amd64/build/build/debug'
[ 43%] Linking CXX static library libcheckpoints.a
make[3]: Leaving directory '/home/vagrant/slave/monero-debug-static-ubuntu-amd64/build/build/debug'
[ 43%] Built target checkpoints
make[3]: Entering directory '/home/vagrant/slave/monero-debug-static-ubuntu-amd64/build/build/debug'
Scanning dependencies of target obj_cryptonote_basic
make[3]: Leaving directory '/home/vagrant/slave/monero-debug-static-ubuntu-amd64/build/build/debug'
make[3]: Entering directory '/home/vagrant/slave/monero-debug-static-ubuntu-amd64/build/build/debug'
[ 43%] Building CXX object src/cryptonote_basic/CMakeFiles/obj_cryptonote_basic.dir/account.cpp.o
[ 43%] Building CXX object src/cryptonote_basic/CMakeFiles/obj_cryptonote_basic.dir/cryptonote_basic_impl.cpp.o
[ 43%] Building CXX object src/cryptonote_basic/CMakeFiles/obj_cryptonote_basic.dir/cryptonote_format_utils.cpp.o
[ 44%] Building CXX object src/cryptonote_basic/CMakeFiles/obj_cryptonote_basic.dir/difficulty.cpp.o
[ 44%] Building CXX object src/cryptonote_basic/CMakeFiles/obj_cryptonote_basic.dir/hardfork.cpp.o
[ 44%] Building CXX object src/cryptonote_basic/CMakeFiles/obj_cryptonote_basic.dir/miner.cpp.o
make[3]: Leaving directory '/home/vagrant/slave/monero-debug-static-ubuntu-amd64/build/build/debug'
[ 44%] Built target obj_cryptonote_basic
make[3]: Entering directory '/home/vagrant/slave/monero-debug-static-ubuntu-amd64/build/build/debug'
Scanning dependencies of target cryptonote_basic
make[3]: Leaving directory '/home/vagrant/slave/monero-debug-static-ubuntu-amd64/build/build/debug'
make[3]: Entering directory '/home/vagrant/slave/monero-debug-static-ubuntu-amd64/build/build/debug'
[ 44%] Linking CXX static library libcryptonote_basic.a
make[3]: Leaving directory '/home/vagrant/slave/monero-debug-static-ubuntu-amd64/build/build/debug'
[ 44%] Built target cryptonote_basic
make[3]: Entering directory '/home/vagrant/slave/monero-debug-static-ubuntu-amd64/build/build/debug'
Scanning dependencies of target ringct
make[3]: Leaving directory '/home/vagrant/slave/monero-debug-static-ubuntu-amd64/build/build/debug'
make[3]: Entering directory '/home/vagrant/slave/monero-debug-static-ubuntu-amd64/build/build/debug'
[ 44%] Linking CXX static library libringct.a
make[3]: Leaving directory '/home/vagrant/slave/monero-debug-static-ubuntu-amd64/build/build/debug'
[ 44%] Built target ringct
make[3]: Entering directory '/home/vagrant/slave/monero-debug-static-ubuntu-amd64/build/build/debug'
Scanning dependencies of target obj_cryptonote_core
make[3]: Leaving directory '/home/vagrant/slave/monero-debug-static-ubuntu-amd64/build/build/debug'
make[3]: Entering directory '/home/vagrant/slave/monero-debug-static-ubuntu-amd64/build/build/debug'
[ 44%] Building CXX object src/cryptonote_core/CMakeFiles/obj_cryptonote_core.dir/blockchain.cpp.o
[ 45%] Building CXX object src/cryptonote_core/CMakeFiles/obj_cryptonote_core.dir/cryptonote_core.cpp.o
[ 45%] Building CXX object src/cryptonote_core/CMakeFiles/obj_cryptonote_core.dir/tx_pool.cpp.o
[ 45%] Building CXX object src/cryptonote_core/CMakeFiles/obj_cryptonote_core.dir/tx_sanity_check.cpp.o
[ 45%] Building CXX object src/cryptonote_core/CMakeFiles/obj_cryptonote_core.dir/cryptonote_tx_utils.cpp.o
make[3]: Leaving directory '/home/vagrant/slave/monero-debug-static-ubuntu-amd64/build/build/debug'
[ 45%] Built target obj_cryptonote_core
make[3]: Entering directory '/home/vagrant/slave/monero-debug-static-ubuntu-amd64/build/build/debug'
Scanning dependencies of target obj_multisig
make[3]: Leaving directory '/home/vagrant/slave/monero-debug-static-ubuntu-amd64/build/build/debug'
make[3]: Entering directory '/home/vagrant/slave/monero-debug-static-ubuntu-amd64/build/build/debug'
[ 45%] Building CXX object src/multisig/CMakeFiles/obj_multisig.dir/multisig.cpp.o
make[3]: Leaving directory '/home/vagrant/slave/monero-debug-static-ubuntu-amd64/build/build/debug'
[ 45%] Built target obj_multisig
make[3]: Entering directory '/home/vagrant/slave/monero-debug-static-ubuntu-amd64/build/build/debug'
Scanning dependencies of target multisig
make[3]: Leaving directory '/home/vagrant/slave/monero-debug-static-ubuntu-amd64/build/build/debug'
make[3]: Entering directory '/home/vagrant/slave/monero-debug-static-ubuntu-amd64/build/build/debug'
[ 45%] Linking CXX static library libmultisig.a
make[3]: Leaving directory '/home/vagrant/slave/monero-debug-static-ubuntu-amd64/build/build/debug'
[ 45%] Built target multisig
make[3]: Entering directory '/home/vagrant/slave/monero-debug-static-ubuntu-amd64/build/build/debug'
Scanning dependencies of target obj_blockchain_db
make[3]: Leaving directory '/home/vagrant/slave/monero-debug-static-ubuntu-amd64/build/build/debug'
make[3]: Entering directory '/home/vagrant/slave/monero-debug-static-ubuntu-amd64/build/build/debug'
[ 46%] Building CXX object src/blockchain_db/CMakeFiles/obj_blockchain_db.dir/blockchain_db.cpp.o
[ 46%] Building CXX object src/blockchain_db/CMakeFiles/obj_blockchain_db.dir/lmdb/db_lmdb.cpp.o
make[3]: Leaving directory '/home/vagrant/slave/monero-debug-static-ubuntu-amd64/build/build/debug'
[ 46%] Built target obj_blockchain_db
make[3]: Entering directory '/home/vagrant/slave/monero-debug-static-ubuntu-amd64/build/build/debug'
Scanning dependencies of target blockchain_db
make[3]: Leaving directory '/home/vagrant/slave/monero-debug-static-ubuntu-amd64/build/build/debug'
make[3]: Entering directory '/home/vagrant/slave/monero-debug-static-ubuntu-amd64/build/build/debug'
[ 46%] Linking CXX static library libblockchain_db.a
make[3]: Leaving directory '/home/vagrant/slave/monero-debug-static-ubuntu-amd64/build/build/debug'
[ 46%] Built target blockchain_db
make[3]: Entering directory '/home/vagrant/slave/monero-debug-static-ubuntu-amd64/build/build/debug'
Scanning dependencies of target cryptonote_core
make[3]: Leaving directory '/home/vagrant/slave/monero-debug-static-ubuntu-amd64/build/build/debug'
make[3]: Entering directory '/home/vagrant/slave/monero-debug-static-ubuntu-amd64/build/build/debug'
[ 46%] Linking CXX static library libcryptonote_core.a
make[3]: Leaving directory '/home/vagrant/slave/monero-debug-static-ubuntu-amd64/build/build/debug'
[ 46%] Built target cryptonote_core
make[3]: Entering directory '/home/vagrant/slave/monero-debug-static-ubuntu-amd64/build/build/debug'
Scanning dependencies of target obj_lmdb_lib
make[3]: Leaving directory '/home/vagrant/slave/monero-debug-static-ubuntu-amd64/build/build/debug'
make[3]: Entering directory '/home/vagrant/slave/monero-debug-static-ubuntu-amd64/build/build/debug'
[ 46%] Building CXX object src/lmdb/CMakeFiles/obj_lmdb_lib.dir/database.cpp.o
[ 46%] Building CXX object src/lmdb/CMakeFiles/obj_lmdb_lib.dir/error.cpp.o
[ 47%] Building CXX object src/lmdb/CMakeFiles/obj_lmdb_lib.dir/table.cpp.o
[ 47%] Building CXX object src/lmdb/CMakeFiles/obj_lmdb_lib.dir/value_stream.cpp.o
make[3]: Leaving directory '/home/vagrant/slave/monero-debug-static-ubuntu-amd64/build/build/debug'
[ 47%] Built target obj_lmdb_lib
make[3]: Entering directory '/home/vagrant/slave/monero-debug-static-ubuntu-amd64/build/build/debug'
Scanning dependencies of target lmdb_lib
make[3]: Leaving directory '/home/vagrant/slave/monero-debug-static-ubuntu-amd64/build/build/debug'
make[3]: Entering directory '/home/vagrant/slave/monero-debug-static-ubuntu-amd64/build/build/debug'
[ 48%] Linking CXX static library liblmdb_lib.a
make[3]: Leaving directory '/home/vagrant/slave/monero-debug-static-ubuntu-amd64/build/build/debug'
[ 48%] Built target lmdb_lib
make[3]: Entering directory '/home/vagrant/slave/monero-debug-static-ubuntu-amd64/build/build/debug'
Scanning dependencies of target obj_net
make[3]: Leaving directory '/home/vagrant/slave/monero-debug-static-ubuntu-amd64/build/build/debug'
make[3]: Entering directory '/home/vagrant/slave/monero-debug-static-ubuntu-amd64/build/build/debug'
[ 48%] Building CXX object src/net/CMakeFiles/obj_net.dir/error.cpp.o
[ 50%] Building CXX object src/net/CMakeFiles/obj_net.dir/i2p_address.cpp.o
[ 50%] Building CXX object src/net/CMakeFiles/obj_net.dir/parse.cpp.o
[ 50%] Building CXX object src/net/CMakeFiles/obj_net.dir/socks.cpp.o
[ 50%] Building CXX object src/net/CMakeFiles/obj_net.dir/socks_connect.cpp.o
[ 50%] Building CXX object src/net/CMakeFiles/obj_net.dir/tor_address.cpp.o
make[3]: Leaving directory '/home/vagrant/slave/monero-debug-static-ubuntu-amd64/build/build/debug'
[ 50%] Built target obj_net
make[3]: Entering directory '/home/vagrant/slave/monero-debug-static-ubuntu-amd64/build/build/debug'
Scanning dependencies of target net
make[3]: Leaving directory '/home/vagrant/slave/monero-debug-static-ubuntu-amd64/build/build/debug'
make[3]: Entering directory '/home/vagrant/slave/monero-debug-static-ubuntu-amd64/build/build/debug'
[ 51%] Linking CXX static library libnet.a
make[3]: Leaving directory '/home/vagrant/slave/monero-debug-static-ubuntu-amd64/build/build/debug'
[ 51%] Built target net
make[3]: Entering directory '/home/vagrant/slave/monero-debug-static-ubuntu-amd64/build/build/debug'
Scanning dependencies of target obj_mnemonics
make[3]: Leaving directory '/home/vagrant/slave/monero-debug-static-ubuntu-amd64/build/build/debug'
make[3]: Entering directory '/home/vagrant/slave/monero-debug-static-ubuntu-amd64/build/build/debug'
[ 51%] Building CXX object src/mnemonics/CMakeFiles/obj_mnemonics.dir/electrum-words.cpp.o
make[3]: Leaving directory '/home/vagrant/slave/monero-debug-static-ubuntu-amd64/build/build/debug'
[ 51%] Built target obj_mnemonics
make[3]: Entering directory '/home/vagrant/slave/monero-debug-static-ubuntu-amd64/build/build/debug'
Scanning dependencies of target mnemonics
make[3]: Leaving directory '/home/vagrant/slave/monero-debug-static-ubuntu-amd64/build/build/debug'
make[3]: Entering directory '/home/vagrant/slave/monero-debug-static-ubuntu-amd64/build/build/debug'
[ 51%] Linking CXX static library libmnemonics.a
make[3]: Leaving directory '/home/vagrant/slave/monero-debug-static-ubuntu-amd64/build/build/debug'
[ 51%] Built target mnemonics
make[3]: Entering directory '/home/vagrant/slave/monero-debug-static-ubuntu-amd64/build/build/debug'
Scanning dependencies of target obj_rpc
make[3]: Leaving directory '/home/vagrant/slave/monero-debug-static-ubuntu-amd64/build/build/debug'
make[3]: Entering directory '/home/vagrant/slave/monero-debug-static-ubuntu-amd64/build/build/debug'
[ 51%] Building CXX object src/rpc/CMakeFiles/obj_rpc.dir/core_rpc_server.cpp.o
[ 52%] Building CXX object src/rpc/CMakeFiles/obj_rpc.dir/rpc_handler.cpp.o
[ 52%] Building CXX object src/rpc/CMakeFiles/obj_rpc.dir/instanciations.cpp.o
make[3]: Leaving directory '/home/vagrant/slave/monero-debug-static-ubuntu-amd64/build/build/debug'
[ 52%] Built target obj_rpc
make[3]: Entering directory '/home/vagrant/slave/monero-debug-static-ubuntu-amd64/build/build/debug'
Scanning dependencies of target obj_rpc_base
make[3]: Leaving directory '/home/vagrant/slave/monero-debug-static-ubuntu-amd64/build/build/debug'
make[3]: Entering directory '/home/vagrant/slave/monero-debug-static-ubuntu-amd64/build/build/debug'
[ 52%] Building CXX object src/rpc/CMakeFiles/obj_rpc_base.dir/rpc_args.cpp.o
make[3]: Leaving directory '/home/vagrant/slave/monero-debug-static-ubuntu-amd64/build/build/debug'
[ 52%] Built target obj_rpc_base
make[3]: Entering directory '/home/vagrant/slave/monero-debug-static-ubuntu-amd64/build/build/debug'
Scanning dependencies of target rpc_base
make[3]: Leaving directory '/home/vagrant/slave/monero-debug-static-ubuntu-amd64/build/build/debug'
make[3]: Entering directory '/home/vagrant/slave/monero-debug-static-ubuntu-amd64/build/build/debug'
[ 53%] Linking CXX static library librpc_base.a
make[3]: Leaving directory '/home/vagrant/slave/monero-debug-static-ubuntu-amd64/build/build/debug'
[ 53%] Built target rpc_base
make[3]: Entering directory '/home/vagrant/slave/monero-debug-static-ubuntu-amd64/build/build/debug'
Scanning dependencies of target obj_p2p
make[3]: Leaving directory '/home/vagrant/slave/monero-debug-static-ubuntu-amd64/build/build/debug'
make[3]: Entering directory '/home/vagrant/slave/monero-debug-static-ubuntu-amd64/build/build/debug'
[ 54%] Building CXX object src/p2p/CMakeFiles/obj_p2p.dir/net_node.cpp.o
[ 54%] Building CXX object src/p2p/CMakeFiles/obj_p2p.dir/net_peerlist.cpp.o
make[3]: Leaving directory '/home/vagrant/slave/monero-debug-static-ubuntu-amd64/build/build/debug'
[ 54%] Built target obj_p2p
make[3]: Entering directory '/home/vagrant/slave/monero-debug-static-ubuntu-amd64/build/build/debug'
Scanning dependencies of target p2p
make[3]: Leaving directory '/home/vagrant/slave/monero-debug-static-ubuntu-amd64/build/build/debug'
make[3]: Entering directory '/home/vagrant/slave/monero-debug-static-ubuntu-amd64/build/build/debug'
[ 55%] Linking CXX static library libp2p.a
make[3]: Leaving directory '/home/vagrant/slave/monero-debug-static-ubuntu-amd64/build/build/debug'
[ 55%] Built target p2p
make[3]: Entering directory '/home/vagrant/slave/monero-debug-static-ubuntu-amd64/build/build/debug'
Scanning dependencies of target obj_cryptonote_protocol
make[3]: Leaving directory '/home/vagrant/slave/monero-debug-static-ubuntu-amd64/build/build/debug'
make[3]: Entering directory '/home/vagrant/slave/monero-debug-static-ubuntu-amd64/build/build/debug'
[ 55%] Building CXX object src/cryptonote_protocol/CMakeFiles/obj_cryptonote_protocol.dir/cryptonote_protocol_handler-base.cpp.o
[ 56%] Building CXX object src/cryptonote_protocol/CMakeFiles/obj_cryptonote_protocol.dir/block_queue.cpp.o
make[3]: Leaving directory '/home/vagrant/slave/monero-debug-static-ubuntu-amd64/build/build/debug'
[ 56%] Built target obj_cryptonote_protocol
make[3]: Entering directory '/home/vagrant/slave/monero-debug-static-ubuntu-amd64/build/build/debug'
Scanning dependencies of target cryptonote_protocol
make[3]: Leaving directory '/home/vagrant/slave/monero-debug-static-ubuntu-amd64/build/build/debug'
make[3]: Entering directory '/home/vagrant/slave/monero-debug-static-ubuntu-amd64/build/build/debug'
[ 57%] Linking CXX static library libcryptonote_protocol.a
make[3]: Leaving directory '/home/vagrant/slave/monero-debug-static-ubuntu-amd64/build/build/debug'
[ 57%] Built target cryptonote_protocol
make[3]: Entering directory '/home/vagrant/slave/monero-debug-static-ubuntu-amd64/build/build/debug'
Scanning dependencies of target rpc
make[3]: Leaving directory '/home/vagrant/slave/monero-debug-static-ubuntu-amd64/build/build/debug'
make[3]: Entering directory '/home/vagrant/slave/monero-debug-static-ubuntu-amd64/build/build/debug'
[ 57%] Linking CXX static library librpc.a
make[3]: Leaving directory '/home/vagrant/slave/monero-debug-static-ubuntu-amd64/build/build/debug'
[ 57%] Built target rpc
make[3]: Entering directory '/home/vagrant/slave/monero-debug-static-ubuntu-amd64/build/build/debug'
Scanning dependencies of target obj_daemon_messages
make[3]: Leaving directory '/home/vagrant/slave/monero-debug-static-ubuntu-amd64/build/build/debug'
make[3]: Entering directory '/home/vagrant/slave/monero-debug-static-ubuntu-amd64/build/build/debug'
[ 57%] Building CXX object src/rpc/CMakeFiles/obj_daemon_messages.dir/message.cpp.o
[ 57%] Building CXX object src/rpc/CMakeFiles/obj_daemon_messages.dir/daemon_messages.cpp.o
make[3]: Leaving directory '/home/vagrant/slave/monero-debug-static-ubuntu-amd64/build/build/debug'
[ 57%] Built target obj_daemon_messages
make[3]: Entering directory '/home/vagrant/slave/monero-debug-static-ubuntu-amd64/build/build/debug'
Scanning dependencies of target obj_daemon_rpc_server
make[3]: Leaving directory '/home/vagrant/slave/monero-debug-static-ubuntu-amd64/build/build/debug'
make[3]: Entering directory '/home/vagrant/slave/monero-debug-static-ubuntu-amd64/build/build/debug'
[ 57%] Building CXX object src/rpc/CMakeFiles/obj_daemon_rpc_server.dir/daemon_handler.cpp.o
[ 57%] Building CXX object src/rpc/CMakeFiles/obj_daemon_rpc_server.dir/zmq_server.cpp.o
make[3]: Leaving directory '/home/vagrant/slave/monero-debug-static-ubuntu-amd64/build/build/debug'
[ 57%] Built target obj_daemon_rpc_server
make[3]: Entering directory '/home/vagrant/slave/monero-debug-static-ubuntu-amd64/build/build/debug'
Scanning dependencies of target obj_serialization
make[3]: Leaving directory '/home/vagrant/slave/monero-debug-static-ubuntu-amd64/build/build/debug'
make[3]: Entering directory '/home/vagrant/slave/monero-debug-static-ubuntu-amd64/build/build/debug'
[ 57%] Building CXX object src/serialization/CMakeFiles/obj_serialization.dir/json_object.cpp.o
make[3]: Leaving directory '/home/vagrant/slave/monero-debug-static-ubuntu-amd64/build/build/debug'
[ 57%] Built target obj_serialization
make[3]: Entering directory '/home/vagrant/slave/monero-debug-static-ubuntu-amd64/build/build/debug'
Scanning dependencies of target serialization
make[3]: Leaving directory '/home/vagrant/slave/monero-debug-static-ubuntu-amd64/build/build/debug'
make[3]: Entering directory '/home/vagrant/slave/monero-debug-static-ubuntu-amd64/build/build/debug'
[ 57%] Linking CXX static library libserialization.a
make[3]: Leaving directory '/home/vagrant/slave/monero-debug-static-ubuntu-amd64/build/build/debug'
[ 57%] Built target serialization
make[3]: Entering directory '/home/vagrant/slave/monero-debug-static-ubuntu-amd64/build/build/debug'
Scanning dependencies of target daemon_messages
make[3]: Leaving directory '/home/vagrant/slave/monero-debug-static-ubuntu-amd64/build/build/debug'
make[3]: Entering directory '/home/vagrant/slave/monero-debug-static-ubuntu-amd64/build/build/debug'
[ 57%] Linking CXX static library libdaemon_messages.a
make[3]: Leaving directory '/home/vagrant/slave/monero-debug-static-ubuntu-amd64/build/build/debug'
[ 57%] Built target daemon_messages
make[3]: Entering directory '/home/vagrant/slave/monero-debug-static-ubuntu-amd64/build/build/debug'
Scanning dependencies of target daemon_rpc_server
make[3]: Leaving directory '/home/vagrant/slave/monero-debug-static-ubuntu-amd64/build/build/debug'
make[3]: Entering directory '/home/vagrant/slave/monero-debug-static-ubuntu-amd64/build/build/debug'
[ 58%] Linking CXX static library libdaemon_rpc_server.a
make[3]: Leaving directory '/home/vagrant/slave/monero-debug-static-ubuntu-amd64/build/build/debug'
[ 58%] Built target daemon_rpc_server
make[3]: Entering directory '/home/vagrant/slave/monero-debug-static-ubuntu-amd64/build/build/debug'
Scanning dependencies of target obj_wallet
make[3]: Leaving directory '/home/vagrant/slave/monero-debug-static-ubuntu-amd64/build/build/debug'
make[3]: Entering directory '/home/vagrant/slave/monero-debug-static-ubuntu-amd64/build/build/debug'
[ 58%] Building CXX object src/wallet/CMakeFiles/obj_wallet.dir/wallet2.cpp.o
/home/vagrant/slave/monero-debug-static-ubuntu-amd64/build/src/wallet/wallet2.cpp: In member function 'void tools::wallet2::get_outs(std::vector<std::vector<std::tuple<long unsigned int, crypto::public_key, rct::key> > >&, const std::vector<long unsigned int>&, size_t)':
/home/vagrant/slave/monero-debug-static-ubuntu-amd64/build/src/wallet/wallet2.cpp:7726:12: warning: variable 'existing_ring_found' set but not used [-Wunused-but-set-variable]
       bool existing_ring_found = false;
            ^
[ 58%] Building CXX object src/wallet/CMakeFiles/obj_wallet.dir/wallet_args.cpp.o
[ 58%] Building CXX object src/wallet/CMakeFiles/obj_wallet.dir/ringdb.cpp.o
[ 59%] Building CXX object src/wallet/CMakeFiles/obj_wallet.dir/node_rpc_proxy.cpp.o
[ 59%] Building CXX object src/wallet/CMakeFiles/obj_wallet.dir/message_store.cpp.o
[ 59%] Building CXX object src/wallet/CMakeFiles/obj_wallet.dir/message_transporter.cpp.o
make[3]: Leaving directory '/home/vagrant/slave/monero-debug-static-ubuntu-amd64/build/build/debug'
[ 59%] Built target obj_wallet
make[3]: Entering directory '/home/vagrant/slave/monero-debug-static-ubuntu-amd64/build/build/debug'
Scanning dependencies of target obj_device_trezor
make[3]: Leaving directory '/home/vagrant/slave/monero-debug-static-ubuntu-amd64/build/build/debug'
make[3]: Entering directory '/home/vagrant/slave/monero-debug-static-ubuntu-amd64/build/build/debug'
[ 59%] Building CXX object src/device_trezor/CMakeFiles/obj_device_trezor.dir/device_trezor.cpp.o
make[3]: Leaving directory '/home/vagrant/slave/monero-debug-static-ubuntu-amd64/build/build/debug'
[ 59%] Built target obj_device_trezor
make[3]: Entering directory '/home/vagrant/slave/monero-debug-static-ubuntu-amd64/build/build/debug'
Scanning dependencies of target device_trezor
make[3]: Leaving directory '/home/vagrant/slave/monero-debug-static-ubuntu-amd64/build/build/debug'
make[3]: Entering directory '/home/vagrant/slave/monero-debug-static-ubuntu-amd64/build/build/debug'
[ 59%] Linking CXX static library libdevice_trezor.a
make[3]: Leaving directory '/home/vagrant/slave/monero-debug-static-ubuntu-amd64/build/build/debug'
[ 59%] Built target device_trezor
make[3]: Entering directory '/home/vagrant/slave/monero-debug-static-ubuntu-amd64/build/build/debug'
Scanning dependencies of target wallet
make[3]: Leaving directory '/home/vagrant/slave/monero-debug-static-ubuntu-amd64/build/build/debug'
make[3]: Entering directory '/home/vagrant/slave/monero-debug-static-ubuntu-amd64/build/build/debug'
[ 59%] Linking CXX static library ../../lib/libwallet.a
make[3]: Leaving directory '/home/vagrant/slave/monero-debug-static-ubuntu-amd64/build/build/debug'
[ 59%] Built target wallet
make[3]: Entering directory '/home/vagrant/slave/monero-debug-static-ubuntu-amd64/build/build/debug'
Scanning dependencies of target obj_daemonizer
make[3]: Leaving directory '/home/vagrant/slave/monero-debug-static-ubuntu-amd64/build/build/debug'
make[3]: Entering directory '/home/vagrant/slave/monero-debug-static-ubuntu-amd64/build/build/debug'
[ 60%] Building CXX object src/daemonizer/CMakeFiles/obj_daemonizer.dir/posix_fork.cpp.o
make[3]: Leaving directory '/home/vagrant/slave/monero-debug-static-ubuntu-amd64/build/build/debug'
[ 60%] Built target obj_daemonizer
make[3]: Entering directory '/home/vagrant/slave/monero-debug-static-ubuntu-amd64/build/build/debug'
Scanning dependencies of target daemonizer
make[3]: Leaving directory '/home/vagrant/slave/monero-debug-static-ubuntu-amd64/build/build/debug'
make[3]: Entering directory '/home/vagrant/slave/monero-debug-static-ubuntu-amd64/build/build/debug'
[ 60%] Linking CXX static library libdaemonizer.a
make[3]: Leaving directory '/home/vagrant/slave/monero-debug-static-ubuntu-amd64/build/build/debug'
[ 60%] Built target daemonizer
make[3]: Entering directory '/home/vagrant/slave/monero-debug-static-ubuntu-amd64/build/build/debug'
Scanning dependencies of target wallet_rpc_server
make[3]: Leaving directory '/home/vagrant/slave/monero-debug-static-ubuntu-amd64/build/build/debug'
make[3]: Entering directory '/home/vagrant/slave/monero-debug-static-ubuntu-amd64/build/build/debug'
[ 60%] Building CXX object src/wallet/CMakeFiles/wallet_rpc_server.dir/wallet_rpc_server.cpp.o
/home/vagrant/slave/monero-debug-static-ubuntu-amd64/build/src/wallet/wallet_rpc_server.cpp: In member function 'bool tools::wallet_rpc_server::on_incoming_transfers(const request&, tools::wallet_rpc::COMMAND_RPC_INCOMING_TRANSFERS::response&, epee::json_rpc::error&, const connection_context*)':
/home/vagrant/slave/monero-debug-static-ubuntu-amd64/build/src/wallet/wallet_rpc_server.cpp:1853:10: warning: variable 'transfers_found' set but not used [-Wunused-but-set-variable]
     bool transfers_found = false;
          ^
[ 61%] Linking CXX executable ../../bin/monero-wallet-rpc
make[3]: Leaving directory '/home/vagrant/slave/monero-debug-static-ubuntu-amd64/build/build/debug'
[ 61%] Built target wallet_rpc_server
make[3]: Entering directory '/home/vagrant/slave/monero-debug-static-ubuntu-amd64/build/build/debug'
Scanning dependencies of target simplewallet
make[3]: Leaving directory '/home/vagrant/slave/monero-debug-static-ubuntu-amd64/build/build/debug'
make[3]: Entering directory '/home/vagrant/slave/monero-debug-static-ubuntu-amd64/build/build/debug'
[ 62%] Building CXX object src/simplewallet/CMakeFiles/simplewallet.dir/simplewallet.cpp.o
/home/vagrant/slave/monero-debug-static-ubuntu-amd64/build/src/simplewallet/simplewallet.cpp: In member function 'bool cryptonote::simple_wallet::set_default_priority(const std::vector<std::__cxx11::basic_string<char> >&)':
/home/vagrant/slave/monero-debug-static-ubuntu-amd64/build/src/simplewallet/simplewallet.cpp:2306:53: warning: 'result' may be used uninitialized in this function [-Wmaybe-uninitialized]
         priority = boost::lexical_cast<int>(args[1]);
                                                     ^
[ 62%] Linking CXX executable ../../bin/monero-wallet-cli
make[3]: Leaving directory '/home/vagrant/slave/monero-debug-static-ubuntu-amd64/build/build/debug'
[ 62%] Built target simplewallet
make[3]: Entering directory '/home/vagrant/slave/monero-debug-static-ubuntu-amd64/build/build/debug'
Scanning dependencies of target gen_multisig
make[3]: Leaving directory '/home/vagrant/slave/monero-debug-static-ubuntu-amd64/build/build/debug'
make[3]: Entering directory '/home/vagrant/slave/monero-debug-static-ubuntu-amd64/build/build/debug'
[ 62%] Building CXX object src/gen_multisig/CMakeFiles/gen_multisig.dir/gen_multisig.cpp.o
[ 62%] Linking CXX executable ../../bin/monero-gen-trusted-multisig
make[3]: Leaving directory '/home/vagrant/slave/monero-debug-static-ubuntu-amd64/build/build/debug'
[ 62%] Built target gen_multisig
make[3]: Entering directory '/home/vagrant/slave/monero-debug-static-ubuntu-amd64/build/build/debug'
Scanning dependencies of target daemon
make[3]: Leaving directory '/home/vagrant/slave/monero-debug-static-ubuntu-amd64/build/build/debug'
make[3]: Entering directory '/home/vagrant/slave/monero-debug-static-ubuntu-amd64/build/build/debug'
[ 62%] Building CXX object src/daemon/CMakeFiles/daemon.dir/command_parser_executor.cpp.o
[ 62%] Building CXX object src/daemon/CMakeFiles/daemon.dir/command_server.cpp.o
[ 62%] Building CXX object src/daemon/CMakeFiles/daemon.dir/daemon.cpp.o
[ 62%] Building CXX object src/daemon/CMakeFiles/daemon.dir/executor.cpp.o
[ 63%] Building CXX object src/daemon/CMakeFiles/daemon.dir/main.cpp.o
[ 63%] Building CXX object src/daemon/CMakeFiles/daemon.dir/rpc_command_executor.cpp.o
[ 63%] Linking CXX executable ../../bin/monerod
make[3]: Leaving directory '/home/vagrant/slave/monero-debug-static-ubuntu-amd64/build/build/debug'
[ 63%] Built target daemon
make[3]: Entering directory '/home/vagrant/slave/monero-debug-static-ubuntu-amd64/build/build/debug'
Scanning dependencies of target blockchain_usage
make[3]: Leaving directory '/home/vagrant/slave/monero-debug-static-ubuntu-amd64/build/build/debug'
make[3]: Entering directory '/home/vagrant/slave/monero-debug-static-ubuntu-amd64/build/build/debug'
[ 63%] Building CXX object src/blockchain_utilities/CMakeFiles/blockchain_usage.dir/blockchain_usage.cpp.o
[ 63%] Linking CXX executable ../../bin/monero-blockchain-usage
make[3]: Leaving directory '/home/vagrant/slave/monero-debug-static-ubuntu-amd64/build/build/debug'
[ 63%] Built target blockchain_usage
make[3]: Entering directory '/home/vagrant/slave/monero-debug-static-ubuntu-amd64/build/build/debug'
Scanning dependencies of target blockchain_blackball
make[3]: Leaving directory '/home/vagrant/slave/monero-debug-static-ubuntu-amd64/build/build/debug'
make[3]: Entering directory '/home/vagrant/slave/monero-debug-static-ubuntu-amd64/build/build/debug'
[ 63%] Building CXX object src/blockchain_utilities/CMakeFiles/blockchain_blackball.dir/blockchain_blackball.cpp.o
[ 63%] Linking CXX executable ../../bin/monero-blockchain-mark-spent-outputs
make[3]: Leaving directory '/home/vagrant/slave/monero-debug-static-ubuntu-amd64/build/build/debug'
[ 63%] Built target blockchain_blackball
make[3]: Entering directory '/home/vagrant/slave/monero-debug-static-ubuntu-amd64/build/build/debug'
Scanning dependencies of target blockchain_export
make[3]: Leaving directory '/home/vagrant/slave/monero-debug-static-ubuntu-amd64/build/build/debug'
make[3]: Entering directory '/home/vagrant/slave/monero-debug-static-ubuntu-amd64/build/build/debug'
[ 63%] Building CXX object src/blockchain_utilities/CMakeFiles/blockchain_export.dir/blockchain_export.cpp.o
In file included from /usr/local/include/boost/iostreams/detail/is_dereferenceable.hpp:12:0,
                 from /usr/local/include/boost/iostreams/detail/resolve.hpp:26,
                 from /usr/local/include/boost/iostreams/detail/push.hpp:24,
                 from /usr/local/include/boost/iostreams/detail/streambuf/indirect_streambuf.hpp:31,
                 from /usr/local/include/boost/iostreams/stream_buffer.hpp:22,
                 from /home/vagrant/slave/monero-debug-static-ubuntu-amd64/build/src/blockchain_utilities/bootstrap_file.h:31,
                 from /home/vagrant/slave/monero-debug-static-ubuntu-amd64/build/src/blockchain_utilities/blockchain_export.cpp:29:
/usr/local/include/boost/type_traits/detail/bool_trait_def.hpp:18:79: note: #pragma message: NOTE: Use of this header (bool_trait_def.hpp) is deprecated
 # pragma message("NOTE: Use of this header (bool_trait_def.hpp) is deprecated")
                                                                               ^
In file included from /usr/local/include/boost/type_traits/detail/bool_trait_def.hpp:21:0,
                 from /usr/local/include/boost/iostreams/detail/is_dereferenceable.hpp:12,
                 from /usr/local/include/boost/iostreams/detail/resolve.hpp:26,
                 from /usr/local/include/boost/iostreams/detail/push.hpp:24,
                 from /usr/local/include/boost/iostreams/detail/streambuf/indirect_streambuf.hpp:31,
                 from /usr/local/include/boost/iostreams/stream_buffer.hpp:22,
                 from /home/vagrant/slave/monero-debug-static-ubuntu-amd64/build/src/blockchain_utilities/bootstrap_file.h:31,
                 from /home/vagrant/slave/monero-debug-static-ubuntu-amd64/build/src/blockchain_utilities/blockchain_export.cpp:29:
/usr/local/include/boost/type_traits/detail/template_arity_spec.hpp:13:84: note: #pragma message: NOTE: Use of this header (template_arity_spec.hpp) is deprecated
 # pragma message("NOTE: Use of this header (template_arity_spec.hpp) is deprecated")
                                                                                    ^
In file included from /usr/local/include/boost/iostreams/detail/is_dereferenceable.hpp:13:0,
                 from /usr/local/include/boost/iostreams/detail/resolve.hpp:26,
                 from /usr/local/include/boost/iostreams/detail/push.hpp:24,
                 from /usr/local/include/boost/iostreams/detail/streambuf/indirect_streambuf.hpp:31,
                 from /usr/local/include/boost/iostreams/stream_buffer.hpp:22,
                 from /home/vagrant/slave/monero-debug-static-ubuntu-amd64/build/src/blockchain_utilities/bootstrap_file.h:31,
                 from /home/vagrant/slave/monero-debug-static-ubuntu-amd64/build/src/blockchain_utilities/blockchain_export.cpp:29:
/usr/local/include/boost/type_traits/detail/template_arity_spec.hpp:13:84: note: #pragma message: NOTE: Use of this header (template_arity_spec.hpp) is deprecated
 # pragma message("NOTE: Use of this header (template_arity_spec.hpp) is deprecated")
                                                                                    ^
[ 63%] Building CXX object src/blockchain_utilities/CMakeFiles/blockchain_export.dir/bootstrap_file.cpp.o
In file included from /usr/local/include/boost/iostreams/detail/is_dereferenceable.hpp:12:0,
                 from /usr/local/include/boost/iostreams/detail/resolve.hpp:26,
                 from /usr/local/include/boost/iostreams/detail/push.hpp:24,
                 from /usr/local/include/boost/iostreams/detail/streambuf/indirect_streambuf.hpp:31,
                 from /usr/local/include/boost/iostreams/stream_buffer.hpp:22,
                 from /home/vagrant/slave/monero-debug-static-ubuntu-amd64/build/src/blockchain_utilities/bootstrap_file.h:31,
                 from /home/vagrant/slave/monero-debug-static-ubuntu-amd64/build/src/blockchain_utilities/bootstrap_file.cpp:33:
/usr/local/include/boost/type_traits/detail/bool_trait_def.hpp:18:79: note: #pragma message: NOTE: Use of this header (bool_trait_def.hpp) is deprecated
 # pragma message("NOTE: Use of this header (bool_trait_def.hpp) is deprecated")
                                                                               ^
In file included from /usr/local/include/boost/type_traits/detail/bool_trait_def.hpp:21:0,
                 from /usr/local/include/boost/iostreams/detail/is_dereferenceable.hpp:12,
                 from /usr/local/include/boost/iostreams/detail/resolve.hpp:26,
                 from /usr/local/include/boost/iostreams/detail/push.hpp:24,
                 from /usr/local/include/boost/iostreams/detail/streambuf/indirect_streambuf.hpp:31,
                 from /usr/local/include/boost/iostreams/stream_buffer.hpp:22,
                 from /home/vagrant/slave/monero-debug-static-ubuntu-amd64/build/src/blockchain_utilities/bootstrap_file.h:31,
                 from /home/vagrant/slave/monero-debug-static-ubuntu-amd64/build/src/blockchain_utilities/bootstrap_file.cpp:33:
/usr/local/include/boost/type_traits/detail/template_arity_spec.hpp:13:84: note: #pragma message: NOTE: Use of this header (template_arity_spec.hpp) is deprecated
 # pragma message("NOTE: Use of this header (template_arity_spec.hpp) is deprecated")
                                                                                    ^
In file included from /usr/local/include/boost/iostreams/detail/is_dereferenceable.hpp:13:0,
                 from /usr/local/include/boost/iostreams/detail/resolve.hpp:26,
                 from /usr/local/include/boost/iostreams/detail/push.hpp:24,
                 from /usr/local/include/boost/iostreams/detail/streambuf/indirect_streambuf.hpp:31,
                 from /usr/local/include/boost/iostreams/stream_buffer.hpp:22,
                 from /home/vagrant/slave/monero-debug-static-ubuntu-amd64/build/src/blockchain_utilities/bootstrap_file.h:31,
                 from /home/vagrant/slave/monero-debug-static-ubuntu-amd64/build/src/blockchain_utilities/bootstrap_file.cpp:33:
/usr/local/include/boost/type_traits/detail/template_arity_spec.hpp:13:84: note: #pragma message: NOTE: Use of this header (template_arity_spec.hpp) is deprecated
 # pragma message("NOTE: Use of this header (template_arity_spec.hpp) is deprecated")
                                                                                    ^
[ 63%] Building CXX object src/blockchain_utilities/CMakeFiles/blockchain_export.dir/blocksdat_file.cpp.o
In file included from /usr/local/include/boost/iostreams/detail/is_dereferenceable.hpp:12:0,
                 from /usr/local/include/boost/iostreams/detail/resolve.hpp:26,
                 from /usr/local/include/boost/iostreams/detail/push.hpp:24,
                 from /usr/local/include/boost/iostreams/detail/streambuf/indirect_streambuf.hpp:31,
                 from /usr/local/include/boost/iostreams/stream_buffer.hpp:22,
                 from /home/vagrant/slave/monero-debug-static-ubuntu-amd64/build/src/blockchain_utilities/blocksdat_file.h:31,
                 from /home/vagrant/slave/monero-debug-static-ubuntu-amd64/build/src/blockchain_utilities/blocksdat_file.cpp:29:
/usr/local/include/boost/type_traits/detail/bool_trait_def.hpp:18:79: note: #pragma message: NOTE: Use of this header (bool_trait_def.hpp) is deprecated
 # pragma message("NOTE: Use of this header (bool_trait_def.hpp) is deprecated")
                                                                               ^
In file included from /usr/local/include/boost/type_traits/detail/bool_trait_def.hpp:21:0,
                 from /usr/local/include/boost/iostreams/detail/is_dereferenceable.hpp:12,
                 from /usr/local/include/boost/iostreams/detail/resolve.hpp:26,
                 from /usr/local/include/boost/iostreams/detail/push.hpp:24,
                 from /usr/local/include/boost/iostreams/detail/streambuf/indirect_streambuf.hpp:31,
                 from /usr/local/include/boost/iostreams/stream_buffer.hpp:22,
                 from /home/vagrant/slave/monero-debug-static-ubuntu-amd64/build/src/blockchain_utilities/blocksdat_file.h:31,
                 from /home/vagrant/slave/monero-debug-static-ubuntu-amd64/build/src/blockchain_utilities/blocksdat_file.cpp:29:
/usr/local/include/boost/type_traits/detail/template_arity_spec.hpp:13:84: note: #pragma message: NOTE: Use of this header (template_arity_spec.hpp) is deprecated
 # pragma message("NOTE: Use of this header (template_arity_spec.hpp) is deprecated")
                                                                                    ^
In file included from /usr/local/include/boost/iostreams/detail/is_dereferenceable.hpp:13:0,
                 from /usr/local/include/boost/iostreams/detail/resolve.hpp:26,
                 from /usr/local/include/boost/iostreams/detail/push.hpp:24,
                 from /usr/local/include/boost/iostreams/detail/streambuf/indirect_streambuf.hpp:31,
                 from /usr/local/include/boost/iostreams/stream_buffer.hpp:22,
                 from /home/vagrant/slave/monero-debug-static-ubuntu-amd64/build/src/blockchain_utilities/blocksdat_file.h:31,
                 from /home/vagrant/slave/monero-debug-static-ubuntu-amd64/build/src/blockchain_utilities/blocksdat_file.cpp:29:
/usr/local/include/boost/type_traits/detail/template_arity_spec.hpp:13:84: note: #pragma message: NOTE: Use of this header (template_arity_spec.hpp) is deprecated
 # pragma message("NOTE: Use of this header (template_arity_spec.hpp) is deprecated")
                                                                                    ^
[ 64%] Linking CXX executable ../../bin/monero-blockchain-export
make[3]: Leaving directory '/home/vagrant/slave/monero-debug-static-ubuntu-amd64/build/build/debug'
[ 64%] Built target blockchain_export
make[3]: Entering directory '/home/vagrant/slave/monero-debug-static-ubuntu-amd64/build/build/debug'
Scanning dependencies of target blockchain_stats
make[3]: Leaving directory '/home/vagrant/slave/monero-debug-static-ubuntu-amd64/build/build/debug'
make[3]: Entering directory '/home/vagrant/slave/monero-debug-static-ubuntu-amd64/build/build/debug'
[ 64%] Building CXX object src/blockchain_utilities/CMakeFiles/blockchain_stats.dir/blockchain_stats.cpp.o
[ 65%] Linking CXX executable ../../bin/monero-blockchain-stats
make[3]: Leaving directory '/home/vagrant/slave/monero-debug-static-ubuntu-amd64/build/build/debug'
[ 65%] Built target blockchain_stats
make[3]: Entering directory '/home/vagrant/slave/monero-debug-static-ubuntu-amd64/build/build/debug'
Scanning dependencies of target blockchain_ancestry
make[3]: Leaving directory '/home/vagrant/slave/monero-debug-static-ubuntu-amd64/build/build/debug'
make[3]: Entering directory '/home/vagrant/slave/monero-debug-static-ubuntu-amd64/build/build/debug'
[ 65%] Building CXX object src/blockchain_utilities/CMakeFiles/blockchain_ancestry.dir/blockchain_ancestry.cpp.o
[ 66%] Linking CXX executable ../../bin/monero-blockchain-ancestry
make[3]: Leaving directory '/home/vagrant/slave/monero-debug-static-ubuntu-amd64/build/build/debug'
[ 66%] Built target blockchain_ancestry
make[3]: Entering directory '/home/vagrant/slave/monero-debug-static-ubuntu-amd64/build/build/debug'
Scanning dependencies of target blockchain_depth
make[3]: Leaving directory '/home/vagrant/slave/monero-debug-static-ubuntu-amd64/build/build/debug'
make[3]: Entering directory '/home/vagrant/slave/monero-debug-static-ubuntu-amd64/build/build/debug'
[ 66%] Building CXX object src/blockchain_utilities/CMakeFiles/blockchain_depth.dir/blockchain_depth.cpp.o
[ 67%] Linking CXX executable ../../bin/monero-blockchain-depth
make[3]: Leaving directory '/home/vagrant/slave/monero-debug-static-ubuntu-amd64/build/build/debug'
[ 67%] Built target blockchain_depth
make[3]: Entering directory '/home/vagrant/slave/monero-debug-static-ubuntu-amd64/build/build/debug'
Scanning dependencies of target blockchain_prune_known_spent_data
make[3]: Leaving directory '/home/vagrant/slave/monero-debug-static-ubuntu-amd64/build/build/debug'
make[3]: Entering directory '/home/vagrant/slave/monero-debug-static-ubuntu-amd64/build/build/debug'
[ 67%] Building CXX object src/blockchain_utilities/CMakeFiles/blockchain_prune_known_spent_data.dir/blockchain_prune_known_spent_data.cpp.o
[ 67%] Linking CXX executable ../../bin/monero-blockchain-prune-known-spent-data
make[3]: Leaving directory '/home/vagrant/slave/monero-debug-static-ubuntu-amd64/build/build/debug'
[ 67%] Built target blockchain_prune_known_spent_data
make[3]: Entering directory '/home/vagrant/slave/monero-debug-static-ubuntu-amd64/build/build/debug'
Scanning dependencies of target blockchain_import
make[3]: Leaving directory '/home/vagrant/slave/monero-debug-static-ubuntu-amd64/build/build/debug'
make[3]: Entering directory '/home/vagrant/slave/monero-debug-static-ubuntu-amd64/build/build/debug'
[ 67%] Building CXX object src/blockchain_utilities/CMakeFiles/blockchain_import.dir/blockchain_import.cpp.o
In file included from /usr/local/include/boost/iostreams/detail/is_dereferenceable.hpp:12:0,
                 from /usr/local/include/boost/iostreams/detail/resolve.hpp:26,
                 from /usr/local/include/boost/iostreams/detail/push.hpp:24,
                 from /usr/local/include/boost/iostreams/detail/streambuf/indirect_streambuf.hpp:31,
                 from /usr/local/include/boost/iostreams/stream_buffer.hpp:22,
                 from /home/vagrant/slave/monero-debug-static-ubuntu-amd64/build/src/blockchain_utilities/bootstrap_file.h:31,
                 from /home/vagrant/slave/monero-debug-static-ubuntu-amd64/build/src/blockchain_utilities/blockchain_import.cpp:38:
/usr/local/include/boost/type_traits/detail/bool_trait_def.hpp:18:79: note: #pragma message: NOTE: Use of this header (bool_trait_def.hpp) is deprecated
 # pragma message("NOTE: Use of this header (bool_trait_def.hpp) is deprecated")
                                                                               ^
In file included from /usr/local/include/boost/type_traits/detail/bool_trait_def.hpp:21:0,
                 from /usr/local/include/boost/iostreams/detail/is_dereferenceable.hpp:12,
                 from /usr/local/include/boost/iostreams/detail/resolve.hpp:26,
                 from /usr/local/include/boost/iostreams/detail/push.hpp:24,
                 from /usr/local/include/boost/iostreams/detail/streambuf/indirect_streambuf.hpp:31,
                 from /usr/local/include/boost/iostreams/stream_buffer.hpp:22,
                 from /home/vagrant/slave/monero-debug-static-ubuntu-amd64/build/src/blockchain_utilities/bootstrap_file.h:31,
                 from /home/vagrant/slave/monero-debug-static-ubuntu-amd64/build/src/blockchain_utilities/blockchain_import.cpp:38:
/usr/local/include/boost/type_traits/detail/template_arity_spec.hpp:13:84: note: #pragma message: NOTE: Use of this header (template_arity_spec.hpp) is deprecated
 # pragma message("NOTE: Use of this header (template_arity_spec.hpp) is deprecated")
                                                                                    ^
In file included from /usr/local/include/boost/iostreams/detail/is_dereferenceable.hpp:13:0,
                 from /usr/local/include/boost/iostreams/detail/resolve.hpp:26,
                 from /usr/local/include/boost/iostreams/detail/push.hpp:24,
                 from /usr/local/include/boost/iostreams/detail/streambuf/indirect_streambuf.hpp:31,
                 from /usr/local/include/boost/iostreams/stream_buffer.hpp:22,
                 from /home/vagrant/slave/monero-debug-static-ubuntu-amd64/build/src/blockchain_utilities/bootstrap_file.h:31,
                 from /home/vagrant/slave/monero-debug-static-ubuntu-amd64/build/src/blockchain_utilities/blockchain_import.cpp:38:
/usr/local/include/boost/type_traits/detail/template_arity_spec.hpp:13:84: note: #pragma message: NOTE: Use of this header (template_arity_spec.hpp) is deprecated
 # pragma message("NOTE: Use of this header (template_arity_spec.hpp) is deprecated")
                                                                                    ^
[ 67%] Building CXX object src/blockchain_utilities/CMakeFiles/blockchain_import.dir/bootstrap_file.cpp.o
In file included from /usr/local/include/boost/iostreams/detail/is_dereferenceable.hpp:12:0,
                 from /usr/local/include/boost/iostreams/detail/resolve.hpp:26,
                 from /usr/local/include/boost/iostreams/detail/push.hpp:24,
                 from /usr/local/include/boost/iostreams/detail/streambuf/indirect_streambuf.hpp:31,
                 from /usr/local/include/boost/iostreams/stream_buffer.hpp:22,
                 from /home/vagrant/slave/monero-debug-static-ubuntu-amd64/build/src/blockchain_utilities/bootstrap_file.h:31,
                 from /home/vagrant/slave/monero-debug-static-ubuntu-amd64/build/src/blockchain_utilities/bootstrap_file.cpp:33:
/usr/local/include/boost/type_traits/detail/bool_trait_def.hpp:18:79: note: #pragma message: NOTE: Use of this header (bool_trait_def.hpp) is deprecated
 # pragma message("NOTE: Use of this header (bool_trait_def.hpp) is deprecated")
                                                                               ^
In file included from /usr/local/include/boost/type_traits/detail/bool_trait_def.hpp:21:0,
                 from /usr/local/include/boost/iostreams/detail/is_dereferenceable.hpp:12,
                 from /usr/local/include/boost/iostreams/detail/resolve.hpp:26,
                 from /usr/local/include/boost/iostreams/detail/push.hpp:24,
                 from /usr/local/include/boost/iostreams/detail/streambuf/indirect_streambuf.hpp:31,
                 from /usr/local/include/boost/iostreams/stream_buffer.hpp:22,
                 from /home/vagrant/slave/monero-debug-static-ubuntu-amd64/build/src/blockchain_utilities/bootstrap_file.h:31,
                 from /home/vagrant/slave/monero-debug-static-ubuntu-amd64/build/src/blockchain_utilities/bootstrap_file.cpp:33:
/usr/local/include/boost/type_traits/detail/template_arity_spec.hpp:13:84: note: #pragma message: NOTE: Use of this header (template_arity_spec.hpp) is deprecated
 # pragma message("NOTE: Use of this header (template_arity_spec.hpp) is deprecated")
                                                                                    ^
In file included from /usr/local/include/boost/iostreams/detail/is_dereferenceable.hpp:13:0,
                 from /usr/local/include/boost/iostreams/detail/resolve.hpp:26,
                 from /usr/local/include/boost/iostreams/detail/push.hpp:24,
                 from /usr/local/include/boost/iostreams/detail/streambuf/indirect_streambuf.hpp:31,
                 from /usr/local/include/boost/iostreams/stream_buffer.hpp:22,
                 from /home/vagrant/slave/monero-debug-static-ubuntu-amd64/build/src/blockchain_utilities/bootstrap_file.h:31,
                 from /home/vagrant/slave/monero-debug-static-ubuntu-amd64/build/src/blockchain_utilities/bootstrap_file.cpp:33:
/usr/local/include/boost/type_traits/detail/template_arity_spec.hpp:13:84: note: #pragma message: NOTE: Use of this header (template_arity_spec.hpp) is deprecated
 # pragma message("NOTE: Use of this header (template_arity_spec.hpp) is deprecated")
                                                                                    ^
[ 67%] Building CXX object src/blockchain_utilities/CMakeFiles/blockchain_import.dir/blocksdat_file.cpp.o
In file included from /usr/local/include/boost/iostreams/detail/is_dereferenceable.hpp:12:0,
                 from /usr/local/include/boost/iostreams/detail/resolve.hpp:26,
                 from /usr/local/include/boost/iostreams/detail/push.hpp:24,
                 from /usr/local/include/boost/iostreams/detail/streambuf/indirect_streambuf.hpp:31,
                 from /usr/local/include/boost/iostreams/stream_buffer.hpp:22,
                 from /home/vagrant/slave/monero-debug-static-ubuntu-amd64/build/src/blockchain_utilities/blocksdat_file.h:31,
                 from /home/vagrant/slave/monero-debug-static-ubuntu-amd64/build/src/blockchain_utilities/blocksdat_file.cpp:29:
/usr/local/include/boost/type_traits/detail/bool_trait_def.hpp:18:79: note: #pragma message: NOTE: Use of this header (bool_trait_def.hpp) is deprecated
 # pragma message("NOTE: Use of this header (bool_trait_def.hpp) is deprecated")
                                                                               ^
In file included from /usr/local/include/boost/type_traits/detail/bool_trait_def.hpp:21:0,
                 from /usr/local/include/boost/iostreams/detail/is_dereferenceable.hpp:12,
                 from /usr/local/include/boost/iostreams/detail/resolve.hpp:26,
                 from /usr/local/include/boost/iostreams/detail/push.hpp:24,
                 from /usr/local/include/boost/iostreams/detail/streambuf/indirect_streambuf.hpp:31,
                 from /usr/local/include/boost/iostreams/stream_buffer.hpp:22,
                 from /home/vagrant/slave/monero-debug-static-ubuntu-amd64/build/src/blockchain_utilities/blocksdat_file.h:31,
                 from /home/vagrant/slave/monero-debug-static-ubuntu-amd64/build/src/blockchain_utilities/blocksdat_file.cpp:29:
/usr/local/include/boost/type_traits/detail/template_arity_spec.hpp:13:84: note: #pragma message: NOTE: Use of this header (template_arity_spec.hpp) is deprecated
 # pragma message("NOTE: Use of this header (template_arity_spec.hpp) is deprecated")
                                                                                    ^
In file included from /usr/local/include/boost/iostreams/detail/is_dereferenceable.hpp:13:0,
                 from /usr/local/include/boost/iostreams/detail/resolve.hpp:26,
                 from /usr/local/include/boost/iostreams/detail/push.hpp:24,
                 from /usr/local/include/boost/iostreams/detail/streambuf/indirect_streambuf.hpp:31,
                 from /usr/local/include/boost/iostreams/stream_buffer.hpp:22,
                 from /home/vagrant/slave/monero-debug-static-ubuntu-amd64/build/src/blockchain_utilities/blocksdat_file.h:31,
                 from /home/vagrant/slave/monero-debug-static-ubuntu-amd64/build/src/blockchain_utilities/blocksdat_file.cpp:29:
/usr/local/include/boost/type_traits/detail/template_arity_spec.hpp:13:84: note: #pragma message: NOTE: Use of this header (template_arity_spec.hpp) is deprecated
 # pragma message("NOTE: Use of this header (template_arity_spec.hpp) is deprecated")
                                                                                    ^
[ 67%] Linking CXX executable ../../bin/monero-blockchain-import
make[3]: Leaving directory '/home/vagrant/slave/monero-debug-static-ubuntu-amd64/build/build/debug'
[ 67%] Built target blockchain_import
make[3]: Entering directory '/home/vagrant/slave/monero-debug-static-ubuntu-amd64/build/build/debug'
Scanning dependencies of target blockchain_prune
make[3]: Leaving directory '/home/vagrant/slave/monero-debug-static-ubuntu-amd64/build/build/debug'
make[3]: Entering directory '/home/vagrant/slave/monero-debug-static-ubuntu-amd64/build/build/debug'
[ 68%] Building CXX object src/blockchain_utilities/CMakeFiles/blockchain_prune.dir/blockchain_prune.cpp.o
[ 68%] Linking CXX executable ../../bin/monero-blockchain-prune
make[3]: Leaving directory '/home/vagrant/slave/monero-debug-static-ubuntu-amd64/build/build/debug'
[ 68%] Built target blockchain_prune
make[3]: Entering directory '/home/vagrant/slave/monero-debug-static-ubuntu-amd64/build/build/debug'
Scanning dependencies of target cn_deserialize
make[3]: Leaving directory '/home/vagrant/slave/monero-debug-static-ubuntu-amd64/build/build/debug'
make[3]: Entering directory '/home/vagrant/slave/monero-debug-static-ubuntu-amd64/build/build/debug'
[ 68%] Building CXX object src/debug_utilities/CMakeFiles/cn_deserialize.dir/cn_deserialize.cpp.o
[ 68%] Linking CXX executable ../../bin/monero-utils-deserialize
make[3]: Leaving directory '/home/vagrant/slave/monero-debug-static-ubuntu-amd64/build/build/debug'
[ 68%] Built target cn_deserialize
make[3]: Entering directory '/home/vagrant/slave/monero-debug-static-ubuntu-amd64/build/build/debug'
Scanning dependencies of target object_sizes
make[3]: Leaving directory '/home/vagrant/slave/monero-debug-static-ubuntu-amd64/build/build/debug'
make[3]: Entering directory '/home/vagrant/slave/monero-debug-static-ubuntu-amd64/build/build/debug'
[ 68%] Building CXX object src/debug_utilities/CMakeFiles/object_sizes.dir/object_sizes.cpp.o
[ 68%] Linking CXX executable ../../bin/monero-utils-object-sizes
make[3]: Leaving directory '/home/vagrant/slave/monero-debug-static-ubuntu-amd64/build/build/debug'
[ 68%] Built target object_sizes
make[3]: Entering directory '/home/vagrant/slave/monero-debug-static-ubuntu-amd64/build/build/debug'
Scanning dependencies of target googletest
make[3]: Leaving directory '/home/vagrant/slave/monero-debug-static-ubuntu-amd64/build/build/debug'
make[3]: Entering directory '/home/vagrant/slave/monero-debug-static-ubuntu-amd64/build/build/debug'
[ 69%] Creating directories for 'googletest'
[ 69%] No download step for 'googletest'
[ 69%] No patch step for 'googletest'
[ 69%] No update step for 'googletest'
[ 70%] Performing configure step for 'googletest'
-- The CXX compiler identification is GNU 5.4.0
-- The C compiler identification is GNU 5.4.0
-- Check for working CXX compiler: /usr/bin/c++
-- Check for working CXX compiler: /usr/bin/c++ -- works
-- Detecting CXX compiler ABI info
-- Detecting CXX compiler ABI info - done
-- Detecting CXX compile features
-- Detecting CXX compile features - done
-- Check for working C compiler: /usr/bin/cc
-- Check for working C compiler: /usr/bin/cc -- works
-- Detecting C compiler ABI info
-- Detecting C compiler ABI info - done
-- Detecting C compile features
-- Detecting C compile features - done
-- Found PythonInterp: /usr/bin/python (found version "2.7.12") 
-- Looking for pthread.h
-- Looking for pthread.h - found
-- Looking for pthread_create
-- Looking for pthread_create - not found
-- Looking for pthread_create in pthreads
-- Looking for pthread_create in pthreads - not found
-- Looking for pthread_create in pthread
-- Looking for pthread_create in pthread - found
-- Found Threads: TRUE  
-- Configuring done
-- Generating done
-- Build files have been written to: /home/vagrant/slave/monero-debug-static-ubuntu-amd64/build/build/debug/tests/gtest
[ 70%] Performing build step for 'googletest'
make[4]: Entering directory '/home/vagrant/slave/monero-debug-static-ubuntu-amd64/build/build/debug/tests/gtest'
make[5]: Entering directory '/home/vagrant/slave/monero-debug-static-ubuntu-amd64/build/build/debug/tests/gtest'
make[6]: Entering directory '/home/vagrant/slave/monero-debug-static-ubuntu-amd64/build/build/debug/tests/gtest'
Scanning dependencies of target gtest
make[6]: Leaving directory '/home/vagrant/slave/monero-debug-static-ubuntu-amd64/build/build/debug/tests/gtest'
make[6]: Entering directory '/home/vagrant/slave/monero-debug-static-ubuntu-amd64/build/build/debug/tests/gtest'
[ 25%] Building CXX object CMakeFiles/gtest.dir/src/gtest-all.cc.o
[ 50%] Linking CXX static library libgtest.a
make[6]: Leaving directory '/home/vagrant/slave/monero-debug-static-ubuntu-amd64/build/build/debug/tests/gtest'
[ 50%] Built target gtest
make[6]: Entering directory '/home/vagrant/slave/monero-debug-static-ubuntu-amd64/build/build/debug/tests/gtest'
Scanning dependencies of target gtest_main
make[6]: Leaving directory '/home/vagrant/slave/monero-debug-static-ubuntu-amd64/build/build/debug/tests/gtest'
make[6]: Entering directory '/home/vagrant/slave/monero-debug-static-ubuntu-amd64/build/build/debug/tests/gtest'
[ 75%] Building CXX object CMakeFiles/gtest_main.dir/src/gtest_main.cc.o
[100%] Linking CXX static library libgtest_main.a
make[6]: Leaving directory '/home/vagrant/slave/monero-debug-static-ubuntu-amd64/build/build/debug/tests/gtest'
[100%] Built target gtest_main
make[5]: Leaving directory '/home/vagrant/slave/monero-debug-static-ubuntu-amd64/build/build/debug/tests/gtest'
make[4]: Leaving directory '/home/vagrant/slave/monero-debug-static-ubuntu-amd64/build/build/debug/tests/gtest'
[ 70%] No install step for 'googletest'
[ 70%] Completed 'googletest'
make[3]: Leaving directory '/home/vagrant/slave/monero-debug-static-ubuntu-amd64/build/build/debug'
[ 70%] Built target googletest
make[3]: Entering directory '/home/vagrant/slave/monero-debug-static-ubuntu-amd64/build/build/debug'
Scanning dependencies of target hash-target-tests
make[3]: Leaving directory '/home/vagrant/slave/monero-debug-static-ubuntu-amd64/build/build/debug'
make[3]: Entering directory '/home/vagrant/slave/monero-debug-static-ubuntu-amd64/build/build/debug'
[ 70%] Building CXX object tests/CMakeFiles/hash-target-tests.dir/hash-target.cpp.o
[ 70%] Linking CXX executable hash-target-tests
make[3]: Leaving directory '/home/vagrant/slave/monero-debug-static-ubuntu-amd64/build/build/debug'
[ 70%] Built target hash-target-tests
make[3]: Entering directory '/home/vagrant/slave/monero-debug-static-ubuntu-amd64/build/build/debug'
Scanning dependencies of target core_tests
make[3]: Leaving directory '/home/vagrant/slave/monero-debug-static-ubuntu-amd64/build/build/debug'
make[3]: Entering directory '/home/vagrant/slave/monero-debug-static-ubuntu-amd64/build/build/debug'
[ 70%] Building CXX object tests/core_tests/CMakeFiles/core_tests.dir/block_reward.cpp.o
[ 71%] Building CXX object tests/core_tests/CMakeFiles/core_tests.dir/block_validation.cpp.o
[ 71%] Building CXX object tests/core_tests/CMakeFiles/core_tests.dir/chain_split_1.cpp.o
[ 71%] Building CXX object tests/core_tests/CMakeFiles/core_tests.dir/chain_switch_1.cpp.o
[ 71%] Building CXX object tests/core_tests/CMakeFiles/core_tests.dir/chaingen.cpp.o
[ 71%] Building CXX object tests/core_tests/CMakeFiles/core_tests.dir/chaingen001.cpp.o
[ 72%] Building CXX object tests/core_tests/CMakeFiles/core_tests.dir/chaingen_main.cpp.o
[ 72%] Building CXX object tests/core_tests/CMakeFiles/core_tests.dir/double_spend.cpp.o
[ 72%] Building CXX object tests/core_tests/CMakeFiles/core_tests.dir/integer_overflow.cpp.o
[ 72%] Building CXX object tests/core_tests/CMakeFiles/core_tests.dir/multisig.cpp.o
[ 72%] Building CXX object tests/core_tests/CMakeFiles/core_tests.dir/ring_signature_1.cpp.o
[ 73%] Building CXX object tests/core_tests/CMakeFiles/core_tests.dir/transaction_tests.cpp.o
[ 73%] Building CXX object tests/core_tests/CMakeFiles/core_tests.dir/tx_validation.cpp.o
[ 73%] Building CXX object tests/core_tests/CMakeFiles/core_tests.dir/v2_tests.cpp.o
[ 73%] Building CXX object tests/core_tests/CMakeFiles/core_tests.dir/rct.cpp.o
[ 74%] Building CXX object tests/core_tests/CMakeFiles/core_tests.dir/bulletproofs.cpp.o
[ 74%] Building CXX object tests/core_tests/CMakeFiles/core_tests.dir/wallet_tools.cpp.o
[ 74%] Linking CXX executable core_tests
make[3]: Leaving directory '/home/vagrant/slave/monero-debug-static-ubuntu-amd64/build/build/debug'
[ 74%] Built target core_tests
make[3]: Entering directory '/home/vagrant/slave/monero-debug-static-ubuntu-amd64/build/build/debug'
Scanning dependencies of target levin_fuzz_tests
make[3]: Leaving directory '/home/vagrant/slave/monero-debug-static-ubuntu-amd64/build/build/debug'
make[3]: Entering directory '/home/vagrant/slave/monero-debug-static-ubuntu-amd64/build/build/debug'
[ 74%] Building CXX object tests/fuzz/CMakeFiles/levin_fuzz_tests.dir/levin.cpp.o
[ 75%] Building CXX object tests/fuzz/CMakeFiles/levin_fuzz_tests.dir/fuzzer.cpp.o
[ 75%] Linking CXX executable levin_fuzz_tests
make[3]: Leaving directory '/home/vagrant/slave/monero-debug-static-ubuntu-amd64/build/build/debug'
[ 75%] Built target levin_fuzz_tests
make[3]: Entering directory '/home/vagrant/slave/monero-debug-static-ubuntu-amd64/build/build/debug'
Scanning dependencies of target cold-outputs_fuzz_tests
make[3]: Leaving directory '/home/vagrant/slave/monero-debug-static-ubuntu-amd64/build/build/debug'
make[3]: Entering directory '/home/vagrant/slave/monero-debug-static-ubuntu-amd64/build/build/debug'
[ 75%] Building CXX object tests/fuzz/CMakeFiles/cold-outputs_fuzz_tests.dir/cold-outputs.cpp.o
[ 76%] Building CXX object tests/fuzz/CMakeFiles/cold-outputs_fuzz_tests.dir/fuzzer.cpp.o
[ 76%] Linking CXX executable cold-outputs_fuzz_tests
make[3]: Leaving directory '/home/vagrant/slave/monero-debug-static-ubuntu-amd64/build/build/debug'
[ 76%] Built target cold-outputs_fuzz_tests
make[3]: Entering directory '/home/vagrant/slave/monero-debug-static-ubuntu-amd64/build/build/debug'
Scanning dependencies of target load-from-binary_fuzz_tests
make[3]: Leaving directory '/home/vagrant/slave/monero-debug-static-ubuntu-amd64/build/build/debug'
make[3]: Entering directory '/home/vagrant/slave/monero-debug-static-ubuntu-amd64/build/build/debug'
[ 76%] Building CXX object tests/fuzz/CMakeFiles/load-from-binary_fuzz_tests.dir/load_from_binary.cpp.o
[ 76%] Building CXX object tests/fuzz/CMakeFiles/load-from-binary_fuzz_tests.dir/fuzzer.cpp.o
[ 76%] Linking CXX executable load-from-binary_fuzz_tests
make[3]: Leaving directory '/home/vagrant/slave/monero-debug-static-ubuntu-amd64/build/build/debug'
[ 76%] Built target load-from-binary_fuzz_tests
make[3]: Entering directory '/home/vagrant/slave/monero-debug-static-ubuntu-amd64/build/build/debug'
Scanning dependencies of target transaction_fuzz_tests
make[3]: Leaving directory '/home/vagrant/slave/monero-debug-static-ubuntu-amd64/build/build/debug'
make[3]: Entering directory '/home/vagrant/slave/monero-debug-static-ubuntu-amd64/build/build/debug'
[ 77%] Building CXX object tests/fuzz/CMakeFiles/transaction_fuzz_tests.dir/transaction.cpp.o
[ 77%] Building CXX object tests/fuzz/CMakeFiles/transaction_fuzz_tests.dir/fuzzer.cpp.o
[ 77%] Linking CXX executable transaction_fuzz_tests
make[3]: Leaving directory '/home/vagrant/slave/monero-debug-static-ubuntu-amd64/build/build/debug'
[ 77%] Built target transaction_fuzz_tests
make[3]: Entering directory '/home/vagrant/slave/monero-debug-static-ubuntu-amd64/build/build/debug'
Scanning dependencies of target block_fuzz_tests
make[3]: Leaving directory '/home/vagrant/slave/monero-debug-static-ubuntu-amd64/build/build/debug'
make[3]: Entering directory '/home/vagrant/slave/monero-debug-static-ubuntu-amd64/build/build/debug'
[ 77%] Building CXX object tests/fuzz/CMakeFiles/block_fuzz_tests.dir/block.cpp.o
[ 78%] Building CXX object tests/fuzz/CMakeFiles/block_fuzz_tests.dir/fuzzer.cpp.o
[ 78%] Linking CXX executable block_fuzz_tests
make[3]: Leaving directory '/home/vagrant/slave/monero-debug-static-ubuntu-amd64/build/build/debug'
[ 78%] Built target block_fuzz_tests
make[3]: Entering directory '/home/vagrant/slave/monero-debug-static-ubuntu-amd64/build/build/debug'
Scanning dependencies of target signature_fuzz_tests
make[3]: Leaving directory '/home/vagrant/slave/monero-debug-static-ubuntu-amd64/build/build/debug'
make[3]: Entering directory '/home/vagrant/slave/monero-debug-static-ubuntu-amd64/build/build/debug'
[ 78%] Building CXX object tests/fuzz/CMakeFiles/signature_fuzz_tests.dir/signature.cpp.o
[ 78%] Building CXX object tests/fuzz/CMakeFiles/signature_fuzz_tests.dir/fuzzer.cpp.o
[ 78%] Linking CXX executable signature_fuzz_tests
make[3]: Leaving directory '/home/vagrant/slave/monero-debug-static-ubuntu-amd64/build/build/debug'
[ 78%] Built target signature_fuzz_tests
make[3]: Entering directory '/home/vagrant/slave/monero-debug-static-ubuntu-amd64/build/build/debug'
Scanning dependencies of target cold-transaction_fuzz_tests
make[3]: Leaving directory '/home/vagrant/slave/monero-debug-static-ubuntu-amd64/build/build/debug'
make[3]: Entering directory '/home/vagrant/slave/monero-debug-static-ubuntu-amd64/build/build/debug'
[ 78%] Building CXX object tests/fuzz/CMakeFiles/cold-transaction_fuzz_tests.dir/cold-transaction.cpp.o
[ 78%] Building CXX object tests/fuzz/CMakeFiles/cold-transaction_fuzz_tests.dir/fuzzer.cpp.o
[ 78%] Linking CXX executable cold-transaction_fuzz_tests
make[3]: Leaving directory '/home/vagrant/slave/monero-debug-static-ubuntu-amd64/build/build/debug'
[ 78%] Built target cold-transaction_fuzz_tests
make[3]: Entering directory '/home/vagrant/slave/monero-debug-static-ubuntu-amd64/build/build/debug'
Scanning dependencies of target parse-url_fuzz_tests
make[3]: Leaving directory '/home/vagrant/slave/monero-debug-static-ubuntu-amd64/build/build/debug'
make[3]: Entering directory '/home/vagrant/slave/monero-debug-static-ubuntu-amd64/build/build/debug'
[ 78%] Building CXX object tests/fuzz/CMakeFiles/parse-url_fuzz_tests.dir/parse_url.cpp.o
[ 78%] Building CXX object tests/fuzz/CMakeFiles/parse-url_fuzz_tests.dir/fuzzer.cpp.o
[ 78%] Linking CXX executable parse-url_fuzz_tests
make[3]: Leaving directory '/home/vagrant/slave/monero-debug-static-ubuntu-amd64/build/build/debug'
[ 78%] Built target parse-url_fuzz_tests
make[3]: Entering directory '/home/vagrant/slave/monero-debug-static-ubuntu-amd64/build/build/debug'
Scanning dependencies of target load-from-json_fuzz_tests
make[3]: Leaving directory '/home/vagrant/slave/monero-debug-static-ubuntu-amd64/build/build/debug'
make[3]: Entering directory '/home/vagrant/slave/monero-debug-static-ubuntu-amd64/build/build/debug'
[ 79%] Building CXX object tests/fuzz/CMakeFiles/load-from-json_fuzz_tests.dir/load_from_json.cpp.o
[ 79%] Building CXX object tests/fuzz/CMakeFiles/load-from-json_fuzz_tests.dir/fuzzer.cpp.o
[ 79%] Linking CXX executable load-from-json_fuzz_tests
make[3]: Leaving directory '/home/vagrant/slave/monero-debug-static-ubuntu-amd64/build/build/debug'
[ 79%] Built target load-from-json_fuzz_tests
make[3]: Entering directory '/home/vagrant/slave/monero-debug-static-ubuntu-amd64/build/build/debug'
Scanning dependencies of target base58_fuzz_tests
make[3]: Leaving directory '/home/vagrant/slave/monero-debug-static-ubuntu-amd64/build/build/debug'
make[3]: Entering directory '/home/vagrant/slave/monero-debug-static-ubuntu-amd64/build/build/debug'
[ 79%] Building CXX object tests/fuzz/CMakeFiles/base58_fuzz_tests.dir/base58.cpp.o
[ 79%] Building CXX object tests/fuzz/CMakeFiles/base58_fuzz_tests.dir/fuzzer.cpp.o
[ 79%] Linking CXX executable base58_fuzz_tests
make[3]: Leaving directory '/home/vagrant/slave/monero-debug-static-ubuntu-amd64/build/build/debug'
[ 79%] Built target base58_fuzz_tests
make[3]: Entering directory '/home/vagrant/slave/monero-debug-static-ubuntu-amd64/build/build/debug'
Scanning dependencies of target bulletproof_fuzz_tests
make[3]: Leaving directory '/home/vagrant/slave/monero-debug-static-ubuntu-amd64/build/build/debug'
make[3]: Entering directory '/home/vagrant/slave/monero-debug-static-ubuntu-amd64/build/build/debug'
[ 79%] Building CXX object tests/fuzz/CMakeFiles/bulletproof_fuzz_tests.dir/bulletproof.cpp.o
[ 79%] Building CXX object tests/fuzz/CMakeFiles/bulletproof_fuzz_tests.dir/fuzzer.cpp.o
[ 79%] Linking CXX executable bulletproof_fuzz_tests
make[3]: Leaving directory '/home/vagrant/slave/monero-debug-static-ubuntu-amd64/build/build/debug'
[ 79%] Built target bulletproof_fuzz_tests
make[3]: Entering directory '/home/vagrant/slave/monero-debug-static-ubuntu-amd64/build/build/debug'
Scanning dependencies of target http-client_fuzz_tests
make[3]: Leaving directory '/home/vagrant/slave/monero-debug-static-ubuntu-amd64/build/build/debug'
make[3]: Entering directory '/home/vagrant/slave/monero-debug-static-ubuntu-amd64/build/build/debug'
[ 79%] Building CXX object tests/fuzz/CMakeFiles/http-client_fuzz_tests.dir/http-client.cpp.o
[ 79%] Building CXX object tests/fuzz/CMakeFiles/http-client_fuzz_tests.dir/fuzzer.cpp.o
[ 79%] Linking CXX executable http-client_fuzz_tests
make[3]: Leaving directory '/home/vagrant/slave/monero-debug-static-ubuntu-amd64/build/build/debug'
[ 79%] Built target http-client_fuzz_tests
make[3]: Entering directory '/home/vagrant/slave/monero-debug-static-ubuntu-amd64/build/build/debug'
Scanning dependencies of target cncrypto-tests
make[3]: Leaving directory '/home/vagrant/slave/monero-debug-static-ubuntu-amd64/build/build/debug'
make[3]: Entering directory '/home/vagrant/slave/monero-debug-static-ubuntu-amd64/build/build/debug'
[ 80%] Building C object tests/crypto/CMakeFiles/cncrypto-tests.dir/crypto-ops-data.c.o
[ 80%] Building C object tests/crypto/CMakeFiles/cncrypto-tests.dir/crypto-ops.c.o
[ 80%] Building CXX object tests/crypto/CMakeFiles/cncrypto-tests.dir/crypto.cpp.o
[ 80%] Building C object tests/crypto/CMakeFiles/cncrypto-tests.dir/hash.c.o
[ 80%] Building CXX object tests/crypto/CMakeFiles/cncrypto-tests.dir/main.cpp.o
[ 81%] Building C object tests/crypto/CMakeFiles/cncrypto-tests.dir/random.c.o
[ 81%] Linking CXX executable cncrypto-tests
make[3]: Leaving directory '/home/vagrant/slave/monero-debug-static-ubuntu-amd64/build/build/debug'
[ 81%] Built target cncrypto-tests
make[3]: Entering directory '/home/vagrant/slave/monero-debug-static-ubuntu-amd64/build/build/debug'
Scanning dependencies of target cnv4-jit-tests
make[3]: Leaving directory '/home/vagrant/slave/monero-debug-static-ubuntu-amd64/build/build/debug'
make[3]: Entering directory '/home/vagrant/slave/monero-debug-static-ubuntu-amd64/build/build/debug'
[ 81%] Building C object tests/crypto/CMakeFiles/cnv4-jit-tests.dir/cnv4-jit.c.o
[ 81%] Linking CXX executable cnv4-jit-tests
make[3]: Leaving directory '/home/vagrant/slave/monero-debug-static-ubuntu-amd64/build/build/debug'
[ 81%] Built target cnv4-jit-tests
make[3]: Entering directory '/home/vagrant/slave/monero-debug-static-ubuntu-amd64/build/build/debug'
Scanning dependencies of target functional_tests
make[3]: Leaving directory '/home/vagrant/slave/monero-debug-static-ubuntu-amd64/build/build/debug'
make[3]: Entering directory '/home/vagrant/slave/monero-debug-static-ubuntu-amd64/build/build/debug'
[ 81%] Building CXX object tests/functional_tests/CMakeFiles/functional_tests.dir/main.cpp.o
[ 81%] Building CXX object tests/functional_tests/CMakeFiles/functional_tests.dir/transactions_flow_test.cpp.o
[ 81%] Building CXX object tests/functional_tests/CMakeFiles/functional_tests.dir/transactions_generation_from_blockchain.cpp.o
[ 82%] Linking CXX executable functional_tests
make[3]: Leaving directory '/home/vagrant/slave/monero-debug-static-ubuntu-amd64/build/build/debug'
[ 82%] Built target functional_tests
make[3]: Entering directory '/home/vagrant/slave/monero-debug-static-ubuntu-amd64/build/build/debug'
Scanning dependencies of target performance_tests
make[3]: Leaving directory '/home/vagrant/slave/monero-debug-static-ubuntu-amd64/build/build/debug'
make[3]: Entering directory '/home/vagrant/slave/monero-debug-static-ubuntu-amd64/build/build/debug'
[ 83%] Building CXX object tests/performance_tests/CMakeFiles/performance_tests.dir/main.cpp.o
[ 83%] Linking CXX executable performance_tests
make[3]: Leaving directory '/home/vagrant/slave/monero-debug-static-ubuntu-amd64/build/build/debug'
[ 83%] Built target performance_tests
make[3]: Entering directory '/home/vagrant/slave/monero-debug-static-ubuntu-amd64/build/build/debug'
Scanning dependencies of target core_proxy
make[3]: Leaving directory '/home/vagrant/slave/monero-debug-static-ubuntu-amd64/build/build/debug'
make[3]: Entering directory '/home/vagrant/slave/monero-debug-static-ubuntu-amd64/build/build/debug'
[ 83%] Building CXX object tests/core_proxy/CMakeFiles/core_proxy.dir/core_proxy.cpp.o
[ 83%] Linking CXX executable core_proxy
make[3]: Leaving directory '/home/vagrant/slave/monero-debug-static-ubuntu-amd64/build/build/debug'
[ 83%] Built target core_proxy
make[3]: Entering directory '/home/vagrant/slave/monero-debug-static-ubuntu-amd64/build/build/debug'
Scanning dependencies of target unit_tests
make[3]: Leaving directory '/home/vagrant/slave/monero-debug-static-ubuntu-amd64/build/build/debug'
make[3]: Entering directory '/home/vagrant/slave/monero-debug-static-ubuntu-amd64/build/build/debug'
[ 84%] Building CXX object tests/unit_tests/CMakeFiles/unit_tests.dir/account.cpp.o
[ 84%] Building CXX object tests/unit_tests/CMakeFiles/unit_tests.dir/apply_permutation.cpp.o
[ 84%] Building CXX object tests/unit_tests/CMakeFiles/unit_tests.dir/address_from_url.cpp.o
[ 84%] Building CXX object tests/unit_tests/CMakeFiles/unit_tests.dir/ban.cpp.o
[ 84%] Building CXX object tests/unit_tests/CMakeFiles/unit_tests.dir/base58.cpp.o
[ 85%] Building CXX object tests/unit_tests/CMakeFiles/unit_tests.dir/blockchain_db.cpp.o
[ 85%] Building CXX object tests/unit_tests/CMakeFiles/unit_tests.dir/block_queue.cpp.o
[ 85%] Building CXX object tests/unit_tests/CMakeFiles/unit_tests.dir/block_reward.cpp.o
[ 85%] Building CXX object tests/unit_tests/CMakeFiles/unit_tests.dir/bulletproofs.cpp.o
[ 86%] Building CXX object tests/unit_tests/CMakeFiles/unit_tests.dir/canonical_amounts.cpp.o
[ 86%] Building CXX object tests/unit_tests/CMakeFiles/unit_tests.dir/chacha.cpp.o
[ 86%] Building CXX object tests/unit_tests/CMakeFiles/unit_tests.dir/checkpoints.cpp.o
[ 86%] Building CXX object tests/unit_tests/CMakeFiles/unit_tests.dir/command_line.cpp.o
[ 86%] Building CXX object tests/unit_tests/CMakeFiles/unit_tests.dir/crypto.cpp.o
[ 87%] Building CXX object tests/unit_tests/CMakeFiles/unit_tests.dir/decompose_amount_into_digits.cpp.o
[ 87%] Building CXX object tests/unit_tests/CMakeFiles/unit_tests.dir/device.cpp.o
[ 87%] Building CXX object tests/unit_tests/CMakeFiles/unit_tests.dir/difficulty.cpp.o
[ 87%] Building CXX object tests/unit_tests/CMakeFiles/unit_tests.dir/dns_resolver.cpp.o
[ 87%] Building CXX object tests/unit_tests/CMakeFiles/unit_tests.dir/epee_boosted_tcp_server.cpp.o
[ 88%] Building CXX object tests/unit_tests/CMakeFiles/unit_tests.dir/epee_levin_protocol_handler_async.cpp.o
[ 88%] Building CXX object tests/unit_tests/CMakeFiles/unit_tests.dir/epee_utils.cpp.o
[ 88%] Building CXX object tests/unit_tests/CMakeFiles/unit_tests.dir/expect.cpp.o
[ 88%] Building CXX object tests/unit_tests/CMakeFiles/unit_tests.dir/fee.cpp.o
[ 89%] Building CXX object tests/unit_tests/CMakeFiles/unit_tests.dir/json_serialization.cpp.o
[ 89%] Building CXX object tests/unit_tests/CMakeFiles/unit_tests.dir/get_xtype_from_string.cpp.o
[ 89%] Building CXX object tests/unit_tests/CMakeFiles/unit_tests.dir/hashchain.cpp.o
[ 89%] Building CXX object tests/unit_tests/CMakeFiles/unit_tests.dir/hmac_keccak.cpp.o
[ 89%] Building CXX object tests/unit_tests/CMakeFiles/unit_tests.dir/http.cpp.o
[ 90%] Building CXX object tests/unit_tests/CMakeFiles/unit_tests.dir/keccak.cpp.o
[ 90%] Building CXX object tests/unit_tests/CMakeFiles/unit_tests.dir/logging.cpp.o
[ 90%] Building CXX object tests/unit_tests/CMakeFiles/unit_tests.dir/long_term_block_weight.cpp.o
[ 90%] Building CXX object tests/unit_tests/CMakeFiles/unit_tests.dir/lmdb.cpp.o
[ 90%] Building CXX object tests/unit_tests/CMakeFiles/unit_tests.dir/main.cpp.o
[ 91%] Building CXX object tests/unit_tests/CMakeFiles/unit_tests.dir/memwipe.cpp.o
[ 91%] Building CXX object tests/unit_tests/CMakeFiles/unit_tests.dir/mlocker.cpp.o
[ 91%] Building CXX object tests/unit_tests/CMakeFiles/unit_tests.dir/mnemonics.cpp.o
[ 91%] Building CXX object tests/unit_tests/CMakeFiles/unit_tests.dir/mul_div.cpp.o
[ 91%] Building CXX object tests/unit_tests/CMakeFiles/unit_tests.dir/multiexp.cpp.o
[ 92%] Building CXX object tests/unit_tests/CMakeFiles/unit_tests.dir/multisig.cpp.o
[ 92%] Building CXX object tests/unit_tests/CMakeFiles/unit_tests.dir/net.cpp.o
[ 92%] Building CXX object tests/unit_tests/CMakeFiles/unit_tests.dir/notify.cpp.o
[ 92%] Building CXX object tests/unit_tests/CMakeFiles/unit_tests.dir/output_distribution.cpp.o
[ 93%] Building CXX object tests/unit_tests/CMakeFiles/unit_tests.dir/parse_amount.cpp.o
[ 93%] Building CXX object tests/unit_tests/CMakeFiles/unit_tests.dir/pruning.cpp.o
[ 93%] Building CXX object tests/unit_tests/CMakeFiles/unit_tests.dir/random.cpp.o
[ 93%] Building CXX object tests/unit_tests/CMakeFiles/unit_tests.dir/rolling_median.cpp.o
[ 93%] Building CXX object tests/unit_tests/CMakeFiles/unit_tests.dir/serialization.cpp.o
[ 94%] Building CXX object tests/unit_tests/CMakeFiles/unit_tests.dir/sha256.cpp.o
[ 94%] Building CXX object tests/unit_tests/CMakeFiles/unit_tests.dir/slow_memmem.cpp.o
[ 94%] Building CXX object tests/unit_tests/CMakeFiles/unit_tests.dir/subaddress.cpp.o
[ 94%] Building CXX object tests/unit_tests/CMakeFiles/unit_tests.dir/test_tx_utils.cpp.o
[ 94%] Building CXX object tests/unit_tests/CMakeFiles/unit_tests.dir/test_peerlist.cpp.o
[ 95%] Building CXX object tests/unit_tests/CMakeFiles/unit_tests.dir/test_protocol_pack.cpp.o
[ 95%] Building CXX object tests/unit_tests/CMakeFiles/unit_tests.dir/threadpool.cpp.o
[ 95%] Building CXX object tests/unit_tests/CMakeFiles/unit_tests.dir/hardfork.cpp.o
[ 95%] Building CXX object tests/unit_tests/CMakeFiles/unit_tests.dir/unbound.cpp.o
[ 96%] Building CXX object tests/unit_tests/CMakeFiles/unit_tests.dir/uri.cpp.o
[ 96%] Building CXX object tests/unit_tests/CMakeFiles/unit_tests.dir/varint.cpp.o
[ 96%] Building CXX object tests/unit_tests/CMakeFiles/unit_tests.dir/ringct.cpp.o
[ 96%] Building CXX object tests/unit_tests/CMakeFiles/unit_tests.dir/output_selection.cpp.o
[ 96%] Building CXX object tests/unit_tests/CMakeFiles/unit_tests.dir/vercmp.cpp.o
[ 97%] Building CXX object tests/unit_tests/CMakeFiles/unit_tests.dir/ringdb.cpp.o
[ 97%] Building CXX object tests/unit_tests/CMakeFiles/unit_tests.dir/wipeable_string.cpp.o
[ 97%] Building CXX object tests/unit_tests/CMakeFiles/unit_tests.dir/is_hdd.cpp.o
[ 97%] Building CXX object tests/unit_tests/CMakeFiles/unit_tests.dir/aligned.cpp.o
[ 97%] Linking CXX executable unit_tests
make[3]: Leaving directory '/home/vagrant/slave/monero-debug-static-ubuntu-amd64/build/build/debug'
[ 97%] Built target unit_tests
make[3]: Entering directory '/home/vagrant/slave/monero-debug-static-ubuntu-amd64/build/build/debug'
Scanning dependencies of target test_notifier
make[3]: Leaving directory '/home/vagrant/slave/monero-debug-static-ubuntu-amd64/build/build/debug'
make[3]: Entering directory '/home/vagrant/slave/monero-debug-static-ubuntu-amd64/build/build/debug'
[ 97%] Building CXX object tests/unit_tests/CMakeFiles/test_notifier.dir/test_notifier.cpp.o
[ 97%] Linking CXX executable test_notifier
make[3]: Leaving directory '/home/vagrant/slave/monero-debug-static-ubuntu-amd64/build/build/debug'
[ 97%] Built target test_notifier
make[3]: Entering directory '/home/vagrant/slave/monero-debug-static-ubuntu-amd64/build/build/debug'
Scanning dependencies of target difficulty-tests
make[3]: Leaving directory '/home/vagrant/slave/monero-debug-static-ubuntu-amd64/build/build/debug'
make[3]: Entering directory '/home/vagrant/slave/monero-debug-static-ubuntu-amd64/build/build/debug'
[ 97%] Building CXX object tests/difficulty/CMakeFiles/difficulty-tests.dir/difficulty.cpp.o
[ 98%] Linking CXX executable difficulty-tests
make[3]: Leaving directory '/home/vagrant/slave/monero-debug-static-ubuntu-amd64/build/build/debug'
[ 98%] Built target difficulty-tests
make[3]: Entering directory '/home/vagrant/slave/monero-debug-static-ubuntu-amd64/build/build/debug'
Scanning dependencies of target block_weight
make[3]: Leaving directory '/home/vagrant/slave/monero-debug-static-ubuntu-amd64/build/build/debug'
make[3]: Entering directory '/home/vagrant/slave/monero-debug-static-ubuntu-amd64/build/build/debug'
[ 98%] Building CXX object tests/block_weight/CMakeFiles/block_weight.dir/block_weight.cpp.o
[ 98%] Linking CXX executable block_weight
make[3]: Leaving directory '/home/vagrant/slave/monero-debug-static-ubuntu-amd64/build/build/debug'
[ 98%] Built target block_weight
make[3]: Entering directory '/home/vagrant/slave/monero-debug-static-ubuntu-amd64/build/build/debug'
Scanning dependencies of target hash-tests
make[3]: Leaving directory '/home/vagrant/slave/monero-debug-static-ubuntu-amd64/build/build/debug'
make[3]: Entering directory '/home/vagrant/slave/monero-debug-static-ubuntu-amd64/build/build/debug'
[ 98%] Building CXX object tests/hash/CMakeFiles/hash-tests.dir/main.cpp.o
[100%] Linking CXX executable hash-tests
make[3]: Leaving directory '/home/vagrant/slave/monero-debug-static-ubuntu-amd64/build/build/debug'
[100%] Built target hash-tests
make[3]: Entering directory '/home/vagrant/slave/monero-debug-static-ubuntu-amd64/build/build/debug'
Scanning dependencies of target net_load_tests_clt
make[3]: Leaving directory '/home/vagrant/slave/monero-debug-static-ubuntu-amd64/build/build/debug'
make[3]: Entering directory '/home/vagrant/slave/monero-debug-static-ubuntu-amd64/build/build/debug'
[100%] Building CXX object tests/net_load_tests/CMakeFiles/net_load_tests_clt.dir/clt.cpp.o
[100%] Linking CXX executable net_load_tests_clt
make[3]: Leaving directory '/home/vagrant/slave/monero-debug-static-ubuntu-amd64/build/build/debug'
[100%] Built target net_load_tests_clt
make[3]: Entering directory '/home/vagrant/slave/monero-debug-static-ubuntu-amd64/build/build/debug'
Scanning dependencies of target net_load_tests_srv
make[3]: Leaving directory '/home/vagrant/slave/monero-debug-static-ubuntu-amd64/build/build/debug'
make[3]: Entering directory '/home/vagrant/slave/monero-debug-static-ubuntu-amd64/build/build/debug'
[100%] Building CXX object tests/net_load_tests/CMakeFiles/net_load_tests_srv.dir/srv.cpp.o
[100%] Linking CXX executable net_load_tests_srv
make[3]: Leaving directory '/home/vagrant/slave/monero-debug-static-ubuntu-amd64/build/build/debug'
[100%] Built target net_load_tests_srv
make[2]: Leaving directory '/home/vagrant/slave/monero-debug-static-ubuntu-amd64/build/build/debug'
make[1]: Leaving directory '/home/vagrant/slave/monero-debug-static-ubuntu-amd64/build/build/debug'
program finished with exit code 0
elapsedTime=1930.470562